Hospital Service Area,Hospital County,Operating Certificate Number,Permanent Facility Id,Facility Name,Age Group,Zip Code - 3 digits,Gender,Race,Ethnicity,Length of Stay,Type of Admission,Patient Disposition,Discharge Year,CCS Diagnosis Code,CCS Diagnosis Description,CCS Procedure Code,CCS Procedure Description,APR DRG Code,APR DRG Description,APR MDC Code,APR MDC Description,APR Severity of Illness Code,APR Severity of Illness Description,APR Risk of Mortality,APR Medical Surgical Description,Payment Typology 1,Payment Typology 2,Payment Typology 3,Birth Weight,Abortion Edit Indicator,Emergency Department Indicator,Total Charges,Total Costs
New York City,Manhattan,7002053,001463,NYU Langone Hospitals,50 to 69,103,F,White,Not Span/Hispanic,1,Elective,Home or Self Care,2022,NEO058,Non-Hodgkin lymphoma,RES008,"LUNG, PLEURA, OR DIAPHRAGM RESECTION (OPEN AND THORACOSCOPIC)",680,"MAJOR O.R. PROCEDURES FOR LYMPHATIC, HEMATOPOIETIC OR OTHER NEOPLASMS",17,"MYELOPROLIFERATIVE DISEASES AND DISORDERS, AND POORLY DIFFERENTIATED NEOPLASM",2,Moderate,Moderate,Surgical,Blue Cross/Blue Shield,,,,,N,184187.51,28380.59
New York City,Manhattan,7002001,001438,Bellevue Hospital Center,70 or Older,114,F,Other Race,Unknown,9,Elective,Home w/ Home Health Services,2022,NEO021,Gastrointestinal cancers - all other types,URN008,NEPHRECTOMY AND URETERECTOMY,680,"MAJOR O.R. PROCEDURES FOR LYMPHATIC, HEMATOPOIETIC OR OTHER NEOPLASMS",17,"MYELOPROLIFERATIVE DISEASES AND DISORDERS, AND POORLY DIFFERENTIATED NEOPLASM",3,Major,Moderate,Surgical,Medicaid,,,,,N,161745.17,93017.06
New York City,Manhattan,7002053,001463,NYU Langone Hospitals,50 to 69,103,M,White,Not Span/Hispanic,6,Elective,Home or Self Care,2022,NEO073,Benign neoplasms,HEP005,PANCREATECTOMY,680,"MAJOR O.R. PROCEDURES FOR LYMPHATIC, HEMATOPOIETIC OR OTHER NEOPLASMS",17,"MYELOPROLIFERATIVE DISEASES AND DISORDERS, AND POORLY DIFFERENTIATED NEOPLASM",3,Major,Moderate,Surgical,Medicaid,,,,,N,223121.29,45904.80
New York City,Manhattan,7002053,001463,NYU Langone Hospitals,50 to 69,112,M,White,Not Span/Hispanic,1,Elective,Home or Self Care,2022,NEO072,Neoplasms of unspecified nature or uncertain behavior,CAR017,PERICARDIAL PROCEDURES,680,"MAJOR O.R. PROCEDURES FOR LYMPHATIC, HEMATOPOIETIC OR OTHER NEOPLASMS",17,"MYELOPROLIFERATIVE DISEASES AND DISORDERS, AND POORLY DIFFERENTIATED NEOPLASM",2,Moderate,Minor,Surgical,Blue Cross/Blue Shield,,,,,N,101439.69,16866.89
New York City,Manhattan,7002053,001463,NYU Langone Hospitals,30 to 49,OOS,M,White,Not Span/Hispanic,1,Elective,Home or Self Care,2022,NEO052,Endocrine system cancers - thymus,LYM004,THYMECTOMY,680,"MAJOR O.R. PROCEDURES FOR LYMPHATIC, HEMATOPOIETIC OR OTHER NEOPLASMS",17,"MYELOPROLIFERATIVE DISEASES AND DISORDERS, AND POORLY DIFFERENTIATED NEOPLASM",1,Minor,Minor,Surgical,Blue Cross/Blue Shield,,,,,N,133925.68,20961.78
New York City,Manhattan,7002053,001463,NYU Langone Hospitals,70 or Older,100,F,White,Not Span/Hispanic,6,Elective,Home or Self Care,2022,NEO066,Malignant neuroendocrine tumors,HEP005,PANCREATECTOMY,680,"MAJOR O.R. PROCEDURES FOR LYMPHATIC, HEMATOPOIETIC OR OTHER NEOPLASMS",17,"MYELOPROLIFERATIVE DISEASES AND DISORDERS, AND POORLY DIFFERENTIATED NEOPLASM",2,Moderate,Minor,Surgical,Medicare,Private Health Insurance,,,,N,166094.96,40222.14
New York City,Manhattan,7002054,001464,New York-Presbyterian Hospital - Columbia Presbyterian Center,30 to 49,100,F,Black/African American,Not Span/Hispanic,4,Elective,Home or Self Care,2022,NEO065,Multiple myeloma,MST010,FEMUR FIXATION,680,"MAJOR O.R. PROCEDURES FOR LYMPHATIC, HEMATOPOIETIC OR OTHER NEOPLASMS",17,"MYELOPROLIFERATIVE DISEASES AND DISORDERS, AND POORLY DIFFERENTIATED NEOPLASM",2,Moderate,Moderate,Surgical,Medicaid,,,,,N,114203.98,35061.87
New York City,Manhattan,7002054,001464,New York-Presbyterian Hospital - Columbia Presbyterian Center,50 to 69,113,F,White,Not Span/Hispanic,14,Emergency,Home w/ Home Health Services,2022,NEO058,Non-Hodgkin lymphoma,ADM001,TRANSFUSION OF BLOOD AND BLOOD PRODUCTS,680,"MAJOR O.R. PROCEDURES FOR LYMPHATIC, HEMATOPOIETIC OR OTHER NEOPLASMS",17,"MYELOPROLIFERATIVE DISEASES AND DISORDERS, AND POORLY DIFFERENTIATED NEOPLASM",3,Major,Moderate,Surgical,Medicaid,,,,,Y,235104.89,55346.90
New York City,Manhattan,7002053,001463,NYU Langone Hospitals,50 to 69,OOS,F,Other Race,Not Span/Hispanic,1,Elective,Home or Self Care,2022,MAL010,Other specified and unspecified congenital anomalies,RES008,"LUNG, PLEURA, OR DIAPHRAGM RESECTION (OPEN AND THORACOSCOPIC)",680,"MAJOR O.R. PROCEDURES FOR LYMPHATIC, HEMATOPOIETIC OR OTHER NEOPLASMS",17,"MYELOPROLIFERATIVE DISEASES AND DISORDERS, AND POORLY DIFFERENTIATED NEOPLASM",1,Minor,Minor,Surgical,Blue Cross/Blue Shield,,,,,N,128452.36,20341.29
New York City,Manhattan,7002053,001463,NYU Langone Hospitals,50 to 69,112,M,Other Race,Spanish/Hispanic,4,Elective,Home w/ Home Health Services,2022,NEO073,Benign neoplasms,LYM005,SPLENECTOMY,680,"MAJOR O.R. PROCEDURES FOR LYMPHATIC, HEMATOPOIETIC OR OTHER NEOPLASMS",17,"MYELOPROLIFERATIVE DISEASES AND DISORDERS, AND POORLY DIFFERENTIATED NEOPLASM",2,Moderate,Moderate,Surgical,Medicare,Medicaid,,,,N,250836.84,46471.83
New York City,Manhattan,7002053,001463,NYU Langone Hospitals,70 or Older,100,M,White,Not Span/Hispanic,1,Elective,Home or Self Care,2022,NEO052,Endocrine system cancers - thymus,LYM004,THYMECTOMY,680,"MAJOR O.R. PROCEDURES FOR LYMPHATIC, HEMATOPOIETIC OR OTHER NEOPLASMS",17,"MYELOPROLIFERATIVE DISEASES AND DISORDERS, AND POORLY DIFFERENTIATED NEOPLASM",1,Minor,Minor,Surgical,Medicare,Medicare,,,,N,101199.29,16990.49
New York City,Manhattan,7002053,001463,NYU Langone Hospitals,30 to 49,113,M,Other Race,Spanish/Hispanic,3,Elective,Expired,2022,FAC006,Encounter for antineoplastic therapies,CNS005,VENTRICULOSTOMY [PERCUTANEOUS APPROACH],680,"MAJOR O.R. PROCEDURES FOR LYMPHATIC, HEMATOPOIETIC OR OTHER NEOPLASMS",17,"MYELOPROLIFERATIVE DISEASES AND DISORDERS, AND POORLY DIFFERENTIATED NEOPLASM",4,Extreme,Extreme,Surgical,Medicaid,,,,,N,124750.35,22869.28
New York City,Manhattan,7002053,001463,NYU Langone Hospitals,50 to 69,115,M,White,Not Span/Hispanic,10,Elective,Home w/ Home Health Services,2022,NEO021,Gastrointestinal cancers - all other types,LYM005,SPLENECTOMY,680,"MAJOR O.R. PROCEDURES FOR LYMPHATIC, HEMATOPOIETIC OR OTHER NEOPLASMS",17,"MYELOPROLIFERATIVE DISEASES AND DISORDERS, AND POORLY DIFFERENTIATED NEOPLASM",3,Major,Major,Surgical,Medicare,Medicare,,,,Y,432087.45,94355.57
Finger Lakes,Monroe,2701005,000413,Strong Memorial Hospital,50 to 69,146,M,Black/African American,Not Span/Hispanic,3,Elective,Home w/ Home Health Services,2022,NEO066,Malignant neuroendocrine tumors,HEP004,HEPATOBILIARY RESECTION AND ABLATION,680,"MAJOR O.R. PROCEDURES FOR LYMPHATIC, HEMATOPOIETIC OR OTHER NEOPLASMS",17,"MYELOPROLIFERATIVE DISEASES AND DISORDERS, AND POORLY DIFFERENTIATED NEOPLASM",2,Moderate,Moderate,Surgical,Blue Cross/Blue Shield,,,,,N,42412.26,20092.45
New York City,Manhattan,7002054,001464,New York-Presbyterian Hospital - Columbia Presbyterian Center,50 to 69,100,F,Other Race,Spanish/Hispanic,3,Elective,Home or Self Care,2022,NEO066,Malignant neuroendocrine tumors,FRS002,OOPHORECTOMY,680,"MAJOR O.R. PROCEDURES FOR LYMPHATIC, HEMATOPOIETIC OR OTHER NEOPLASMS",17,"MYELOPROLIFERATIVE DISEASES AND DISORDERS, AND POORLY DIFFERENTIATED NEOPLASM",2,Moderate,Moderate,Surgical,Medicaid,,,,,N,107121.51,29564.79
New York City,Manhattan,7002054,001464,New York-Presbyterian Hospital - Columbia Presbyterian Center,50 to 69,109,F,Other Race,Not Span/Hispanic,4,Elective,Home or Self Care,2022,NEO073,Benign neoplasms,HEP006,CHOLECYSTECTOMY,680,"MAJOR O.R. PROCEDURES FOR LYMPHATIC, HEMATOPOIETIC OR OTHER NEOPLASMS",17,"MYELOPROLIFERATIVE DISEASES AND DISORDERS, AND POORLY DIFFERENTIATED NEOPLASM",2,Moderate,Minor,Surgical,Private Health Insurance,,,,,N,158844.60,58943.75
New York City,Manhattan,7002001,001438,Bellevue Hospital Center,50 to 69,104,M,Other Race,Spanish/Hispanic,21,Emergency,Home w/ Home Health Services,2022,NEO021,Gastrointestinal cancers - all other types,GIS018,ILEOSTOMY AND COLOSTOMY,680,"MAJOR O.R. PROCEDURES FOR LYMPHATIC, HEMATOPOIETIC OR OTHER NEOPLASMS",17,"MYELOPROLIFERATIVE DISEASES AND DISORDERS, AND POORLY DIFFERENTIATED NEOPLASM",2,Moderate,Moderate,Surgical,Medicaid,,,,,Y,294705.64,169480.50
New York City,Manhattan,7002054,001464,New York-Presbyterian Hospital - Columbia Presbyterian Center,30 to 49,104,F,Other Race,Spanish/Hispanic,3,Elective,Home or Self Care,2022,NEO073,Benign neoplasms,HEP005,PANCREATECTOMY,680,"MAJOR O.R. PROCEDURES FOR LYMPHATIC, HEMATOPOIETIC OR OTHER NEOPLASMS",17,"MYELOPROLIFERATIVE DISEASES AND DISORDERS, AND POORLY DIFFERENTIATED NEOPLASM",2,Moderate,Minor,Surgical,Private Health Insurance,,,,,N,85834.28,22217.21
New York City,Manhattan,7002054,001464,New York-Presbyterian Hospital - Columbia Presbyterian Center,30 to 49,OOS,F,Other Race,Unknown,6,Elective,Home or Self Care,2022,NEO052,Endocrine system cancers - thymus,GNR006,"CHEST WALL PROCEDURES, NEC",680,"MAJOR O.R. PROCEDURES FOR LYMPHATIC, HEMATOPOIETIC OR OTHER NEOPLASMS",17,"MYELOPROLIFERATIVE DISEASES AND DISORDERS, AND POORLY DIFFERENTIATED NEOPLASM",2,Moderate,Moderate,Surgical,Private Health Insurance,,,,,N,227850.92,93770.95
New York City,Manhattan,7002054,001464,New York-Presbyterian Hospital - Columbia Presbyterian Center,30 to 49,OOS,M,Other Race,Unknown,24,Emergency,Inpatient Rehabilitation Facility,2022,NEO058,Non-Hodgkin lymphoma,CNS007,CNS EXCISION PROCEDURES,680,"MAJOR O.R. PROCEDURES FOR LYMPHATIC, HEMATOPOIETIC OR OTHER NEOPLASMS",17,"MYELOPROLIFERATIVE DISEASES AND DISORDERS, AND POORLY DIFFERENTIATED NEOPLASM",4,Extreme,Extreme,Surgical,Private Health Insurance,,,,,Y,657522.87,211485.77
Long Island,Nassau,2951001,000541,North Shore University Hospital,50 to 69,114,M,Black/African American,Not Span/Hispanic,22,Emergency,Short-term Hospital,2022,NEO065,Multiple myeloma,MST010,FEMUR FIXATION,680,"MAJOR O.R. PROCEDURES FOR LYMPHATIC, HEMATOPOIETIC OR OTHER NEOPLASMS",17,"MYELOPROLIFERATIVE DISEASES AND DISORDERS, AND POORLY DIFFERENTIATED NEOPLASM",2,Moderate,Minor,Surgical,Blue Cross/Blue Shield,,,,,Y,398060.55,68754.35
Long Island,Nassau,2951001,000541,North Shore University Hospital,30 to 49,114,M,Black/African American,Not Span/Hispanic,13,Urgent,Home w/ Home Health Services,2022,NEO065,Multiple myeloma,CNS008,SPINAL CORD DECOMPRESSION,680,"MAJOR O.R. PROCEDURES FOR LYMPHATIC, HEMATOPOIETIC OR OTHER NEOPLASMS",17,"MYELOPROLIFERATIVE DISEASES AND DISORDERS, AND POORLY DIFFERENTIATED NEOPLASM",3,Major,Major,Surgical,Private Health Insurance,,,,,N,443526.26,77551.03
Finger Lakes,Monroe,2701005,000413,Strong Memorial Hospital,70 or Older,146,M,White,Not Span/Hispanic,24,Urgent,Home w/ Home Health Services,2022,FAC006,Encounter for antineoplastic therapies,MST029,"MUSCULOSKELETAL DEVICE PROCEDURES, NEC",680,"MAJOR O.R. PROCEDURES FOR LYMPHATIC, HEMATOPOIETIC OR OTHER NEOPLASMS",17,"MYELOPROLIFERATIVE DISEASES AND DISORDERS, AND POORLY DIFFERENTIATED NEOPLASM",2,Moderate,Major,Surgical,Medicare,,,,,N,139008.71,60806.36
New York City,Manhattan,7002053,001463,NYU Langone Hospitals,30 to 49,100,F,White,Not Span/Hispanic,5,Elective,Home or Self Care,2022,NEO070,Secondary malignancies,FRS005,FALLOPIAN TUBE LIGATION AND EXCISION,680,"MAJOR O.R. PROCEDURES FOR LYMPHATIC, HEMATOPOIETIC OR OTHER NEOPLASMS",17,"MYELOPROLIFERATIVE DISEASES AND DISORDERS, AND POORLY DIFFERENTIATED NEOPLASM",3,Major,Moderate,Surgical,Private Health Insurance,,,,,N,200496.38,41740.78
New York City,Manhattan,7002053,001463,NYU Langone Hospitals,50 to 69,104,M,White,Not Span/Hispanic,3,Elective,Home or Self Care,2022,NEO066,Malignant neuroendocrine tumors,HEP005,PANCREATECTOMY,680,"MAJOR O.R. PROCEDURES FOR LYMPHATIC, HEMATOPOIETIC OR OTHER NEOPLASMS",17,"MYELOPROLIFERATIVE DISEASES AND DISORDERS, AND POORLY DIFFERENTIATED NEOPLASM",3,Major,Moderate,Surgical,Blue Cross/Blue Shield,,,,,N,203356.74,37008.22
New York City,Manhattan,7002054,001464,New York-Presbyterian Hospital - Columbia Presbyterian Center,50 to 69,OOS,F,Other Race,Spanish/Hispanic,4,Elective,Home w/ Home Health Services,2022,NEO052,Endocrine system cancers - thymus,LYM004,THYMECTOMY,680,"MAJOR O.R. PROCEDURES FOR LYMPHATIC, HEMATOPOIETIC OR OTHER NEOPLASMS",17,"MYELOPROLIFERATIVE DISEASES AND DISORDERS, AND POORLY DIFFERENTIATED NEOPLASM",1,Minor,Minor,Surgical,Medicare,Private Health Insurance,Medicaid,,,N,121462.01,51243.34
New York City,Manhattan,7002053,001463,NYU Langone Hospitals,30 to 49,112,F,Other Race,Not Span/Hispanic,7,Elective,Home or Self Care,2022,NEO073,Benign neoplasms,HEP005,PANCREATECTOMY,680,"MAJOR O.R. PROCEDURES FOR LYMPHATIC, HEMATOPOIETIC OR OTHER NEOPLASMS",17,"MYELOPROLIFERATIVE DISEASES AND DISORDERS, AND POORLY DIFFERENTIATED NEOPLASM",2,Moderate,Moderate,Surgical,Medicaid,,,,,N,186236.58,47984.44
Finger Lakes,Monroe,2701005,000413,Strong Memorial Hospital,30 to 49,146,F,Black/African American,Not Span/Hispanic,7,Elective,Home or Self Care,2022,NEO066,Malignant neuroendocrine tumors,GIS010,GASTRECTOMY,680,"MAJOR O.R. PROCEDURES FOR LYMPHATIC, HEMATOPOIETIC OR OTHER NEOPLASMS",17,"MYELOPROLIFERATIVE DISEASES AND DISORDERS, AND POORLY DIFFERENTIATED NEOPLASM",2,Moderate,Minor,Surgical,Federal/State/Local/VA,,,,,N,76694.91,39014.19
Finger Lakes,Monroe,2701005,000413,Strong Memorial Hospital,50 to 69,145,M,Multi-racial,Not Span/Hispanic,3,Elective,Home w/ Home Health Services,2022,NEO070,Secondary malignancies,GNR006,"CHEST WALL PROCEDURES, NEC",680,"MAJOR O.R. PROCEDURES FOR LYMPHATIC, HEMATOPOIETIC OR OTHER NEOPLASMS",17,"MYELOPROLIFERATIVE DISEASES AND DISORDERS, AND POORLY DIFFERENTIATED NEOPLASM",2,Moderate,Minor,Surgical,Blue Cross/Blue Shield,,,,,N,49203.03,22447.48
Finger Lakes,Monroe,2701005,000413,Strong Memorial Hospital,50 to 69,146,F,Other Race,Not Span/Hispanic,4,Elective,Home w/ Home Health Services,2022,NEO073,Benign neoplasms,GIS009,COLECTOMY,680,"MAJOR O.R. PROCEDURES FOR LYMPHATIC, HEMATOPOIETIC OR OTHER NEOPLASMS",17,"MYELOPROLIFERATIVE DISEASES AND DISORDERS, AND POORLY DIFFERENTIATED NEOPLASM",1,Minor,Moderate,Surgical,Medicaid,,,,,N,39966.49,20115.17
New York City,Manhattan,7002001,001438,Bellevue Hospital Center,50 to 69,112,F,Black/African American,Not Span/Hispanic,1,Elective,Home or Self Care,2022,NEO070,Secondary malignancies,LYM002,LYMPH NODE EXCISION (THERAPEUTIC),680,"MAJOR O.R. PROCEDURES FOR LYMPHATIC, HEMATOPOIETIC OR OTHER NEOPLASMS",17,"MYELOPROLIFERATIVE DISEASES AND DISORDERS, AND POORLY DIFFERENTIATED NEOPLASM",2,Moderate,Moderate,Surgical,Self-Pay,,,,,N,44870.49,25804.30
Long Island,Nassau,2951001,000541,North Shore University Hospital,50 to 69,113,M,White,Not Span/Hispanic,39,Emergency,Home w/ Home Health Services,2022,NEO057,Hodgkin lymphoma,LYM005,SPLENECTOMY,680,"MAJOR O.R. PROCEDURES FOR LYMPHATIC, HEMATOPOIETIC OR OTHER NEOPLASMS",17,"MYELOPROLIFERATIVE DISEASES AND DISORDERS, AND POORLY DIFFERENTIATED NEOPLASM",4,Extreme,Extreme,Surgical,Private Health Insurance,Medicare,,,,Y,981598.97,185479.89
Finger Lakes,Monroe,2701005,000413,Strong Memorial Hospital,70 or Older,131,F,White,Not Span/Hispanic,2,Elective,Home or Self Care,2022,NEO058,Non-Hodgkin lymphoma,LYM005,SPLENECTOMY,680,"MAJOR O.R. PROCEDURES FOR LYMPHATIC, HEMATOPOIETIC OR OTHER NEOPLASMS",17,"MYELOPROLIFERATIVE DISEASES AND DISORDERS, AND POORLY DIFFERENTIATED NEOPLASM",2,Moderate,Moderate,Surgical,Medicare,,,,,N,24157.75,11766.08
Hudson Valley,Dutchess,1302001,000181,Vassar Brothers Medical Center,70 or Older,124,M,White,Not Span/Hispanic,12,Urgent,Inpatient Rehabilitation Facility,2022,NEO058,Non-Hodgkin lymphoma,CNS007,CNS EXCISION PROCEDURES,680,"MAJOR O.R. PROCEDURES FOR LYMPHATIC, HEMATOPOIETIC OR OTHER NEOPLASMS",17,"MYELOPROLIFERATIVE DISEASES AND DISORDERS, AND POORLY DIFFERENTIATED NEOPLASM",4,Extreme,Extreme,Surgical,Medicare,Miscellaneous/Other,Private Health Insurance,,,N,103527.76,34886.21
New York City,Manhattan,7002054,001464,New York-Presbyterian Hospital - Columbia Presbyterian Center,50 to 69,103,M,White,Not Span/Hispanic,6,Elective,Home or Self Care,2022,NEO073,Benign neoplasms,LYM005,SPLENECTOMY,680,"MAJOR O.R. PROCEDURES FOR LYMPHATIC, HEMATOPOIETIC OR OTHER NEOPLASMS",17,"MYELOPROLIFERATIVE DISEASES AND DISORDERS, AND POORLY DIFFERENTIATED NEOPLASM",2,Moderate,Minor,Surgical,Private Health Insurance,,,,,N,158742.22,40931.81
New York City,Manhattan,7002054,001464,New York-Presbyterian Hospital - Columbia Presbyterian Center,70 or Older,OOS,F,White,Not Span/Hispanic,2,Elective,Home w/ Home Health Services,2022,NEO052,Endocrine system cancers - thymus,LYM004,THYMECTOMY,680,"MAJOR O.R. PROCEDURES FOR LYMPHATIC, HEMATOPOIETIC OR OTHER NEOPLASMS",17,"MYELOPROLIFERATIVE DISEASES AND DISORDERS, AND POORLY DIFFERENTIATED NEOPLASM",2,Moderate,Moderate,Surgical,Medicare,,,,,N,95969.73,25667.05
New York City,Manhattan,7002054,001464,New York-Presbyterian Hospital - Columbia Presbyterian Center,0 to 17,104,M,Other Race,Spanish/Hispanic,64,Elective,Expired,2022,NEO060,Leukemia - acute myeloid leukemia (AML),LYM007,BONE MARROW BIOPSY,680,"MAJOR O.R. PROCEDURES FOR LYMPHATIC, HEMATOPOIETIC OR OTHER NEOPLASMS",17,"MYELOPROLIFERATIVE DISEASES AND DISORDERS, AND POORLY DIFFERENTIATED NEOPLASM",4,Extreme,Extreme,Surgical,Medicaid,,,,,N,1653736.71,506826.24
New York City,Manhattan,7002001,001438,Bellevue Hospital Center,50 to 69,113,M,Other Race,Spanish/Hispanic,7,Emergency,Home or Self Care,2022,NEO058,Non-Hodgkin lymphoma,GIS011,SMALL BOWEL RESECTION,680,"MAJOR O.R. PROCEDURES FOR LYMPHATIC, HEMATOPOIETIC OR OTHER NEOPLASMS",17,"MYELOPROLIFERATIVE DISEASES AND DISORDERS, AND POORLY DIFFERENTIATED NEOPLASM",4,Extreme,Major,Surgical,Medicaid,,,,,Y,90765.21,52197.62
New York City,Manhattan,7002001,001438,Bellevue Hospital Center,30 to 49,113,M,Other Race,Spanish/Hispanic,43,Emergency,Home or Self Care,2022,NEO060,Leukemia - acute myeloid leukemia (AML),ADM012,CHEMOTHERAPY,680,"MAJOR O.R. PROCEDURES FOR LYMPHATIC, HEMATOPOIETIC OR OTHER NEOPLASMS",17,"MYELOPROLIFERATIVE DISEASES AND DISORDERS, AND POORLY DIFFERENTIATED NEOPLASM",4,Extreme,Extreme,Surgical,Medicaid,,,,,Y,614186.88,353209.05
Finger Lakes,Monroe,2701005,000413,Strong Memorial Hospital,70 or Older,144,M,White,Not Span/Hispanic,72,Urgent,Hospice - Medical Facility,2022,NEO058,Non-Hodgkin lymphoma,CNS008,SPINAL CORD DECOMPRESSION,680,"MAJOR O.R. PROCEDURES FOR LYMPHATIC, HEMATOPOIETIC OR OTHER NEOPLASMS",17,"MYELOPROLIFERATIVE DISEASES AND DISORDERS, AND POORLY DIFFERENTIATED NEOPLASM",4,Extreme,Major,Surgical,Medicare,Blue Cross/Blue Shield,,,,N,263496.20,127061.63
Finger Lakes,Monroe,2701005,000413,Strong Memorial Hospital,30 to 49,146,F,White,Not Span/Hispanic,4,Elective,Home or Self Care,2022,NEO066,Malignant neuroendocrine tumors,HEP005,PANCREATECTOMY,680,"MAJOR O.R. PROCEDURES FOR LYMPHATIC, HEMATOPOIETIC OR OTHER NEOPLASMS",17,"MYELOPROLIFERATIVE DISEASES AND DISORDERS, AND POORLY DIFFERENTIATED NEOPLASM",2,Moderate,Minor,Surgical,Medicaid,,,,,N,68505.93,33407.71
Finger Lakes,Monroe,2701005,000413,Strong Memorial Hospital,30 to 49,144,M,White,Unknown,1,Elective,Home or Self Care,2022,NEO073,Benign neoplasms,GIS009,COLECTOMY,680,"MAJOR O.R. PROCEDURES FOR LYMPHATIC, HEMATOPOIETIC OR OTHER NEOPLASMS",17,"MYELOPROLIFERATIVE DISEASES AND DISORDERS, AND POORLY DIFFERENTIATED NEOPLASM",1,Minor,Minor,Surgical,Blue Cross/Blue Shield,,,,,N,36038.33,17305.81
New York City,Manhattan,7002001,001438,Bellevue Hospital Center,50 to 69,100,F,White,Unknown,26,Emergency,Skilled Nursing Home,2022,NEO058,Non-Hodgkin lymphoma,MST010,FEMUR FIXATION,680,"MAJOR O.R. PROCEDURES FOR LYMPHATIC, HEMATOPOIETIC OR OTHER NEOPLASMS",17,"MYELOPROLIFERATIVE DISEASES AND DISORDERS, AND POORLY DIFFERENTIATED NEOPLASM",4,Extreme,Extreme,Surgical,Private Health Insurance,,,,,Y,229273.40,131851.46
New York City,Manhattan,7002054,001464,New York-Presbyterian Hospital - Columbia Presbyterian Center,50 to 69,105,F,White,Not Span/Hispanic,2,Elective,Home or Self Care,2022,NEO058,Non-Hodgkin lymphoma,CNS007,CNS EXCISION PROCEDURES,680,"MAJOR O.R. PROCEDURES FOR LYMPHATIC, HEMATOPOIETIC OR OTHER NEOPLASMS",17,"MYELOPROLIFERATIVE DISEASES AND DISORDERS, AND POORLY DIFFERENTIATED NEOPLASM",2,Moderate,Moderate,Surgical,Medicare,Private Health Insurance,,,,N,102919.93,34199.63
New York City,Manhattan,7002054,001464,New York-Presbyterian Hospital - Columbia Presbyterian Center,70 or Older,105,F,White,Not Span/Hispanic,2,Elective,Home or Self Care,2022,NEO058,Non-Hodgkin lymphoma,CNS007,CNS EXCISION PROCEDURES,680,"MAJOR O.R. PROCEDURES FOR LYMPHATIC, HEMATOPOIETIC OR OTHER NEOPLASMS",17,"MYELOPROLIFERATIVE DISEASES AND DISORDERS, AND POORLY DIFFERENTIATED NEOPLASM",3,Major,Major,Surgical,Medicare,Private Health Insurance,,,,N,80945.21,30095.25
New York City,Manhattan,7002054,001464,New York-Presbyterian Hospital - Columbia Presbyterian Center,50 to 69,109,M,White,Not Span/Hispanic,3,Elective,Home or Self Care,2022,NEO066,Malignant neuroendocrine tumors,LYM005,SPLENECTOMY,680,"MAJOR O.R. PROCEDURES FOR LYMPHATIC, HEMATOPOIETIC OR OTHER NEOPLASMS",17,"MYELOPROLIFERATIVE DISEASES AND DISORDERS, AND POORLY DIFFERENTIATED NEOPLASM",2,Moderate,Moderate,Surgical,Blue Cross/Blue Shield,,,,,N,87600.00,24499.25
Long Island,Nassau,2951001,000541,North Shore University Hospital,50 to 69,113,M,Black/African American,Not Span/Hispanic,5,Urgent,Inpatient Rehabilitation Facility,2022,NEO065,Multiple myeloma,CNS008,SPINAL CORD DECOMPRESSION,680,"MAJOR O.R. PROCEDURES FOR LYMPHATIC, HEMATOPOIETIC OR OTHER NEOPLASMS",17,"MYELOPROLIFERATIVE DISEASES AND DISORDERS, AND POORLY DIFFERENTIATED NEOPLASM",2,Moderate,Minor,Surgical,Private Health Insurance,,,,,N,151288.37,29950.75
New York City,Manhattan,7002054,001464,New York-Presbyterian Hospital - Columbia Presbyterian Center,70 or Older,100,M,Black/African American,Not Span/Hispanic,19,Emergency,Inpatient Rehabilitation Facility,2022,NEO065,Multiple myeloma,MST013,SPINE FUSION,680,"MAJOR O.R. PROCEDURES FOR LYMPHATIC, HEMATOPOIETIC OR OTHER NEOPLASMS",17,"MYELOPROLIFERATIVE DISEASES AND DISORDERS, AND POORLY DIFFERENTIATED NEOPLASM",3,Major,Major,Surgical,Medicare,,,,,Y,479037.89,146820.70
New York City,Manhattan,7002053,001463,NYU Langone Hospitals,50 to 69,113,M,Other Race,Not Span/Hispanic,6,Emergency,Home w/ Home Health Services,2022,NEO058,Non-Hodgkin lymphoma,GIS011,SMALL BOWEL RESECTION,680,"MAJOR O.R. PROCEDURES FOR LYMPHATIC, HEMATOPOIETIC OR OTHER NEOPLASMS",17,"MYELOPROLIFERATIVE DISEASES AND DISORDERS, AND POORLY DIFFERENTIATED NEOPLASM",3,Major,Moderate,Surgical,Medicare,,,,,Y,271924.81,54042.64
New York City,Manhattan,7002053,001463,NYU Langone Hospitals,30 to 49,111,M,White,Not Span/Hispanic,3,Elective,Home or Self Care,2022,NEO052,Endocrine system cancers - thymus,LYM004,THYMECTOMY,680,"MAJOR O.R. PROCEDURES FOR LYMPHATIC, HEMATOPOIETIC OR OTHER NEOPLASMS",17,"MYELOPROLIFERATIVE DISEASES AND DISORDERS, AND POORLY DIFFERENTIATED NEOPLASM",2,Moderate,Moderate,Surgical,Private Health Insurance,,,,,N,248769.54,42779.58
New York City,Manhattan,7002053,001463,NYU Langone Hospitals,50 to 69,105,M,White,Not Span/Hispanic,4,Elective,Home or Self Care,2022,NEO021,Gastrointestinal cancers - all other types,GIS015,OMENTECTOMY OR PERITONEUM RESECTION,680,"MAJOR O.R. PROCEDURES FOR LYMPHATIC, HEMATOPOIETIC OR OTHER NEOPLASMS",17,"MYELOPROLIFERATIVE DISEASES AND DISORDERS, AND POORLY DIFFERENTIATED NEOPLASM",2,Moderate,Minor,Surgical,Private Health Insurance,,,,,N,130301.38,29647.23