Hospital Service Area,Hospital County,Operating Certificate Number,Permanent Facility Id,Facility Name,Age Group,Zip Code - 3 digits,Gender,Race,Ethnicity,Length of Stay,Type of Admission,Patient Disposition,Discharge Year,CCS Diagnosis Code,CCS Diagnosis Description,CCS Procedure Code,CCS Procedure Description,APR DRG Code,APR DRG Description,APR MDC Code,APR MDC Description,APR Severity of Illness Code,APR Severity of Illness Description,APR Risk of Mortality,APR Medical Surgical Description,Payment Typology 1,Payment Typology 2,Payment Typology 3,Birth Weight,Abortion Edit Indicator,Emergency Department Indicator,Total Charges,Total Costs
New York City,Manhattan,7002054,001464,New York-Presbyterian Hospital - Columbia Presbyterian Center,50 to 69,100,F,White,Not Span/Hispanic,23,Emergency,Skilled Nursing Home,2022,INF002,Septicemia,GIS018,ILEOSTOMY AND COLOSTOMY,710,INFECTIOUS AND PARASITIC DISEASES INCLUDING HIV WITH O.R. PROCEDURE,18,INFECTIOUS AND PARASITIC DISEASES (SYSTEMIC OR UNSPECIFIED SITES),3,Major,Major,Surgical,Private Health Insurance,,,,,Y,363280.35,82178.42
New York City,Manhattan,7002054,001464,New York-Presbyterian Hospital - Columbia Presbyterian Center,18 to 29,100,F,Other Race,Spanish/Hispanic,3,Emergency,Home or Self Care,2022,INF002,Septicemia,MST004,INCISION AND DRAINAGE OF MUSCULOSKELETAL TISSUE AND JOINTS,710,INFECTIOUS AND PARASITIC DISEASES INCLUDING HIV WITH O.R. PROCEDURE,18,INFECTIOUS AND PARASITIC DISEASES (SYSTEMIC OR UNSPECIFIED SITES),3,Major,Major,Surgical,Medicaid,,,,,Y,50884.86,12062.22
New York City,Manhattan,7002054,001464,New York-Presbyterian Hospital - Columbia Presbyterian Center,50 to 69,104,F,White,Not Span/Hispanic,8,Emergency,Home w/ Home Health Services,2022,INF002,Septicemia,MST019,"MUSCLE, TENDON, BURSA, AND LIGAMENT EXCISION",710,INFECTIOUS AND PARASITIC DISEASES INCLUDING HIV WITH O.R. PROCEDURE,18,INFECTIOUS AND PARASITIC DISEASES (SYSTEMIC OR UNSPECIFIED SITES),4,Extreme,Major,Surgical,Private Health Insurance,Private Health Insurance,,,,Y,165852.54,57060.97
New York City,Manhattan,7002054,001464,New York-Presbyterian Hospital - Columbia Presbyterian Center,70 or Older,113,F,White,Not Span/Hispanic,29,Emergency,Skilled Nursing Home,2022,INF002,Septicemia,MST018,BONE EXCISION,710,INFECTIOUS AND PARASITIC DISEASES INCLUDING HIV WITH O.R. PROCEDURE,18,INFECTIOUS AND PARASITIC DISEASES (SYSTEMIC OR UNSPECIFIED SITES),4,Extreme,Major,Surgical,Medicare,Medicaid,,,,Y,388100.74,84897.95
New York City,Manhattan,7002054,001464,New York-Presbyterian Hospital - Columbia Presbyterian Center,30 to 49,104,M,Black/African American,Not Span/Hispanic,34,Emergency,Home w/ Home Health Services,2022,INF002,Septicemia,ADM015,ADMINISTRATION OF ANTIBIOTICS,710,INFECTIOUS AND PARASITIC DISEASES INCLUDING HIV WITH O.R. PROCEDURE,18,INFECTIOUS AND PARASITIC DISEASES (SYSTEMIC OR UNSPECIFIED SITES),4,Extreme,Extreme,Surgical,Private Health Insurance,Blue Cross/Blue Shield,,,,Y,535076.48,118965.63
New York City,Manhattan,7002001,001438,Bellevue Hospital Center,30 to 49,104,M,Other Race,Spanish/Hispanic,9,Urgent,Expired,2022,INF002,Septicemia,ADM015,ADMINISTRATION OF ANTIBIOTICS,710,INFECTIOUS AND PARASITIC DISEASES INCLUDING HIV WITH O.R. PROCEDURE,18,INFECTIOUS AND PARASITIC DISEASES (SYSTEMIC OR UNSPECIFIED SITES),4,Extreme,Extreme,Surgical,Medicaid,,,,,N,267246.16,153688.99
New York City,Manhattan,7002054,001464,New York-Presbyterian Hospital - Columbia Presbyterian Center,50 to 69,104,F,Black/African American,Not Span/Hispanic,14,Emergency,Skilled Nursing Home,2022,INF002,Septicemia,MST024,BELOW KNEE AMPUTATION,710,INFECTIOUS AND PARASITIC DISEASES INCLUDING HIV WITH O.R. PROCEDURE,18,INFECTIOUS AND PARASITIC DISEASES (SYSTEMIC OR UNSPECIFIED SITES),3,Major,Major,Surgical,Medicare,Medicaid,,,,Y,370360.67,163363.22
New York City,Manhattan,7002054,001464,New York-Presbyterian Hospital - Columbia Presbyterian Center,50 to 69,125,F,Other Race,Not Span/Hispanic,56,Emergency,Home w/ Home Health Services,2022,INF002,Septicemia,CAR003,CORONARY ARTERY BYPASS GRAFTS (CABG),710,INFECTIOUS AND PARASITIC DISEASES INCLUDING HIV WITH O.R. PROCEDURE,18,INFECTIOUS AND PARASITIC DISEASES (SYSTEMIC OR UNSPECIFIED SITES),4,Extreme,Extreme,Surgical,Private Health Insurance,Medicare,,,,Y,1443417.72,617697.18
New York City,Manhattan,7002001,001438,Bellevue Hospital Center,50 to 69,112,F,White,Unknown,17,Urgent,Home or Self Care,2022,INF002,Septicemia,ADM019,POTENTIAL COVID-19 THERAPIES,710,INFECTIOUS AND PARASITIC DISEASES INCLUDING HIV WITH O.R. PROCEDURE,18,INFECTIOUS AND PARASITIC DISEASES (SYSTEMIC OR UNSPECIFIED SITES),4,Extreme,Extreme,Surgical,Medicare,Medicaid,,,,N,225057.26,129426.83
New York City,Manhattan,7002001,001438,Bellevue Hospital Center,50 to 69,100,M,Other Race,Unknown,23,Emergency,Skilled Nursing Home,2022,INF002,Septicemia,MST024,BELOW KNEE AMPUTATION,710,INFECTIOUS AND PARASITIC DISEASES INCLUDING HIV WITH O.R. PROCEDURE,18,INFECTIOUS AND PARASITIC DISEASES (SYSTEMIC OR UNSPECIFIED SITES),4,Extreme,Extreme,Surgical,Medicare,Medicaid,,,,Y,238855.24,137361.83
New York City,Manhattan,7002054,001464,New York-Presbyterian Hospital - Columbia Presbyterian Center,50 to 69,109,M,White,Not Span/Hispanic,18,Urgent,Expired,2022,INF002,Septicemia,CAR026,PACEMAKER AND DEFIBRILLATOR PROCEDURES,710,INFECTIOUS AND PARASITIC DISEASES INCLUDING HIV WITH O.R. PROCEDURE,18,INFECTIOUS AND PARASITIC DISEASES (SYSTEMIC OR UNSPECIFIED SITES),4,Extreme,Extreme,Surgical,Blue Cross/Blue Shield,,,,,N,880290.56,357220.53
New York City,Manhattan,7002054,001464,New York-Presbyterian Hospital - Columbia Presbyterian Center,50 to 69,100,M,Other Race,Spanish/Hispanic,76,Emergency,Expired,2022,INF002,Septicemia,RES007,AIRWAY INTUBATION,710,INFECTIOUS AND PARASITIC DISEASES INCLUDING HIV WITH O.R. PROCEDURE,18,INFECTIOUS AND PARASITIC DISEASES (SYSTEMIC OR UNSPECIFIED SITES),4,Extreme,Extreme,Surgical,Medicaid,,,,,Y,1567753.16,437517.72
New York City,Manhattan,7002053,001463,NYU Langone Hospitals,70 or Older,104,F,Black/African American,Not Span/Hispanic,29,Emergency,Hospice - Medical Facility,2022,INF002,Septicemia,CNS007,CNS EXCISION PROCEDURES,710,INFECTIOUS AND PARASITIC DISEASES INCLUDING HIV WITH O.R. PROCEDURE,18,INFECTIOUS AND PARASITIC DISEASES (SYSTEMIC OR UNSPECIFIED SITES),4,Extreme,Extreme,Surgical,Medicare,Medicaid,,,,Y,1505464.48,322546.95
New York City,Manhattan,7002053,001463,NYU Langone Hospitals,50 to 69,100,M,White,Not Span/Hispanic,26,Emergency,Home w/ Home Health Services,2022,INF002,Septicemia,MRS007,"MALE REPRODUCTIVE SYSTEM PROCEDURES, NEC",710,INFECTIOUS AND PARASITIC DISEASES INCLUDING HIV WITH O.R. PROCEDURE,18,INFECTIOUS AND PARASITIC DISEASES (SYSTEMIC OR UNSPECIFIED SITES),3,Major,Major,Surgical,Medicare,Medicaid,,,,Y,428576.30,149061.10
New York City,Manhattan,7002053,001463,NYU Langone Hospitals,18 to 29,100,M,Other Race,Not Span/Hispanic,8,Emergency,Home w/ Home Health Services,2022,INF002,Septicemia,GIS008,APPENDECTOMY,710,INFECTIOUS AND PARASITIC DISEASES INCLUDING HIV WITH O.R. PROCEDURE,18,INFECTIOUS AND PARASITIC DISEASES (SYSTEMIC OR UNSPECIFIED SITES),3,Major,Moderate,Surgical,Private Health Insurance,,,,,Y,200820.98,50629.85
New York City,Manhattan,7002053,001463,NYU Langone Hospitals,50 to 69,112,M,White,Not Span/Hispanic,13,Emergency,Home w/ Home Health Services,2022,INF002,Septicemia,RES012,RELEASE OF LUNG AND PLEURA,710,INFECTIOUS AND PARASITIC DISEASES INCLUDING HIV WITH O.R. PROCEDURE,18,INFECTIOUS AND PARASITIC DISEASES (SYSTEMIC OR UNSPECIFIED SITES),4,Extreme,Extreme,Surgical,Private Health Insurance,,,,,Y,371599.89,80361.86
New York City,Manhattan,7002053,001463,NYU Langone Hospitals,30 to 49,100,M,Other Race,Spanish/Hispanic,18,Emergency,Inpatient Rehabilitation Facility,2022,INF002,Septicemia,RES002,"LUNG, PLEURA, OR DIAPHRAGM BIOPSY (NON-ENDOSCOPIC)",710,INFECTIOUS AND PARASITIC DISEASES INCLUDING HIV WITH O.R. PROCEDURE,18,INFECTIOUS AND PARASITIC DISEASES (SYSTEMIC OR UNSPECIFIED SITES),4,Extreme,Extreme,Surgical,Private Health Insurance,,,,,Y,412511.61,134681.20
New York City,Manhattan,7002001,001438,Bellevue Hospital Center,70 or Older,100,M,Other Race,Spanish/Hispanic,21,Emergency,Home w/ Home Health Services,2022,INF002,Septicemia,MST023,TOE AND MID FOOT AMPUTATION,710,INFECTIOUS AND PARASITIC DISEASES INCLUDING HIV WITH O.R. PROCEDURE,18,INFECTIOUS AND PARASITIC DISEASES (SYSTEMIC OR UNSPECIFIED SITES),4,Extreme,Extreme,Surgical,Medicare,Medicaid,,,,Y,201308.61,115769.36
New York City,Manhattan,7002054,001464,New York-Presbyterian Hospital - Columbia Presbyterian Center,30 to 49,112,M,Black/African American,Not Span/Hispanic,24,Urgent,Skilled Nursing Home,2022,INF002,Septicemia,CAR022,HEART VALVE REPLACEMENT AND OTHER VALVE PROCEDURES (NON-ENDOVASCULAR),710,INFECTIOUS AND PARASITIC DISEASES INCLUDING HIV WITH O.R. PROCEDURE,18,INFECTIOUS AND PARASITIC DISEASES (SYSTEMIC OR UNSPECIFIED SITES),4,Extreme,Extreme,Surgical,Medicare,Medicaid,,,,N,918688.71,384947.58
New York City,Manhattan,7002054,001464,New York-Presbyterian Hospital - Columbia Presbyterian Center,70 or Older,100,M,Other Race,Not Span/Hispanic,51,Emergency,Skilled Nursing Home,2022,INF002,Septicemia,CAR008,ANGIOPLASTY AND RELATED VESSEL PROCEDURES (ENDOVASCULAR; EXCLUDING CAROTID),710,INFECTIOUS AND PARASITIC DISEASES INCLUDING HIV WITH O.R. PROCEDURE,18,INFECTIOUS AND PARASITIC DISEASES (SYSTEMIC OR UNSPECIFIED SITES),4,Extreme,Extreme,Surgical,Medicare,,,,,Y,1298841.10,424294.20
New York City,Manhattan,7002054,001464,New York-Presbyterian Hospital - Columbia Presbyterian Center,50 to 69,104,F,Black/African American,Not Span/Hispanic,16,Emergency,Home or Self Care,2022,INF002,Septicemia,CAR022,HEART VALVE REPLACEMENT AND OTHER VALVE PROCEDURES (NON-ENDOVASCULAR),710,INFECTIOUS AND PARASITIC DISEASES INCLUDING HIV WITH O.R. PROCEDURE,18,INFECTIOUS AND PARASITIC DISEASES (SYSTEMIC OR UNSPECIFIED SITES),3,Major,Major,Surgical,Medicare,,,,,Y,407571.09,132320.50
New York City,Manhattan,7002054,001464,New York-Presbyterian Hospital - Columbia Presbyterian Center,50 to 69,112,M,Other Race,Not Span/Hispanic,20,Emergency,Inpatient Rehabilitation Facility,2022,INF002,Septicemia,MST024,BELOW KNEE AMPUTATION,710,INFECTIOUS AND PARASITIC DISEASES INCLUDING HIV WITH O.R. PROCEDURE,18,INFECTIOUS AND PARASITIC DISEASES (SYSTEMIC OR UNSPECIFIED SITES),3,Major,Moderate,Surgical,Medicare,,,,,Y,448566.40,175982.70
New York City,Manhattan,7002001,001438,Bellevue Hospital Center,70 or Older,113,M,White,Unknown,6,Urgent,Expired,2022,INF002,Septicemia,ADM015,ADMINISTRATION OF ANTIBIOTICS,710,INFECTIOUS AND PARASITIC DISEASES INCLUDING HIV WITH O.R. PROCEDURE,18,INFECTIOUS AND PARASITIC DISEASES (SYSTEMIC OR UNSPECIFIED SITES),3,Major,Major,Surgical,Medicare,Medicaid,,,,N,43378.51,24946.29
New York City,Manhattan,7002054,001464,New York-Presbyterian Hospital - Columbia Presbyterian Center,50 to 69,104,M,Black/African American,Not Span/Hispanic,20,Emergency,Skilled Nursing Home,2022,INF002,Septicemia,MST024,BELOW KNEE AMPUTATION,710,INFECTIOUS AND PARASITIC DISEASES INCLUDING HIV WITH O.R. PROCEDURE,18,INFECTIOUS AND PARASITIC DISEASES (SYSTEMIC OR UNSPECIFIED SITES),3,Major,Major,Surgical,Medicaid,,,,,Y,449141.14,173740.75
New York City,Manhattan,7002053,001463,NYU Langone Hospitals,50 to 69,100,F,White,Not Span/Hispanic,17,Emergency,Home w/ Home Health Services,2022,INF002,Septicemia,GIS018,ILEOSTOMY AND COLOSTOMY,710,INFECTIOUS AND PARASITIC DISEASES INCLUDING HIV WITH O.R. PROCEDURE,18,INFECTIOUS AND PARASITIC DISEASES (SYSTEMIC OR UNSPECIFIED SITES),3,Major,Major,Surgical,Medicare,Private Health Insurance,,,,Y,515069.63,117823.48
New York City,Manhattan,7002053,001463,NYU Langone Hospitals,70 or Older,113,M,Multi-racial,Not Span/Hispanic,9,Emergency,Home w/ Home Health Services,2022,INF002,Septicemia,MST018,BONE EXCISION,710,INFECTIOUS AND PARASITIC DISEASES INCLUDING HIV WITH O.R. PROCEDURE,18,INFECTIOUS AND PARASITIC DISEASES (SYSTEMIC OR UNSPECIFIED SITES),2,Moderate,Major,Surgical,Medicare,Medicare,Blue Cross/Blue Shield,,,Y,222236.03,53274.46
New York City,Manhattan,7002053,001463,NYU Langone Hospitals,50 to 69,109,M,White,Not Span/Hispanic,13,Emergency,Home or Self Care,2022,INF002,Septicemia,CAR010,LIGATION AND EMBOLIZATION OF VESSELS,710,INFECTIOUS AND PARASITIC DISEASES INCLUDING HIV WITH O.R. PROCEDURE,18,INFECTIOUS AND PARASITIC DISEASES (SYSTEMIC OR UNSPECIFIED SITES),4,Extreme,Extreme,Surgical,Private Health Insurance,,,,,Y,291749.44,82490.18
New York City,Manhattan,7002053,001463,NYU Langone Hospitals,70 or Older,113,M,White,Unknown,5,Emergency,Home or Self Care,2022,INF002,Septicemia,MST023,TOE AND MID FOOT AMPUTATION,710,INFECTIOUS AND PARASITIC DISEASES INCLUDING HIV WITH O.R. PROCEDURE,18,INFECTIOUS AND PARASITIC DISEASES (SYSTEMIC OR UNSPECIFIED SITES),3,Major,Major,Surgical,Medicare,Medicare,,,,Y,99762.47,28422.51
New York City,Manhattan,7002054,001464,New York-Presbyterian Hospital - Columbia Presbyterian Center,70 or Older,117,M,White,Not Span/Hispanic,29,Urgent,Inpatient Rehabilitation Facility,2022,INF002,Septicemia,URN003,URETER AND OTHER URINARY TRACT DILATION,710,INFECTIOUS AND PARASITIC DISEASES INCLUDING HIV WITH O.R. PROCEDURE,18,INFECTIOUS AND PARASITIC DISEASES (SYSTEMIC OR UNSPECIFIED SITES),4,Extreme,Major,Surgical,Medicare,Private Health Insurance,,,,N,552721.58,144812.94
New York City,Manhattan,7002054,001464,New York-Presbyterian Hospital - Columbia Presbyterian Center,70 or Older,OOS,F,Other Race,Spanish/Hispanic,15,Emergency,Skilled Nursing Home,2022,INF002,Septicemia,MST024,BELOW KNEE AMPUTATION,710,INFECTIOUS AND PARASITIC DISEASES INCLUDING HIV WITH O.R. PROCEDURE,18,INFECTIOUS AND PARASITIC DISEASES (SYSTEMIC OR UNSPECIFIED SITES),4,Extreme,Major,Surgical,Medicare,Medicaid,,,,Y,407732.60,146221.40
New York City,Manhattan,7002054,001464,New York-Presbyterian Hospital - Columbia Presbyterian Center,50 to 69,100,M,Other Race,Spanish/Hispanic,14,Emergency,Home w/ Home Health Services,2022,INF002,Septicemia,GIS009,COLECTOMY,710,INFECTIOUS AND PARASITIC DISEASES INCLUDING HIV WITH O.R. PROCEDURE,18,INFECTIOUS AND PARASITIC DISEASES (SYSTEMIC OR UNSPECIFIED SITES),4,Extreme,Extreme,Surgical,Medicaid,,,,,Y,515824.00,171620.23
Finger Lakes,Monroe,2701005,000413,Strong Memorial Hospital,70 or Older,146,F,White,Not Span/Hispanic,6,Emergency,Home or Self Care,2022,INF002,Septicemia,HEP006,CHOLECYSTECTOMY,710,INFECTIOUS AND PARASITIC DISEASES INCLUDING HIV WITH O.R. PROCEDURE,18,INFECTIOUS AND PARASITIC DISEASES (SYSTEMIC OR UNSPECIFIED SITES),2,Moderate,Moderate,Surgical,Medicare,,,,,Y,63216.74,26198.43
Finger Lakes,Monroe,2701005,000413,Strong Memorial Hospital,50 to 69,131,F,White,Not Span/Hispanic,8,Emergency,Home w/ Home Health Services,2022,INF002,Septicemia,HEP010,HEPATOBILIARY AND PANCREATIC DRAINAGE,710,INFECTIOUS AND PARASITIC DISEASES INCLUDING HIV WITH O.R. PROCEDURE,18,INFECTIOUS AND PARASITIC DISEASES (SYSTEMIC OR UNSPECIFIED SITES),4,Extreme,Major,Surgical,Medicare,Medicaid,,,,Y,52683.22,22118.73
Finger Lakes,Monroe,2701005,000413,Strong Memorial Hospital,30 to 49,146,M,White,Not Span/Hispanic,28,Emergency,Home w/ Home Health Services,2022,INF002,Septicemia,SKB007,SKIN GRAFT,710,INFECTIOUS AND PARASITIC DISEASES INCLUDING HIV WITH O.R. PROCEDURE,18,INFECTIOUS AND PARASITIC DISEASES (SYSTEMIC OR UNSPECIFIED SITES),4,Extreme,Extreme,Surgical,Medicaid,,,,,Y,125182.37,56971.41
Finger Lakes,Monroe,2701005,000413,Strong Memorial Hospital,50 to 69,146,M,Black/African American,Not Span/Hispanic,55,Emergency,Home or Self Care,2022,INF002,Septicemia,ESA001,HEMODIALYSIS,710,INFECTIOUS AND PARASITIC DISEASES INCLUDING HIV WITH O.R. PROCEDURE,18,INFECTIOUS AND PARASITIC DISEASES (SYSTEMIC OR UNSPECIFIED SITES),3,Major,Major,Surgical,Blue Cross/Blue Shield,,,,,Y,248615.53,77116.56
Finger Lakes,Monroe,2701005,000413,Strong Memorial Hospital,70 or Older,144,M,White,Not Span/Hispanic,5,Emergency,Home or Self Care,2022,INF002,Septicemia,HEP008,COMMON BILE DUCT SPHINCTEROTOMY AND STENTING,710,INFECTIOUS AND PARASITIC DISEASES INCLUDING HIV WITH O.R. PROCEDURE,18,INFECTIOUS AND PARASITIC DISEASES (SYSTEMIC OR UNSPECIFIED SITES),3,Major,Major,Surgical,Medicare,,,,,Y,57267.54,23824.09
Finger Lakes,Monroe,2701005,000413,Strong Memorial Hospital,0 to 17,148,M,White,Not Span/Hispanic,28,Emergency,Home or Self Care,2022,INF002,Septicemia,RES014,"RESPIRATORY SYSTEM PROCEDURES, NEC",710,INFECTIOUS AND PARASITIC DISEASES INCLUDING HIV WITH O.R. PROCEDURE,18,INFECTIOUS AND PARASITIC DISEASES (SYSTEMIC OR UNSPECIFIED SITES),4,Extreme,Major,Surgical,Medicaid,,,,,Y,220766.01,94766.78
Finger Lakes,Monroe,2701005,000413,Strong Memorial Hospital,50 to 69,144,F,Black/African American,Not Span/Hispanic,51,Emergency,Home w/ Home Health Services,2022,INF002,Septicemia,MST018,BONE EXCISION,710,INFECTIOUS AND PARASITIC DISEASES INCLUDING HIV WITH O.R. PROCEDURE,18,INFECTIOUS AND PARASITIC DISEASES (SYSTEMIC OR UNSPECIFIED SITES),4,Extreme,Extreme,Surgical,Medicaid,,,,,Y,161986.46,81470.49
Finger Lakes,Monroe,2701005,000413,Strong Memorial Hospital,50 to 69,146,M,White,Not Span/Hispanic,29,Emergency,Hospice - Medical Facility,2022,INF012,COVID-19,MST020,SUBCUTANEOUS TISSUE AND FASCIA EXCISION,710,INFECTIOUS AND PARASITIC DISEASES INCLUDING HIV WITH O.R. PROCEDURE,18,INFECTIOUS AND PARASITIC DISEASES (SYSTEMIC OR UNSPECIFIED SITES),4,Extreme,Extreme,Surgical,Medicaid,,,,,Y,171596.69,64799.99
Finger Lakes,Monroe,2701005,000413,Strong Memorial Hospital,50 to 69,145,F,White,Not Span/Hispanic,9,Emergency,Home w/ Home Health Services,2022,INF002,Septicemia,GIS021,GI SYSTEM REPAIR (EXCLUDING ANORECTAL),710,INFECTIOUS AND PARASITIC DISEASES INCLUDING HIV WITH O.R. PROCEDURE,18,INFECTIOUS AND PARASITIC DISEASES (SYSTEMIC OR UNSPECIFIED SITES),4,Extreme,Major,Surgical,Blue Cross/Blue Shield,,,,,Y,52675.86,22979.89
Finger Lakes,Monroe,2701005,000413,Strong Memorial Hospital,30 to 49,145,M,White,Not Span/Hispanic,25,Emergency,Home w/ Home Health Services,2022,INF002,Septicemia,URN003,URETER AND OTHER URINARY TRACT DILATION,710,INFECTIOUS AND PARASITIC DISEASES INCLUDING HIV WITH O.R. PROCEDURE,18,INFECTIOUS AND PARASITIC DISEASES (SYSTEMIC OR UNSPECIFIED SITES),3,Major,Major,Surgical,Medicare,Medicaid,,,,Y,111776.71,51114.34
Finger Lakes,Monroe,2701005,000413,Strong Memorial Hospital,70 or Older,144,M,White,Not Span/Hispanic,120 +,Emergency,Skilled Nursing Home,2022,INF002,Septicemia,MST017,JOINT TISSUE EXCISION (EXCLUDING DISCECTOMY),710,INFECTIOUS AND PARASITIC DISEASES INCLUDING HIV WITH O.R. PROCEDURE,18,INFECTIOUS AND PARASITIC DISEASES (SYSTEMIC OR UNSPECIFIED SITES),4,Extreme,Major,Surgical,Medicare,,,,,Y,391374.62,202008.32
Finger Lakes,Monroe,2701005,000413,Strong Memorial Hospital,18 to 29,145,M,White,Not Span/Hispanic,3,Emergency,Home or Self Care,2022,INF008,Viral infection,LYM001,LYMPH NODE BIOPSY,710,INFECTIOUS AND PARASITIC DISEASES INCLUDING HIV WITH O.R. PROCEDURE,18,INFECTIOUS AND PARASITIC DISEASES (SYSTEMIC OR UNSPECIFIED SITES),2,Moderate,Minor,Surgical,Blue Cross/Blue Shield,,,,,Y,36479.59,13334.34
New York City,Manhattan,7002053,001463,NYU Langone Hospitals,70 or Older,112,F,Black/African American,Not Span/Hispanic,22,Emergency,Expired,2022,INF002,Septicemia,CAR010,LIGATION AND EMBOLIZATION OF VESSELS,710,INFECTIOUS AND PARASITIC DISEASES INCLUDING HIV WITH O.R. PROCEDURE,18,INFECTIOUS AND PARASITIC DISEASES (SYSTEMIC OR UNSPECIFIED SITES),4,Extreme,Extreme,Surgical,Medicare,Medicaid,,,,Y,589849.75,143701.28
New York City,Manhattan,7002053,001463,NYU Langone Hospitals,50 to 69,100,M,White,Not Span/Hispanic,6,Emergency,Home or Self Care,2022,INF002,Septicemia,GIS009,COLECTOMY,710,INFECTIOUS AND PARASITIC DISEASES INCLUDING HIV WITH O.R. PROCEDURE,18,INFECTIOUS AND PARASITIC DISEASES (SYSTEMIC OR UNSPECIFIED SITES),3,Major,Major,Surgical,Private Health Insurance,,,,,Y,298335.54,58301.50
New York City,Manhattan,7002053,001463,NYU Langone Hospitals,50 to 69,112,M,Other Race,Not Span/Hispanic,1,Emergency,Home or Self Care,2022,INF002,Septicemia,OTR004,ISOLATION PROCEDURES,710,INFECTIOUS AND PARASITIC DISEASES INCLUDING HIV WITH O.R. PROCEDURE,18,INFECTIOUS AND PARASITIC DISEASES (SYSTEMIC OR UNSPECIFIED SITES),3,Major,Moderate,Surgical,Blue Cross/Blue Shield,,,,,Y,95320.79,15475.54
New York City,Manhattan,7002053,001463,NYU Langone Hospitals,50 to 69,112,F,White,Not Span/Hispanic,7,Emergency,Home or Self Care,2022,INF002,Septicemia,RES005,CHEST TUBE PLACEMENT AND THERAPEUTIC THORACENTESIS,710,INFECTIOUS AND PARASITIC DISEASES INCLUDING HIV WITH O.R. PROCEDURE,18,INFECTIOUS AND PARASITIC DISEASES (SYSTEMIC OR UNSPECIFIED SITES),3,Major,Major,Surgical,Medicaid,,,,,Y,242556.89,53112.50
New York City,Manhattan,7002053,001463,NYU Langone Hospitals,50 to 69,112,M,White,Not Span/Hispanic,4,Emergency,Home or Self Care,2022,INF002,Septicemia,MST023,TOE AND MID FOOT AMPUTATION,710,INFECTIOUS AND PARASITIC DISEASES INCLUDING HIV WITH O.R. PROCEDURE,18,INFECTIOUS AND PARASITIC DISEASES (SYSTEMIC OR UNSPECIFIED SITES),3,Major,Major,Surgical,Medicaid,,,,,Y,113902.43,26953.62
New York City,Manhattan,7002053,001463,NYU Langone Hospitals,70 or Older,100,F,Other Race,Not Span/Hispanic,8,Emergency,Home w/ Home Health Services,2022,INF002,Septicemia,CAR011,ANEURYSM REPAIR PROCEDURES,710,INFECTIOUS AND PARASITIC DISEASES INCLUDING HIV WITH O.R. PROCEDURE,18,INFECTIOUS AND PARASITIC DISEASES (SYSTEMIC OR UNSPECIFIED SITES),4,Extreme,Extreme,Surgical,Medicare,Private Health Insurance,,,,Y,305468.22,71467.84
New York City,Manhattan,7002053,001463,NYU Langone Hospitals,70 or Older,111,F,Other Race,Not Span/Hispanic,15,Emergency,Home w/ Home Health Services,2022,INF002,Septicemia,CNS002,LUMBAR PUNCTURE,710,INFECTIOUS AND PARASITIC DISEASES INCLUDING HIV WITH O.R. PROCEDURE,18,INFECTIOUS AND PARASITIC DISEASES (SYSTEMIC OR UNSPECIFIED SITES),4,Extreme,Extreme,Surgical,Medicare,Medicaid,,,,Y,353694.73,92802.24
New York City,Manhattan,7002001,001438,Bellevue Hospital Center,50 to 69,114,M,Black/African American,Unknown,34,Urgent,Inpatient Rehabilitation Facility,2022,INF002,Septicemia,MST004,INCISION AND DRAINAGE OF MUSCULOSKELETAL TISSUE AND JOINTS,710,INFECTIOUS AND PARASITIC DISEASES INCLUDING HIV WITH O.R. PROCEDURE,18,INFECTIOUS AND PARASITIC DISEASES (SYSTEMIC OR UNSPECIFIED SITES),4,Extreme,Major,Surgical,Medicaid,,,,,N,333375.23,191718.76
Finger Lakes,Monroe,2701005,000413,Strong Memorial Hospital,70 or Older,148,M,Black/African American,Not Span/Hispanic,38,Emergency,Expired,2022,INF002,Septicemia,ESA003,MECHANICAL VENTILATION,710,INFECTIOUS AND PARASITIC DISEASES INCLUDING HIV WITH O.R. PROCEDURE,18,INFECTIOUS AND PARASITIC DISEASES (SYSTEMIC OR UNSPECIFIED SITES),4,Extreme,Extreme,Surgical,Medicare,Medicaid,,,,Y,358654.55,141530.50
Finger Lakes,Monroe,2701005,000413,Strong Memorial Hospital,30 to 49,146,F,White,Not Span/Hispanic,63,Emergency,Expired,2022,INF002,Septicemia,ESA003,MECHANICAL VENTILATION,710,INFECTIOUS AND PARASITIC DISEASES INCLUDING HIV WITH O.R. PROCEDURE,18,INFECTIOUS AND PARASITIC DISEASES (SYSTEMIC OR UNSPECIFIED SITES),4,Extreme,Extreme,Surgical,Medicaid,,,,,Y,655239.33,234054.56
New York City,Manhattan,7002053,001463,NYU Langone Hospitals,50 to 69,104,M,White,Not Span/Hispanic,58,Emergency,Skilled Nursing Home,2022,INF002,Septicemia,GIS009,COLECTOMY,710,INFECTIOUS AND PARASITIC DISEASES INCLUDING HIV WITH O.R. PROCEDURE,18,INFECTIOUS AND PARASITIC DISEASES (SYSTEMIC OR UNSPECIFIED SITES),4,Extreme,Extreme,Surgical,Medicare,Medicare,,,,Y,2592071.48,590441.30
New York City,Manhattan,7002053,001463,NYU Langone Hospitals,0 to 17,112,M,Other Race,Not Span/Hispanic,10,Emergency,Home or Self Care,2022,INF002,Septicemia,GIS008,APPENDECTOMY,710,INFECTIOUS AND PARASITIC DISEASES INCLUDING HIV WITH O.R. PROCEDURE,18,INFECTIOUS AND PARASITIC DISEASES (SYSTEMIC OR UNSPECIFIED SITES),3,Major,Moderate,Surgical,Medicaid,,,,,Y,169668.35,51938.44