Hospital Service Area,Hospital County,Operating Certificate Number,Permanent Facility Id,Facility Name,Age Group,Zip Code - 3 digits,Gender,Race,Ethnicity,Length of Stay,Type of Admission,Patient Disposition,Discharge Year,CCS Diagnosis Code,CCS Diagnosis Description,CCS Procedure Code,CCS Procedure Description,APR DRG Code,APR DRG Description,APR MDC Code,APR MDC Description,APR Severity of Illness Code,APR Severity of Illness Description,APR Risk of Mortality,APR Medical Surgical Description,Payment Typology 1,Payment Typology 2,Payment Typology 3,Birth Weight,Abortion Edit Indicator,Emergency Department Indicator,Total Charges,Total Costs
New York City,Manhattan,7002054,001464,New York-Presbyterian Hospital - Columbia Presbyterian Center,50 to 69,100,M,Black/African American,Not Span/Hispanic,5,Emergency,Home or Self Care,2022,INF002,Septicemia,ADM017,ADMINISTRATION OF NUTRITIONAL AND ELECTROLYTIC SUBSTANCES,720,SEPTICEMIA AND DISSEMINATED INFECTIONS,18,INFECTIOUS AND PARASITIC DISEASES (SYSTEMIC OR UNSPECIFIED SITES),3,Major,Major,Medical,Medicaid,,,,,Y,80141.36,18962.43
New York City,Manhattan,7002054,001464,New York-Presbyterian Hospital - Columbia Presbyterian Center,50 to 69,100,F,Black/African American,Spanish/Hispanic,10,Emergency,Home w/ Home Health Services,2022,INF002,Septicemia,ESA001,HEMODIALYSIS,720,SEPTICEMIA AND DISSEMINATED INFECTIONS,18,INFECTIOUS AND PARASITIC DISEASES (SYSTEMIC OR UNSPECIFIED SITES),3,Major,Major,Medical,Medicaid,,,,,Y,188532.66,44238.07
New York City,Manhattan,7002054,001464,New York-Presbyterian Hospital - Columbia Presbyterian Center,70 or Older,OOS,M,White,Not Span/Hispanic,7,Urgent,Home or Self Care,2022,INF002,Septicemia,CAR024,VENOUS AND ARTERIAL CATHETER PLACEMENT,720,SEPTICEMIA AND DISSEMINATED INFECTIONS,18,INFECTIOUS AND PARASITIC DISEASES (SYSTEMIC OR UNSPECIFIED SITES),4,Extreme,Extreme,Medical,Blue Cross/Blue Shield,Medicare,,,,N,188742.92,87147.60
New York City,Manhattan,7002054,001464,New York-Presbyterian Hospital - Columbia Presbyterian Center,70 or Older,100,M,Other Race,Not Span/Hispanic,3,Emergency,Expired,2022,INF002,Septicemia,RES007,AIRWAY INTUBATION,720,SEPTICEMIA AND DISSEMINATED INFECTIONS,18,INFECTIOUS AND PARASITIC DISEASES (SYSTEMIC OR UNSPECIFIED SITES),4,Extreme,Extreme,Medical,Medicare,,,,,Y,144475.92,43877.25
New York City,Manhattan,7002054,001464,New York-Presbyterian Hospital - Columbia Presbyterian Center,50 to 69,104,F,Black/African American,Not Span/Hispanic,2,Emergency,Home or Self Care,2022,INF002,Septicemia,ADM015,ADMINISTRATION OF ANTIBIOTICS,720,SEPTICEMIA AND DISSEMINATED INFECTIONS,18,INFECTIOUS AND PARASITIC DISEASES (SYSTEMIC OR UNSPECIFIED SITES),2,Moderate,Minor,Medical,Private Health Insurance,,,,,Y,38449.61,8199.97
New York City,Manhattan,7002054,001464,New York-Presbyterian Hospital - Columbia Presbyterian Center,70 or Older,104,M,Multi-racial,Spanish/Hispanic,13,Emergency,Home or Self Care,2022,INF002,Septicemia,ADM006,INFUSION OF VASOPRESSOR,720,SEPTICEMIA AND DISSEMINATED INFECTIONS,18,INFECTIOUS AND PARASITIC DISEASES (SYSTEMIC OR UNSPECIFIED SITES),4,Extreme,Extreme,Medical,Medicare,,,,,Y,345020.59,126662.84
New York City,Manhattan,7002054,001464,New York-Presbyterian Hospital - Columbia Presbyterian Center,50 to 69,103,F,Other Race,Not Span/Hispanic,4,Emergency,Home or Self Care,2022,INF002,Septicemia,ADM015,ADMINISTRATION OF ANTIBIOTICS,720,SEPTICEMIA AND DISSEMINATED INFECTIONS,18,INFECTIOUS AND PARASITIC DISEASES (SYSTEMIC OR UNSPECIFIED SITES),4,Extreme,Extreme,Medical,Medicare,Private Health Insurance,Blue Cross/Blue Shield,,,Y,65957.97,13585.60
New York City,Manhattan,7002054,001464,New York-Presbyterian Hospital - Columbia Presbyterian Center,70 or Older,105,M,Other Race,Spanish/Hispanic,7,Emergency,Expired,2022,INF002,Septicemia,CAR024,VENOUS AND ARTERIAL CATHETER PLACEMENT,720,SEPTICEMIA AND DISSEMINATED INFECTIONS,18,INFECTIOUS AND PARASITIC DISEASES (SYSTEMIC OR UNSPECIFIED SITES),4,Extreme,Extreme,Medical,Medicare,Medicaid,,,,Y,201918.25,63152.14
New York City,Manhattan,7002054,001464,New York-Presbyterian Hospital - Columbia Presbyterian Center,70 or Older,100,F,Other Race,Unknown,3,Emergency,Expired,2022,INF002,Septicemia,CAR024,VENOUS AND ARTERIAL CATHETER PLACEMENT,720,SEPTICEMIA AND DISSEMINATED INFECTIONS,18,INFECTIOUS AND PARASITIC DISEASES (SYSTEMIC OR UNSPECIFIED SITES),4,Extreme,Extreme,Medical,Medicare,,,,,Y,110242.23,32751.75
New York City,Manhattan,7002054,001464,New York-Presbyterian Hospital - Columbia Presbyterian Center,70 or Older,104,M,Black/African American,Not Span/Hispanic,11,Emergency,Expired,2022,INF002,Septicemia,HEP003,DIAGNOSTIC ERCP WITH OR WITHOUT BIOPSY,720,SEPTICEMIA AND DISSEMINATED INFECTIONS,18,INFECTIOUS AND PARASITIC DISEASES (SYSTEMIC OR UNSPECIFIED SITES),4,Extreme,Extreme,Medical,Medicare,,,,,Y,258255.54,79198.67
New York City,Manhattan,7002054,001464,New York-Presbyterian Hospital - Columbia Presbyterian Center,70 or Older,112,F,Black/African American,Not Span/Hispanic,15,Emergency,Skilled Nursing Home,2022,INF002,Septicemia,ESA001,HEMODIALYSIS,720,SEPTICEMIA AND DISSEMINATED INFECTIONS,18,INFECTIOUS AND PARASITIC DISEASES (SYSTEMIC OR UNSPECIFIED SITES),3,Major,Major,Medical,Medicare,Medicaid,,,,Y,273160.57,62275.76
New York City,Manhattan,7002054,001464,New York-Presbyterian Hospital - Columbia Presbyterian Center,70 or Older,105,F,Other Race,Unknown,12,Emergency,Skilled Nursing Home,2022,INF002,Septicemia,ADM015,ADMINISTRATION OF ANTIBIOTICS,720,SEPTICEMIA AND DISSEMINATED INFECTIONS,18,INFECTIOUS AND PARASITIC DISEASES (SYSTEMIC OR UNSPECIFIED SITES),3,Major,Extreme,Medical,Private Health Insurance,,,,,Y,150296.32,32346.56
New York City,Manhattan,7002054,001464,New York-Presbyterian Hospital - Columbia Presbyterian Center,70 or Older,100,M,Other Race,Spanish/Hispanic,6,Emergency,Home or Self Care,2022,INF002,Septicemia,OTR004,ISOLATION PROCEDURES,720,SEPTICEMIA AND DISSEMINATED INFECTIONS,18,INFECTIOUS AND PARASITIC DISEASES (SYSTEMIC OR UNSPECIFIED SITES),4,Extreme,Extreme,Medical,Medicare,Medicaid,,,,Y,119494.21,28849.89
New York City,Manhattan,7002054,001464,New York-Presbyterian Hospital - Columbia Presbyterian Center,18 to 29,100,F,Black/African American,Not Span/Hispanic,10,Emergency,Home or Self Care,2022,INF002,Septicemia,OTR004,ISOLATION PROCEDURES,720,SEPTICEMIA AND DISSEMINATED INFECTIONS,18,INFECTIOUS AND PARASITIC DISEASES (SYSTEMIC OR UNSPECIFIED SITES),3,Major,Major,Medical,Medicaid,,,,,Y,155923.37,35074.03
New York City,Manhattan,7002054,001464,New York-Presbyterian Hospital - Columbia Presbyterian Center,70 or Older,100,F,White,Not Span/Hispanic,11,Emergency,Skilled Nursing Home,2022,INF002,Septicemia,ADM019,POTENTIAL COVID-19 THERAPIES,720,SEPTICEMIA AND DISSEMINATED INFECTIONS,18,INFECTIOUS AND PARASITIC DISEASES (SYSTEMIC OR UNSPECIFIED SITES),3,Major,Extreme,Medical,Medicare,Private Health Insurance,,,,Y,187783.98,41791.63
New York City,Manhattan,7002054,001464,New York-Presbyterian Hospital - Columbia Presbyterian Center,70 or Older,100,M,White,Unknown,2,Emergency,Expired,2022,INF002,Septicemia,ESA003,MECHANICAL VENTILATION,720,SEPTICEMIA AND DISSEMINATED INFECTIONS,18,INFECTIOUS AND PARASITIC DISEASES (SYSTEMIC OR UNSPECIFIED SITES),4,Extreme,Extreme,Medical,Medicare,Medicaid,,,,Y,135925.10,47260.98
New York City,Manhattan,7002054,001464,New York-Presbyterian Hospital - Columbia Presbyterian Center,50 to 69,104,F,White,Not Span/Hispanic,58,Emergency,Home or Self Care,2022,INF002,Septicemia,GIS017,GASTROSTOMY,720,SEPTICEMIA AND DISSEMINATED INFECTIONS,18,INFECTIOUS AND PARASITIC DISEASES (SYSTEMIC OR UNSPECIFIED SITES),3,Major,Extreme,Medical,Medicare,Private Health Insurance,Medicaid,,,Y,733867.04,160800.13
New York City,Manhattan,7002001,001438,Bellevue Hospital Center,50 to 69,113,M,Other Race,Spanish/Hispanic,3,Emergency,Home or Self Care,2022,INF002,Septicemia,ADM015,ADMINISTRATION OF ANTIBIOTICS,720,SEPTICEMIA AND DISSEMINATED INFECTIONS,18,INFECTIOUS AND PARASITIC DISEASES (SYSTEMIC OR UNSPECIFIED SITES),2,Moderate,Minor,Medical,Private Health Insurance,,,,,Y,23199.62,13341.73
New York City,Manhattan,7002001,001438,Bellevue Hospital Center,70 or Older,100,F,Black/African American,Not Span/Hispanic,5,Emergency,Inpatient Rehabilitation Facility,2022,INF002,Septicemia,OTR004,ISOLATION PROCEDURES,720,SEPTICEMIA AND DISSEMINATED INFECTIONS,18,INFECTIOUS AND PARASITIC DISEASES (SYSTEMIC OR UNSPECIFIED SITES),4,Extreme,Extreme,Medical,Medicare,Medicaid,,,,Y,42188.17,24261.74
New York City,Manhattan,7002001,001438,Bellevue Hospital Center,30 to 49,112,M,Other Race,Spanish/Hispanic,15,Emergency,Home or Self Care,2022,INF002,Septicemia,MST005,INCISION AND DRAINAGE OF SUBCUTANEOUS TISSUE AND FASCIA,720,SEPTICEMIA AND DISSEMINATED INFECTIONS,18,INFECTIOUS AND PARASITIC DISEASES (SYSTEMIC OR UNSPECIFIED SITES),3,Major,Major,Medical,Medicaid,,,,,Y,161156.23,92678.37
New York City,Manhattan,7002001,001438,Bellevue Hospital Center,50 to 69,104,M,Black/African American,Not Span/Hispanic,11,Emergency,Court/Law Enforcement,2022,INF002,Septicemia,ADM015,ADMINISTRATION OF ANTIBIOTICS,720,SEPTICEMIA AND DISSEMINATED INFECTIONS,18,INFECTIOUS AND PARASITIC DISEASES (SYSTEMIC OR UNSPECIFIED SITES),3,Major,Extreme,Medical,Medicaid,,,,,Y,90574.86,52088.15
New York City,Manhattan,7002001,001438,Bellevue Hospital Center,30 to 49,OOS,F,Other Race,Spanish/Hispanic,6,Emergency,Home or Self Care,2022,INF002,Septicemia,ADM019,POTENTIAL COVID-19 THERAPIES,720,SEPTICEMIA AND DISSEMINATED INFECTIONS,18,INFECTIOUS AND PARASITIC DISEASES (SYSTEMIC OR UNSPECIFIED SITES),4,Extreme,Extreme,Medical,Private Health Insurance,,,,,Y,75916.71,43658.49
New York City,Manhattan,7002001,001438,Bellevue Hospital Center,30 to 49,100,F,White,Unknown,5,Emergency,Home or Self Care,2022,INF002,Septicemia,OTR004,ISOLATION PROCEDURES,720,SEPTICEMIA AND DISSEMINATED INFECTIONS,18,INFECTIOUS AND PARASITIC DISEASES (SYSTEMIC OR UNSPECIFIED SITES),4,Extreme,Extreme,Medical,Private Health Insurance,,,,,Y,47474.18,27301.64
New York City,Manhattan,7002001,001438,Bellevue Hospital Center,70 or Older,113,F,White,Unknown,5,Urgent,Left Against Medical Advice,2022,INF002,Septicemia,ADM021,"ADMINISTRATION OF THERAPEUTIC SUBSTANCES, NEC",720,SEPTICEMIA AND DISSEMINATED INFECTIONS,18,INFECTIOUS AND PARASITIC DISEASES (SYSTEMIC OR UNSPECIFIED SITES),4,Extreme,Extreme,Medical,Medicare,Private Health Insurance,,,,N,42015.09,24162.21
New York City,Manhattan,7002001,001438,Bellevue Hospital Center,50 to 69,100,F,White,Not Span/Hispanic,19,Emergency,Skilled Nursing Home,2022,INF002,Septicemia,ADM015,ADMINISTRATION OF ANTIBIOTICS,720,SEPTICEMIA AND DISSEMINATED INFECTIONS,18,INFECTIOUS AND PARASITIC DISEASES (SYSTEMIC OR UNSPECIFIED SITES),4,Extreme,Extreme,Medical,Medicaid,,,,,Y,151275.94,86996.37
New York City,Manhattan,7002054,001464,New York-Presbyterian Hospital - Columbia Presbyterian Center,50 to 69,100,F,Multi-racial,Spanish/Hispanic,14,Emergency,Home w/ Home Health Services,2022,INF002,Septicemia,GNR008,"ABDOMINAL WALL PROCEDURES, NEC",720,SEPTICEMIA AND DISSEMINATED INFECTIONS,18,INFECTIOUS AND PARASITIC DISEASES (SYSTEMIC OR UNSPECIFIED SITES),4,Extreme,Extreme,Medical,Medicare,Medicaid,,,,Y,293862.38,71425.13
New York City,Manhattan,7002054,001464,New York-Presbyterian Hospital - Columbia Presbyterian Center,70 or Older,107,F,White,Not Span/Hispanic,3,Urgent,Expired,2022,INF002,Septicemia,ADM021,"ADMINISTRATION OF THERAPEUTIC SUBSTANCES, NEC",720,SEPTICEMIA AND DISSEMINATED INFECTIONS,18,INFECTIOUS AND PARASITIC DISEASES (SYSTEMIC OR UNSPECIFIED SITES),3,Major,Extreme,Medical,Medicare,,,,,N,40028.62,8729.65
New York City,Manhattan,7002054,001464,New York-Presbyterian Hospital - Columbia Presbyterian Center,50 to 69,100,M,Other Race,Spanish/Hispanic,2,Emergency,Home w/ Home Health Services,2022,INF002,Septicemia,MST005,INCISION AND DRAINAGE OF SUBCUTANEOUS TISSUE AND FASCIA,720,SEPTICEMIA AND DISSEMINATED INFECTIONS,18,INFECTIOUS AND PARASITIC DISEASES (SYSTEMIC OR UNSPECIFIED SITES),2,Moderate,Minor,Medical,Medicaid,,,,,Y,34286.17,7314.76
New York City,Manhattan,7002054,001464,New York-Presbyterian Hospital - Columbia Presbyterian Center,50 to 69,100,M,Other Race,Spanish/Hispanic,3,Emergency,Home or Self Care,2022,INF002,Septicemia,OTR004,ISOLATION PROCEDURES,720,SEPTICEMIA AND DISSEMINATED INFECTIONS,18,INFECTIOUS AND PARASITIC DISEASES (SYSTEMIC OR UNSPECIFIED SITES),4,Extreme,Extreme,Medical,Medicaid,,,,,Y,50358.23,11557.17
New York City,Manhattan,7002054,001464,New York-Presbyterian Hospital - Columbia Presbyterian Center,50 to 69,100,M,Black/African American,Not Span/Hispanic,2,Emergency,Skilled Nursing Home,2022,INF002,Septicemia,ADM015,ADMINISTRATION OF ANTIBIOTICS,720,SEPTICEMIA AND DISSEMINATED INFECTIONS,18,INFECTIOUS AND PARASITIC DISEASES (SYSTEMIC OR UNSPECIFIED SITES),4,Extreme,Major,Medical,Medicare,Medicaid,,,,Y,55731.27,12177.63
New York City,Manhattan,7002054,001464,New York-Presbyterian Hospital - Columbia Presbyterian Center,70 or Older,100,M,Other Race,Spanish/Hispanic,4,Emergency,Home or Self Care,2022,INF002,Septicemia,OTR004,ISOLATION PROCEDURES,720,SEPTICEMIA AND DISSEMINATED INFECTIONS,18,INFECTIOUS AND PARASITIC DISEASES (SYSTEMIC OR UNSPECIFIED SITES),3,Major,Extreme,Medical,Medicare,Medicaid,,,,Y,68903.59,14551.10
New York City,Manhattan,7002054,001464,New York-Presbyterian Hospital - Columbia Presbyterian Center,30 to 49,100,M,Black/African American,Not Span/Hispanic,7,Emergency,Home or Self Care,2022,INF002,Septicemia,ADM019,POTENTIAL COVID-19 THERAPIES,720,SEPTICEMIA AND DISSEMINATED INFECTIONS,18,INFECTIOUS AND PARASITIC DISEASES (SYSTEMIC OR UNSPECIFIED SITES),3,Major,Major,Medical,Private Health Insurance,,,,,Y,126681.08,28096.44
New York City,Manhattan,7002054,001464,New York-Presbyterian Hospital - Columbia Presbyterian Center,70 or Older,112,M,Other Race,Not Span/Hispanic,22,Emergency,Home w/ Home Health Services,2022,INF002,Septicemia,GNR008,"ABDOMINAL WALL PROCEDURES, NEC",720,SEPTICEMIA AND DISSEMINATED INFECTIONS,18,INFECTIOUS AND PARASITIC DISEASES (SYSTEMIC OR UNSPECIFIED SITES),4,Extreme,Major,Medical,Medicare,Private Health Insurance,,,,Y,387094.28,114659.22
New York City,Manhattan,7002054,001464,New York-Presbyterian Hospital - Columbia Presbyterian Center,50 to 69,104,F,Other Race,Spanish/Hispanic,5,Emergency,Home or Self Care,2022,INF002,Septicemia,OTR004,ISOLATION PROCEDURES,720,SEPTICEMIA AND DISSEMINATED INFECTIONS,18,INFECTIOUS AND PARASITIC DISEASES (SYSTEMIC OR UNSPECIFIED SITES),3,Major,Major,Medical,Medicare,Medicaid,,,,Y,105294.40,23722.55
New York City,Manhattan,7002054,001464,New York-Presbyterian Hospital - Columbia Presbyterian Center,70 or Older,104,M,Other Race,Unknown,4,Emergency,Home w/ Home Health Services,2022,INF002,Septicemia,ADM015,ADMINISTRATION OF ANTIBIOTICS,720,SEPTICEMIA AND DISSEMINATED INFECTIONS,18,INFECTIOUS AND PARASITIC DISEASES (SYSTEMIC OR UNSPECIFIED SITES),2,Moderate,Moderate,Medical,Medicare,Private Health Insurance,,,,Y,67218.51,14429.14
New York City,Manhattan,7002054,001464,New York-Presbyterian Hospital - Columbia Presbyterian Center,70 or Older,OOS,F,White,Not Span/Hispanic,7,Urgent,Home or Self Care,2022,INF002,Septicemia,ADM019,POTENTIAL COVID-19 THERAPIES,720,SEPTICEMIA AND DISSEMINATED INFECTIONS,18,INFECTIOUS AND PARASITIC DISEASES (SYSTEMIC OR UNSPECIFIED SITES),4,Extreme,Major,Medical,Medicare,Private Health Insurance,,,,Y,149938.01,35425.58
New York City,Manhattan,7002054,001464,New York-Presbyterian Hospital - Columbia Presbyterian Center,70 or Older,104,M,Other Race,Unknown,4,Emergency,Home w/ Home Health Services,2022,INF002,Septicemia,ADM019,POTENTIAL COVID-19 THERAPIES,720,SEPTICEMIA AND DISSEMINATED INFECTIONS,18,INFECTIOUS AND PARASITIC DISEASES (SYSTEMIC OR UNSPECIFIED SITES),4,Extreme,Extreme,Medical,Medicare,Private Health Insurance,,,,Y,80946.67,19298.44
New York City,Manhattan,7002054,001464,New York-Presbyterian Hospital - Columbia Presbyterian Center,30 to 49,112,F,Black/African American,Not Span/Hispanic,10,Emergency,Home or Self Care,2022,INF002,Septicemia,ADM015,ADMINISTRATION OF ANTIBIOTICS,720,SEPTICEMIA AND DISSEMINATED INFECTIONS,18,INFECTIOUS AND PARASITIC DISEASES (SYSTEMIC OR UNSPECIFIED SITES),3,Major,Minor,Medical,Medicare,Private Health Insurance,Medicaid,,,Y,121667.09,25982.51
New York City,Manhattan,7002054,001464,New York-Presbyterian Hospital - Columbia Presbyterian Center,70 or Older,100,F,White,Not Span/Hispanic,22,Emergency,Expired,2022,INF002,Septicemia,HEP010,HEPATOBILIARY AND PANCREATIC DRAINAGE,720,SEPTICEMIA AND DISSEMINATED INFECTIONS,18,INFECTIOUS AND PARASITIC DISEASES (SYSTEMIC OR UNSPECIFIED SITES),4,Extreme,Extreme,Medical,Medicare,,,,,Y,567138.60,166055.87
New York City,Manhattan,7002054,001464,New York-Presbyterian Hospital - Columbia Presbyterian Center,70 or Older,100,M,Black/African American,Not Span/Hispanic,11,Emergency,Skilled Nursing Home,2022,INF002,Septicemia,ADM019,POTENTIAL COVID-19 THERAPIES,720,SEPTICEMIA AND DISSEMINATED INFECTIONS,18,INFECTIOUS AND PARASITIC DISEASES (SYSTEMIC OR UNSPECIFIED SITES),3,Major,Major,Medical,Medicare,,,,,Y,175466.40,38956.38
New York City,Manhattan,7002054,001464,New York-Presbyterian Hospital - Columbia Presbyterian Center,50 to 69,104,M,Other Race,Unknown,17,Emergency,Expired,2022,INF002,Septicemia,ADM019,POTENTIAL COVID-19 THERAPIES,720,SEPTICEMIA AND DISSEMINATED INFECTIONS,18,INFECTIOUS AND PARASITIC DISEASES (SYSTEMIC OR UNSPECIFIED SITES),4,Extreme,Extreme,Medical,Medicare,,,,,Y,269657.23,60007.20
New York City,Manhattan,7002054,001464,New York-Presbyterian Hospital - Columbia Presbyterian Center,30 to 49,112,M,Black/African American,Not Span/Hispanic,15,Emergency,Home or Self Care,2022,INF002,Septicemia,ESA001,HEMODIALYSIS,720,SEPTICEMIA AND DISSEMINATED INFECTIONS,18,INFECTIOUS AND PARASITIC DISEASES (SYSTEMIC OR UNSPECIFIED SITES),3,Major,Major,Medical,Medicaid,,,,,Y,295445.61,126817.69
New York City,Manhattan,7002054,001464,New York-Presbyterian Hospital - Columbia Presbyterian Center,70 or Older,100,F,Black/African American,Not Span/Hispanic,8,Emergency,Expired,2022,INF002,Septicemia,ESA003,MECHANICAL VENTILATION,720,SEPTICEMIA AND DISSEMINATED INFECTIONS,18,INFECTIOUS AND PARASITIC DISEASES (SYSTEMIC OR UNSPECIFIED SITES),4,Extreme,Extreme,Medical,Medicare,Private Health Insurance,,,,Y,350669.44,132053.44
New York City,Manhattan,7002054,001464,New York-Presbyterian Hospital - Columbia Presbyterian Center,70 or Older,100,F,Other Race,Spanish/Hispanic,2,Emergency,Home w/ Home Health Services,2022,INF002,Septicemia,URN006,BLADDER CATHETERIZATION AND DRAINAGE,720,SEPTICEMIA AND DISSEMINATED INFECTIONS,18,INFECTIOUS AND PARASITIC DISEASES (SYSTEMIC OR UNSPECIFIED SITES),2,Moderate,Moderate,Medical,Medicare,Medicaid,,,,Y,35124.15,7245.66
New York City,Manhattan,7002054,001464,New York-Presbyterian Hospital - Columbia Presbyterian Center,50 to 69,104,F,Black/African American,Not Span/Hispanic,10,Emergency,Expired,2022,INF002,Septicemia,CAR024,VENOUS AND ARTERIAL CATHETER PLACEMENT,720,SEPTICEMIA AND DISSEMINATED INFECTIONS,18,INFECTIOUS AND PARASITIC DISEASES (SYSTEMIC OR UNSPECIFIED SITES),4,Extreme,Extreme,Medical,Medicaid,,,,,Y,321390.56,117638.27
New York City,Manhattan,7002054,001464,New York-Presbyterian Hospital - Columbia Presbyterian Center,70 or Older,100,F,White,Not Span/Hispanic,1,Emergency,Home w/ Home Health Services,2022,INF002,Septicemia,IMG008,ULTRASONOGRAPHY,720,SEPTICEMIA AND DISSEMINATED INFECTIONS,18,INFECTIOUS AND PARASITIC DISEASES (SYSTEMIC OR UNSPECIFIED SITES),3,Major,Extreme,Medical,Medicare,Medicaid,,,,Y,38046.24,7784.57
New York City,Manhattan,7002054,001464,New York-Presbyterian Hospital - Columbia Presbyterian Center,70 or Older,100,F,Other Race,Spanish/Hispanic,4,Emergency,Skilled Nursing Home,2022,INF002,Septicemia,OTR004,ISOLATION PROCEDURES,720,SEPTICEMIA AND DISSEMINATED INFECTIONS,18,INFECTIOUS AND PARASITIC DISEASES (SYSTEMIC OR UNSPECIFIED SITES),3,Major,Major,Medical,Medicaid,,,,,Y,69016.51,16673.58
New York City,Manhattan,7002054,001464,New York-Presbyterian Hospital - Columbia Presbyterian Center,50 to 69,100,F,White,Spanish/Hispanic,8,Emergency,Home w/ Home Health Services,2022,INF002,Septicemia,URN005,NEPHROSTOMY AND URETEROSTOMY PROCEDURES (INCLUDING STENTS),720,SEPTICEMIA AND DISSEMINATED INFECTIONS,18,INFECTIOUS AND PARASITIC DISEASES (SYSTEMIC OR UNSPECIFIED SITES),2,Moderate,Moderate,Medical,Medicare,Medicaid,,,,Y,125377.96,34790.29
New York City,Manhattan,7002054,001464,New York-Presbyterian Hospital - Columbia Presbyterian Center,50 to 69,112,M,Other Race,Spanish/Hispanic,5,Emergency,Expired,2022,INF002,Septicemia,ADM019,POTENTIAL COVID-19 THERAPIES,720,SEPTICEMIA AND DISSEMINATED INFECTIONS,18,INFECTIOUS AND PARASITIC DISEASES (SYSTEMIC OR UNSPECIFIED SITES),4,Extreme,Extreme,Medical,Medicare,,,,,Y,254263.37,86018.39
New York City,Manhattan,7002054,001464,New York-Presbyterian Hospital - Columbia Presbyterian Center,18 to 29,OOS,M,Other Race,Not Span/Hispanic,2,Urgent,Home or Self Care,2022,INF002,Septicemia,OTR004,ISOLATION PROCEDURES,720,SEPTICEMIA AND DISSEMINATED INFECTIONS,18,INFECTIOUS AND PARASITIC DISEASES (SYSTEMIC OR UNSPECIFIED SITES),4,Extreme,Major,Medical,Private Health Insurance,,,,,N,55500.92,18819.66
New York City,Manhattan,7002054,001464,New York-Presbyterian Hospital - Columbia Presbyterian Center,70 or Older,100,F,White,Spanish/Hispanic,12,Emergency,Hospice - Medical Facility,2022,INF002,Septicemia,ADM021,"ADMINISTRATION OF THERAPEUTIC SUBSTANCES, NEC",720,SEPTICEMIA AND DISSEMINATED INFECTIONS,18,INFECTIOUS AND PARASITIC DISEASES (SYSTEMIC OR UNSPECIFIED SITES),4,Extreme,Extreme,Medical,Medicare,,,,,Y,225639.96,47868.45
New York City,Manhattan,7002054,001464,New York-Presbyterian Hospital - Columbia Presbyterian Center,30 to 49,100,F,Other Race,Spanish/Hispanic,7,Emergency,Home or Self Care,2022,INF002,Septicemia,ADM017,ADMINISTRATION OF NUTRITIONAL AND ELECTROLYTIC SUBSTANCES,720,SEPTICEMIA AND DISSEMINATED INFECTIONS,18,INFECTIOUS AND PARASITIC DISEASES (SYSTEMIC OR UNSPECIFIED SITES),3,Major,Extreme,Medical,Private Health Insurance,,,,,Y,133321.82,27022.66
New York City,Manhattan,7002054,001464,New York-Presbyterian Hospital - Columbia Presbyterian Center,70 or Older,100,F,White,Spanish/Hispanic,19,Emergency,Hospice - Home,2022,INF002,Septicemia,OTR004,ISOLATION PROCEDURES,720,SEPTICEMIA AND DISSEMINATED INFECTIONS,18,INFECTIOUS AND PARASITIC DISEASES (SYSTEMIC OR UNSPECIFIED SITES),4,Extreme,Extreme,Medical,Medicare,,,,,Y,266779.20,57593.67
New York City,Manhattan,7002054,001464,New York-Presbyterian Hospital - Columbia Presbyterian Center,18 to 29,100,F,Other Race,Spanish/Hispanic,1,Emergency,Home or Self Care,2022,INF002,Septicemia,ADM015,ADMINISTRATION OF ANTIBIOTICS,720,SEPTICEMIA AND DISSEMINATED INFECTIONS,18,INFECTIOUS AND PARASITIC DISEASES (SYSTEMIC OR UNSPECIFIED SITES),2,Moderate,Minor,Medical,Medicaid,,,,,Y,25094.68,5355.33
New York City,Manhattan,7002054,001464,New York-Presbyterian Hospital - Columbia Presbyterian Center,30 to 49,100,F,Other Race,Unknown,18,Emergency,Home w/ Home Health Services,2022,INF002,Septicemia,GIS017,GASTROSTOMY,720,SEPTICEMIA AND DISSEMINATED INFECTIONS,18,INFECTIOUS AND PARASITIC DISEASES (SYSTEMIC OR UNSPECIFIED SITES),4,Extreme,Extreme,Medical,Medicaid,,,,,Y,374518.19,129347.99
New York City,Manhattan,7002054,001464,New York-Presbyterian Hospital - Columbia Presbyterian Center,30 to 49,,M,White,Not Span/Hispanic,63,Urgent,Home w/ Home Health Services,2022,INF002,Septicemia,CAR024,VENOUS AND ARTERIAL CATHETER PLACEMENT,720,SEPTICEMIA AND DISSEMINATED INFECTIONS,18,INFECTIOUS AND PARASITIC DISEASES (SYSTEMIC OR UNSPECIFIED SITES),4,Extreme,Extreme,Medical,Medicaid,,,,,N,970267.54,228294.98