Hospital Service Area,Hospital County,Operating Certificate Number,Permanent Facility Id,Facility Name,Age Group,Zip Code - 3 digits,Gender,Race,Ethnicity,Length of Stay,Type of Admission,Patient Disposition,Discharge Year,CCS Diagnosis Code,CCS Diagnosis Description,CCS Procedure Code,CCS Procedure Description,APR DRG Code,APR DRG Description,APR MDC Code,APR MDC Description,APR Severity of Illness Code,APR Severity of Illness Description,APR Risk of Mortality,APR Medical Surgical Description,Payment Typology 1,Payment Typology 2,Payment Typology 3,Birth Weight,Abortion Edit Indicator,Emergency Department Indicator,Total Charges,Total Costs
New York City,Manhattan,7002054,001464,New York-Presbyterian Hospital - Columbia Presbyterian Center,70 or Older,112,F,Black/African American,Not Span/Hispanic,5,Emergency,Home or Self Care,2022,INJ037,"Complication of other surgical or medical care, injury, initial encounter",ADM015,ADMINISTRATION OF ANTIBIOTICS,721,"POST-OPERATIVE, POST-TRAUMATIC, OTHER DEVICE INFECTIONS",18,INFECTIOUS AND PARASITIC DISEASES (SYSTEMIC OR UNSPECIFIED SITES),3,Major,Major,Medical,Medicare,Medicaid,,,,Y,94632.51,20396.53
New York City,Manhattan,7002054,001464,New York-Presbyterian Hospital - Columbia Presbyterian Center,0 to 17,100,M,White,Not Span/Hispanic,20,Emergency,Home or Self Care,2022,INJ037,"Complication of other surgical or medical care, injury, initial encounter",ADM015,ADMINISTRATION OF ANTIBIOTICS,721,"POST-OPERATIVE, POST-TRAUMATIC, OTHER DEVICE INFECTIONS",18,INFECTIOUS AND PARASITIC DISEASES (SYSTEMIC OR UNSPECIFIED SITES),3,Major,Moderate,Medical,Private Health Insurance,Medicaid,,,,Y,301292.06,100074.79
New York City,Manhattan,7002054,001464,New York-Presbyterian Hospital - Columbia Presbyterian Center,0 to 17,103,M,Black/African American,Not Span/Hispanic,3,Emergency,Home or Self Care,2022,INJ037,"Complication of other surgical or medical care, injury, initial encounter",CAR029,"CARDIOVASCULAR DEVICE PROCEDURES, NEC",721,"POST-OPERATIVE, POST-TRAUMATIC, OTHER DEVICE INFECTIONS",18,INFECTIOUS AND PARASITIC DISEASES (SYSTEMIC OR UNSPECIFIED SITES),2,Moderate,Minor,Medical,Medicaid,,,,,Y,44738.55,12264.85
New York City,Manhattan,7002054,001464,New York-Presbyterian Hospital - Columbia Presbyterian Center,0 to 17,OOS,F,White,Spanish/Hispanic,12,Emergency,Home or Self Care,2022,INJ037,"Complication of other surgical or medical care, injury, initial encounter",ADM017,ADMINISTRATION OF NUTRITIONAL AND ELECTROLYTIC SUBSTANCES,721,"POST-OPERATIVE, POST-TRAUMATIC, OTHER DEVICE INFECTIONS",18,INFECTIOUS AND PARASITIC DISEASES (SYSTEMIC OR UNSPECIFIED SITES),4,Extreme,Extreme,Medical,Private Health Insurance,Medicaid,,,,Y,292724.20,106646.39
New York City,Manhattan,7002054,001464,New York-Presbyterian Hospital - Columbia Presbyterian Center,0 to 17,109,M,Multi-racial,Not Span/Hispanic,6,Emergency,Home or Self Care,2022,INJ037,"Complication of other surgical or medical care, injury, initial encounter",ADM017,ADMINISTRATION OF NUTRITIONAL AND ELECTROLYTIC SUBSTANCES,721,"POST-OPERATIVE, POST-TRAUMATIC, OTHER DEVICE INFECTIONS",18,INFECTIOUS AND PARASITIC DISEASES (SYSTEMIC OR UNSPECIFIED SITES),4,Extreme,Minor,Medical,Medicaid,,,,,Y,106425.71,23139.97
New York City,Manhattan,7002054,001464,New York-Presbyterian Hospital - Columbia Presbyterian Center,30 to 49,105,F,Other Race,Unknown,5,Emergency,Home w/ Home Health Services,2022,INJ037,"Complication of other surgical or medical care, injury, initial encounter",ADM015,ADMINISTRATION OF ANTIBIOTICS,721,"POST-OPERATIVE, POST-TRAUMATIC, OTHER DEVICE INFECTIONS",18,INFECTIOUS AND PARASITIC DISEASES (SYSTEMIC OR UNSPECIFIED SITES),3,Major,Major,Medical,Private Health Insurance,,,,,Y,84135.21,19190.09
New York City,Manhattan,7002054,001464,New York-Presbyterian Hospital - Columbia Presbyterian Center,30 to 49,100,F,Other Race,Spanish/Hispanic,7,Emergency,Home or Self Care,2022,INJ037,"Complication of other surgical or medical care, injury, initial encounter",IMG005,MAGNETIC RESONANCE IMAGING (MRI),721,"POST-OPERATIVE, POST-TRAUMATIC, OTHER DEVICE INFECTIONS",18,INFECTIOUS AND PARASITIC DISEASES (SYSTEMIC OR UNSPECIFIED SITES),3,Major,Major,Medical,Medicaid,,,,,Y,105152.67,22195.32
New York City,Manhattan,7002054,001464,New York-Presbyterian Hospital - Columbia Presbyterian Center,50 to 69,OOS,M,Other Race,Not Span/Hispanic,10,Emergency,Skilled Nursing Home,2022,INJ037,"Complication of other surgical or medical care, injury, initial encounter",CAR029,"CARDIOVASCULAR DEVICE PROCEDURES, NEC",721,"POST-OPERATIVE, POST-TRAUMATIC, OTHER DEVICE INFECTIONS",18,INFECTIOUS AND PARASITIC DISEASES (SYSTEMIC OR UNSPECIFIED SITES),4,Extreme,Extreme,Medical,Medicaid,,,,,Y,192001.73,50949.83
New York City,Manhattan,7002054,001464,New York-Presbyterian Hospital - Columbia Presbyterian Center,70 or Older,112,M,White,Not Span/Hispanic,3,Emergency,Home w/ Home Health Services,2022,INJ037,"Complication of other surgical or medical care, injury, initial encounter",HEP010,HEPATOBILIARY AND PANCREATIC DRAINAGE,721,"POST-OPERATIVE, POST-TRAUMATIC, OTHER DEVICE INFECTIONS",18,INFECTIOUS AND PARASITIC DISEASES (SYSTEMIC OR UNSPECIFIED SITES),1,Minor,Minor,Medical,Medicare,Private Health Insurance,,,,Y,68608.68,16288.53
New York City,Manhattan,7002053,001463,NYU Langone Hospitals,18 to 29,112,F,Other Race,Not Span/Hispanic,5,Emergency,Home or Self Care,2022,INJ037,"Complication of other surgical or medical care, injury, initial encounter",CAR024,VENOUS AND ARTERIAL CATHETER PLACEMENT,721,"POST-OPERATIVE, POST-TRAUMATIC, OTHER DEVICE INFECTIONS",18,INFECTIOUS AND PARASITIC DISEASES (SYSTEMIC OR UNSPECIFIED SITES),3,Major,Moderate,Medical,Medicaid,,,,,Y,107000.55,34952.45
New York City,Manhattan,7002001,001438,Bellevue Hospital Center,50 to 69,114,F,Other Race,Unknown,16,Urgent,Home w/ Home Health Services,2022,INJ037,"Complication of other surgical or medical care, injury, initial encounter",ADM015,ADMINISTRATION OF ANTIBIOTICS,721,"POST-OPERATIVE, POST-TRAUMATIC, OTHER DEVICE INFECTIONS",18,INFECTIOUS AND PARASITIC DISEASES (SYSTEMIC OR UNSPECIFIED SITES),4,Extreme,Extreme,Medical,Medicaid,,,,,N,119472.95,68706.98
New York City,Manhattan,7002001,001438,Bellevue Hospital Center,50 to 69,100,M,Other Race,Unknown,19,Emergency,Skilled Nursing Home,2022,INJ037,"Complication of other surgical or medical care, injury, initial encounter",ADM015,ADMINISTRATION OF ANTIBIOTICS,721,"POST-OPERATIVE, POST-TRAUMATIC, OTHER DEVICE INFECTIONS",18,INFECTIOUS AND PARASITIC DISEASES (SYSTEMIC OR UNSPECIFIED SITES),3,Major,Moderate,Medical,Medicaid,,,,,Y,141718.82,81500.23
New York City,Manhattan,7002053,001463,NYU Langone Hospitals,50 to 69,103,F,White,Not Span/Hispanic,5,Emergency,Home or Self Care,2022,INJ037,"Complication of other surgical or medical care, injury, initial encounter",CAR024,VENOUS AND ARTERIAL CATHETER PLACEMENT,721,"POST-OPERATIVE, POST-TRAUMATIC, OTHER DEVICE INFECTIONS",18,INFECTIOUS AND PARASITIC DISEASES (SYSTEMIC OR UNSPECIFIED SITES),3,Major,Major,Medical,Medicare,,,,,Y,111439.66,29951.20
New York City,Manhattan,7002053,001463,NYU Langone Hospitals,50 to 69,100,M,Other Race,Not Span/Hispanic,14,Emergency,Home or Self Care,2022,DIG016,Peritonitis and intra-abdominal abscess,GIS006,PARACENTESIS,721,"POST-OPERATIVE, POST-TRAUMATIC, OTHER DEVICE INFECTIONS",18,INFECTIOUS AND PARASITIC DISEASES (SYSTEMIC OR UNSPECIFIED SITES),3,Major,Moderate,Medical,Private Health Insurance,,,,,Y,250984.89,75362.15
Finger Lakes,Monroe,2701005,000413,Strong Memorial Hospital,30 to 49,146,F,White,Not Span/Hispanic,3,Urgent,Home or Self Care,2022,INJ037,"Complication of other surgical or medical care, injury, initial encounter",,,721,"POST-OPERATIVE, POST-TRAUMATIC, OTHER DEVICE INFECTIONS",18,INFECTIOUS AND PARASITIC DISEASES (SYSTEMIC OR UNSPECIFIED SITES),2,Moderate,Minor,Medical,Medicaid,,,,,N,18052.66,9723.94
Finger Lakes,Monroe,2701005,000413,Strong Memorial Hospital,70 or Older,145,F,White,Not Span/Hispanic,6,Emergency,Home w/ Home Health Services,2022,INJ037,"Complication of other surgical or medical care, injury, initial encounter",GNR008,"ABDOMINAL WALL PROCEDURES, NEC",721,"POST-OPERATIVE, POST-TRAUMATIC, OTHER DEVICE INFECTIONS",18,INFECTIOUS AND PARASITIC DISEASES (SYSTEMIC OR UNSPECIFIED SITES),2,Moderate,Moderate,Medical,Medicare,,,,,Y,21572.57,9678.84
Finger Lakes,Monroe,2701005,000413,Strong Memorial Hospital,50 to 69,146,F,Black/African American,Not Span/Hispanic,6,Urgent,Home w/ Home Health Services,2022,INJ037,"Complication of other surgical or medical care, injury, initial encounter",CAR025,PLACEMENT OF TUNNELED OR IMPLANTABLE PORTION OF A VASCULAR ACCESS DEVICE,721,"POST-OPERATIVE, POST-TRAUMATIC, OTHER DEVICE INFECTIONS",18,INFECTIOUS AND PARASITIC DISEASES (SYSTEMIC OR UNSPECIFIED SITES),4,Extreme,Major,Medical,Medicare,Medicaid,,,,N,66767.12,23905.09
Finger Lakes,Monroe,2701005,000413,Strong Memorial Hospital,50 to 69,144,M,White,Not Span/Hispanic,4,Urgent,Home w/ Home Health Services,2022,INJ037,"Complication of other surgical or medical care, injury, initial encounter",MST003,"SUBCUTANEOUS TISSUE, FASCIA, AND MUSCLE BIOPSY",721,"POST-OPERATIVE, POST-TRAUMATIC, OTHER DEVICE INFECTIONS",18,INFECTIOUS AND PARASITIC DISEASES (SYSTEMIC OR UNSPECIFIED SITES),3,Major,Minor,Medical,Medicare,Medicaid,,,,N,21562.15,10678.15
Finger Lakes,Monroe,2701005,000413,Strong Memorial Hospital,30 to 49,144,M,White,Not Span/Hispanic,120 +,Urgent,Home or Self Care,2022,INJ037,"Complication of other surgical or medical care, injury, initial encounter",ESA003,MECHANICAL VENTILATION,721,"POST-OPERATIVE, POST-TRAUMATIC, OTHER DEVICE INFECTIONS",18,INFECTIOUS AND PARASITIC DISEASES (SYSTEMIC OR UNSPECIFIED SITES),4,Extreme,Extreme,Medical,Private Health Insurance,Medicaid,,,,N,1364044.46,567033.60
Finger Lakes,Monroe,2701005,000413,Strong Memorial Hospital,50 to 69,145,F,White,Not Span/Hispanic,14,Urgent,Home w/ Home Health Services,2022,INJ037,"Complication of other surgical or medical care, injury, initial encounter",ADM018,IRRIGATION (DIAGNOSTIC AND THERAPEUTIC),721,"POST-OPERATIVE, POST-TRAUMATIC, OTHER DEVICE INFECTIONS",18,INFECTIOUS AND PARASITIC DISEASES (SYSTEMIC OR UNSPECIFIED SITES),3,Major,Major,Medical,Private Health Insurance,,,,,N,106309.67,56925.03
Finger Lakes,Monroe,2701005,000413,Strong Memorial Hospital,30 to 49,145,F,White,Not Span/Hispanic,1,Emergency,Home or Self Care,2022,INJ037,"Complication of other surgical or medical care, injury, initial encounter",,,721,"POST-OPERATIVE, POST-TRAUMATIC, OTHER DEVICE INFECTIONS",18,INFECTIOUS AND PARASITIC DISEASES (SYSTEMIC OR UNSPECIFIED SITES),2,Moderate,Minor,Medical,Medicaid,,,,,Y,7615.50,2353.49
Finger Lakes,Monroe,2701005,000413,Strong Memorial Hospital,50 to 69,145,M,Other Race,Unknown,4,Urgent,Home or Self Care,2022,INJ037,"Complication of other surgical or medical care, injury, initial encounter",,,721,"POST-OPERATIVE, POST-TRAUMATIC, OTHER DEVICE INFECTIONS",18,INFECTIOUS AND PARASITIC DISEASES (SYSTEMIC OR UNSPECIFIED SITES),2,Moderate,Minor,Medical,Medicare,,,,,N,10226.93,5300.16
New York City,Manhattan,7002053,001463,NYU Langone Hospitals,50 to 69,117,M,White,Not Span/Hispanic,24,Emergency,Inpatient Rehabilitation Facility,2022,INJ037,"Complication of other surgical or medical care, injury, initial encounter",ADM019,POTENTIAL COVID-19 THERAPIES,721,"POST-OPERATIVE, POST-TRAUMATIC, OTHER DEVICE INFECTIONS",18,INFECTIOUS AND PARASITIC DISEASES (SYSTEMIC OR UNSPECIFIED SITES),4,Extreme,Extreme,Medical,Medicaid,,,,,N,560774.78,204266.57
New York City,Manhattan,7002053,001463,NYU Langone Hospitals,50 to 69,113,M,White,Not Span/Hispanic,3,Emergency,Home or Self Care,2022,INJ037,"Complication of other surgical or medical care, injury, initial encounter",OTR004,ISOLATION PROCEDURES,721,"POST-OPERATIVE, POST-TRAUMATIC, OTHER DEVICE INFECTIONS",18,INFECTIOUS AND PARASITIC DISEASES (SYSTEMIC OR UNSPECIFIED SITES),4,Extreme,Major,Medical,Medicare,Medicaid,,,,Y,64557.66,19434.11
New York City,Manhattan,7002053,001463,NYU Langone Hospitals,18 to 29,112,F,Other Race,Not Span/Hispanic,15,Emergency,Home or Self Care,2022,INJ037,"Complication of other surgical or medical care, injury, initial encounter",IMG002,FLUOROSCOPIC ANGIOGRAPHY (EXCLUDING CORONARY),721,"POST-OPERATIVE, POST-TRAUMATIC, OTHER DEVICE INFECTIONS",18,INFECTIOUS AND PARASITIC DISEASES (SYSTEMIC OR UNSPECIFIED SITES),4,Extreme,Major,Medical,Medicare,Medicaid,,,,Y,279302.42,103004.09
New York City,Manhattan,7002053,001463,NYU Langone Hospitals,50 to 69,104,M,Black/African American,Not Span/Hispanic,2,Emergency,Home w/ Home Health Services,2022,INJ037,"Complication of other surgical or medical care, injury, initial encounter",GIS006,PARACENTESIS,721,"POST-OPERATIVE, POST-TRAUMATIC, OTHER DEVICE INFECTIONS",18,INFECTIOUS AND PARASITIC DISEASES (SYSTEMIC OR UNSPECIFIED SITES),3,Major,Major,Medical,Blue Cross/Blue Shield,,,,,N,100639.36,21962.76
New York City,Manhattan,7002053,001463,NYU Langone Hospitals,50 to 69,100,M,Other Race,Not Span/Hispanic,4,Emergency,Home or Self Care,2022,INJ037,"Complication of other surgical or medical care, injury, initial encounter",,,721,"POST-OPERATIVE, POST-TRAUMATIC, OTHER DEVICE INFECTIONS",18,INFECTIOUS AND PARASITIC DISEASES (SYSTEMIC OR UNSPECIFIED SITES),2,Moderate,Major,Medical,Medicaid,,,,,Y,74274.62,21847.71
New York City,Manhattan,7002001,001438,Bellevue Hospital Center,30 to 49,112,F,Black/African American,Unknown,1,Emergency,Home or Self Care,2022,INJ037,"Complication of other surgical or medical care, injury, initial encounter",ADM015,ADMINISTRATION OF ANTIBIOTICS,721,"POST-OPERATIVE, POST-TRAUMATIC, OTHER DEVICE INFECTIONS",18,INFECTIOUS AND PARASITIC DISEASES (SYSTEMIC OR UNSPECIFIED SITES),2,Moderate,Moderate,Medical,Private Health Insurance,,,,,Y,13627.38,7836.89
Finger Lakes,Monroe,2701005,000413,Strong Memorial Hospital,0 to 17,145,F,White,Not Span/Hispanic,20,Emergency,Home or Self Care,2022,INJ037,"Complication of other surgical or medical care, injury, initial encounter",ADM017,ADMINISTRATION OF NUTRITIONAL AND ELECTROLYTIC SUBSTANCES,721,"POST-OPERATIVE, POST-TRAUMATIC, OTHER DEVICE INFECTIONS",18,INFECTIOUS AND PARASITIC DISEASES (SYSTEMIC OR UNSPECIFIED SITES),4,Extreme,Extreme,Medical,Medicaid,,,01900,,Y,104870.61,48638.50
Finger Lakes,Monroe,2701005,000413,Strong Memorial Hospital,0 to 17,146,M,Other Race,Spanish/Hispanic,8,Emergency,Home or Self Care,2022,INJ037,"Complication of other surgical or medical care, injury, initial encounter",ADM017,ADMINISTRATION OF NUTRITIONAL AND ELECTROLYTIC SUBSTANCES,721,"POST-OPERATIVE, POST-TRAUMATIC, OTHER DEVICE INFECTIONS",18,INFECTIOUS AND PARASITIC DISEASES (SYSTEMIC OR UNSPECIFIED SITES),3,Major,Moderate,Medical,Medicaid,,,,,Y,46149.95,22275.08
New York City,Manhattan,7002054,001464,New York-Presbyterian Hospital - Columbia Presbyterian Center,18 to 29,112,M,White,Not Span/Hispanic,14,Emergency,Home w/ Home Health Services,2022,INJ037,"Complication of other surgical or medical care, injury, initial encounter",MST028,"SUBCUTANEOUS TISSUE AND FASCIA PROCEDURES, NEC",721,"POST-OPERATIVE, POST-TRAUMATIC, OTHER DEVICE INFECTIONS",18,INFECTIOUS AND PARASITIC DISEASES (SYSTEMIC OR UNSPECIFIED SITES),3,Major,Minor,Medical,Private Health Insurance,Medicaid,,,,Y,201170.85,67347.44
New York City,Manhattan,7002054,001464,New York-Presbyterian Hospital - Columbia Presbyterian Center,0 to 17,107,M,Black/African American,Not Span/Hispanic,5,Emergency,Home w/ Home Health Services,2022,INJ037,"Complication of other surgical or medical care, injury, initial encounter",ADM001,TRANSFUSION OF BLOOD AND BLOOD PRODUCTS,721,"POST-OPERATIVE, POST-TRAUMATIC, OTHER DEVICE INFECTIONS",18,INFECTIOUS AND PARASITIC DISEASES (SYSTEMIC OR UNSPECIFIED SITES),3,Major,Minor,Medical,Medicaid,,,,,Y,71154.91,22867.56
New York City,Manhattan,7002054,001464,New York-Presbyterian Hospital - Columbia Presbyterian Center,0 to 17,100,M,Other Race,Unknown,8,Elective,Home or Self Care,2022,INJ037,"Complication of other surgical or medical care, injury, initial encounter",,,721,"POST-OPERATIVE, POST-TRAUMATIC, OTHER DEVICE INFECTIONS",18,INFECTIOUS AND PARASITIC DISEASES (SYSTEMIC OR UNSPECIFIED SITES),3,Major,Major,Medical,Private Health Insurance,,,,,N,212614.86,54105.96
New York City,Manhattan,7002054,001464,New York-Presbyterian Hospital - Columbia Presbyterian Center,18 to 29,100,M,Black/African American,Not Span/Hispanic,26,Emergency,Cancer Center or Children's Hospital,2022,INJ037,"Complication of other surgical or medical care, injury, initial encounter",CAR024,VENOUS AND ARTERIAL CATHETER PLACEMENT,721,"POST-OPERATIVE, POST-TRAUMATIC, OTHER DEVICE INFECTIONS",18,INFECTIOUS AND PARASITIC DISEASES (SYSTEMIC OR UNSPECIFIED SITES),2,Moderate,Extreme,Medical,Private Health Insurance,Medicaid,,,,Y,801498.18,362739.46
New York City,Manhattan,7002054,001464,New York-Presbyterian Hospital - Columbia Presbyterian Center,50 to 69,113,M,Other Race,Not Span/Hispanic,5,Emergency,Home or Self Care,2022,INJ037,"Complication of other surgical or medical care, injury, initial encounter",HEP009,PANCREATIC AND PROXIMAL BILIARY DILATION AND STENTING,721,"POST-OPERATIVE, POST-TRAUMATIC, OTHER DEVICE INFECTIONS",18,INFECTIOUS AND PARASITIC DISEASES (SYSTEMIC OR UNSPECIFIED SITES),4,Extreme,Major,Medical,Medicare,,,,,Y,97211.93,23593.10
New York City,Manhattan,7002001,001438,Bellevue Hospital Center,30 to 49,103,F,Black/African American,Unknown,5,Emergency,Home or Self Care,2022,INJ037,"Complication of other surgical or medical care, injury, initial encounter",GIS024,OTHER PERITONEAL CAVITY PROCEDURES,721,"POST-OPERATIVE, POST-TRAUMATIC, OTHER DEVICE INFECTIONS",18,INFECTIOUS AND PARASITIC DISEASES (SYSTEMIC OR UNSPECIFIED SITES),3,Major,Major,Medical,Private Health Insurance,Medicaid,,,,Y,48124.50,27675.63
New York City,Manhattan,7002053,001463,NYU Langone Hospitals,50 to 69,103,F,Other Race,Spanish/Hispanic,8,Elective,Home or Self Care,2022,INJ037,"Complication of other surgical or medical care, injury, initial encounter",MST020,SUBCUTANEOUS TISSUE AND FASCIA EXCISION,721,"POST-OPERATIVE, POST-TRAUMATIC, OTHER DEVICE INFECTIONS",18,INFECTIOUS AND PARASITIC DISEASES (SYSTEMIC OR UNSPECIFIED SITES),2,Moderate,Moderate,Medical,Private Health Insurance,,,,,N,159607.06,43768.73
New York City,Manhattan,7002053,001463,NYU Langone Hospitals,70 or Older,112,F,White,Not Span/Hispanic,7,Emergency,Home w/ Home Health Services,2022,INJ037,"Complication of other surgical or medical care, injury, initial encounter",CAR024,VENOUS AND ARTERIAL CATHETER PLACEMENT,721,"POST-OPERATIVE, POST-TRAUMATIC, OTHER DEVICE INFECTIONS",18,INFECTIOUS AND PARASITIC DISEASES (SYSTEMIC OR UNSPECIFIED SITES),4,Extreme,Extreme,Medical,Medicare,Medicaid,,,,Y,178866.09,44346.72
New York City,Manhattan,7002053,001463,NYU Langone Hospitals,18 to 29,112,M,White,Not Span/Hispanic,2,Emergency,Home or Self Care,2022,INJ037,"Complication of other surgical or medical care, injury, initial encounter",ENT006,ENT DRAINAGE (EXCLUDING MYRINGOTOMY),721,"POST-OPERATIVE, POST-TRAUMATIC, OTHER DEVICE INFECTIONS",18,INFECTIOUS AND PARASITIC DISEASES (SYSTEMIC OR UNSPECIFIED SITES),2,Moderate,Minor,Medical,Blue Cross/Blue Shield,,,,,Y,51477.48,16546.98
New York City,Manhattan,7002053,001463,NYU Langone Hospitals,18 to 29,OOS,F,Multi-racial,Not Span/Hispanic,7,Emergency,Home or Self Care,2022,INJ037,"Complication of other surgical or medical care, injury, initial encounter",CAR024,VENOUS AND ARTERIAL CATHETER PLACEMENT,721,"POST-OPERATIVE, POST-TRAUMATIC, OTHER DEVICE INFECTIONS",18,INFECTIOUS AND PARASITIC DISEASES (SYSTEMIC OR UNSPECIFIED SITES),4,Extreme,Major,Medical,Blue Cross/Blue Shield,,,,,Y,213661.97,31725.85
New York City,Manhattan,7002053,001463,NYU Langone Hospitals,50 to 69,112,F,Multi-racial,Spanish/Hispanic,10,Emergency,Left Against Medical Advice,2022,INJ037,"Complication of other surgical or medical care, injury, initial encounter",OTR004,ISOLATION PROCEDURES,721,"POST-OPERATIVE, POST-TRAUMATIC, OTHER DEVICE INFECTIONS",18,INFECTIOUS AND PARASITIC DISEASES (SYSTEMIC OR UNSPECIFIED SITES),3,Major,Moderate,Medical,Medicaid,,,,,Y,133540.59,49817.37
New York City,Manhattan,7002053,001463,NYU Langone Hospitals,30 to 49,112,F,Other Race,Spanish/Hispanic,15,Emergency,Home w/ Home Health Services,2022,INJ037,"Complication of other surgical or medical care, injury, initial encounter",CAR024,VENOUS AND ARTERIAL CATHETER PLACEMENT,721,"POST-OPERATIVE, POST-TRAUMATIC, OTHER DEVICE INFECTIONS",18,INFECTIOUS AND PARASITIC DISEASES (SYSTEMIC OR UNSPECIFIED SITES),2,Moderate,Major,Medical,Medicaid,,,,,Y,298550.42,86943.54
New York City,Manhattan,7002053,001463,NYU Langone Hospitals,70 or Older,112,M,Black/African American,Not Span/Hispanic,4,Emergency,Home w/ Home Health Services,2022,INJ037,"Complication of other surgical or medical care, injury, initial encounter",URN006,BLADDER CATHETERIZATION AND DRAINAGE,721,"POST-OPERATIVE, POST-TRAUMATIC, OTHER DEVICE INFECTIONS",18,INFECTIOUS AND PARASITIC DISEASES (SYSTEMIC OR UNSPECIFIED SITES),3,Major,Major,Medical,Blue Cross/Blue Shield,Medicare,,,,Y,118301.75,29858.90
New York City,Manhattan,7002053,001463,NYU Langone Hospitals,50 to 69,110,M,White,Not Span/Hispanic,8,Emergency,Home w/ Home Health Services,2022,INJ037,"Complication of other surgical or medical care, injury, initial encounter",CAR025,PLACEMENT OF TUNNELED OR IMPLANTABLE PORTION OF A VASCULAR ACCESS DEVICE,721,"POST-OPERATIVE, POST-TRAUMATIC, OTHER DEVICE INFECTIONS",18,INFECTIOUS AND PARASITIC DISEASES (SYSTEMIC OR UNSPECIFIED SITES),3,Major,Major,Medical,Private Health Insurance,,,,,Y,183367.42,47604.31
New York City,Manhattan,7002053,001463,NYU Langone Hospitals,30 to 49,103,F,White,Not Span/Hispanic,10,Emergency,Home or Self Care,2022,INJ037,"Complication of other surgical or medical care, injury, initial encounter",CAR024,VENOUS AND ARTERIAL CATHETER PLACEMENT,721,"POST-OPERATIVE, POST-TRAUMATIC, OTHER DEVICE INFECTIONS",18,INFECTIOUS AND PARASITIC DISEASES (SYSTEMIC OR UNSPECIFIED SITES),4,Extreme,Major,Medical,Medicare,Medicaid,,,,Y,223482.61,54185.53
New York City,Manhattan,7002053,001463,NYU Langone Hospitals,30 to 49,103,F,White,Not Span/Hispanic,5,Emergency,Home w/ Home Health Services,2022,INJ037,"Complication of other surgical or medical care, injury, initial encounter",CAR029,"CARDIOVASCULAR DEVICE PROCEDURES, NEC",721,"POST-OPERATIVE, POST-TRAUMATIC, OTHER DEVICE INFECTIONS",18,INFECTIOUS AND PARASITIC DISEASES (SYSTEMIC OR UNSPECIFIED SITES),3,Major,Moderate,Medical,Blue Cross/Blue Shield,Medicaid,,,,Y,122192.52,33658.60
New York City,Manhattan,7002053,001463,NYU Langone Hospitals,70 or Older,100,M,White,Not Span/Hispanic,6,Emergency,Skilled Nursing Home,2022,INJ037,"Complication of other surgical or medical care, injury, initial encounter",MAM006,PACEMAKER AND DEFIBRILLATOR INTERROGATION,721,"POST-OPERATIVE, POST-TRAUMATIC, OTHER DEVICE INFECTIONS",18,INFECTIOUS AND PARASITIC DISEASES (SYSTEMIC OR UNSPECIFIED SITES),3,Major,Major,Medical,Medicare,Private Health Insurance,,,,Y,83768.36,31293.11
New York City,Manhattan,7002001,001438,Bellevue Hospital Center,50 to 69,112,M,White,Not Span/Hispanic,7,Emergency,Home or Self Care,2022,INJ037,"Complication of other surgical or medical care, injury, initial encounter",GNR008,"ABDOMINAL WALL PROCEDURES, NEC",721,"POST-OPERATIVE, POST-TRAUMATIC, OTHER DEVICE INFECTIONS",18,INFECTIOUS AND PARASITIC DISEASES (SYSTEMIC OR UNSPECIFIED SITES),2,Moderate,Minor,Medical,Private Health Insurance,,,,,Y,60803.36,34967.04