Hospital Service Area,Hospital County,Operating Certificate Number,Permanent Facility Id,Facility Name,Age Group,Zip Code - 3 digits,Gender,Race,Ethnicity,Length of Stay,Type of Admission,Patient Disposition,Discharge Year,CCS Diagnosis Code,CCS Diagnosis Description,CCS Procedure Code,CCS Procedure Description,APR DRG Code,APR DRG Description,APR MDC Code,APR MDC Description,APR Severity of Illness Code,APR Severity of Illness Description,APR Risk of Mortality,APR Medical Surgical Description,Payment Typology 1,Payment Typology 2,Payment Typology 3,Birth Weight,Abortion Edit Indicator,Emergency Department Indicator,Total Charges,Total Costs
New York City,Manhattan,7002001,001438,Bellevue Hospital Center,30 to 49,104,M,Black/African American,Not Span/Hispanic,1,Emergency,Home or Self Care,2022,INJ011,"Open wounds of head and neck, initial encounter",EYP001,EYE PROCEDURES,073,ORBIT AND EYE PROCEDURES,02,DISEASES AND DISORDERS OF THE EYE,2,Moderate,Minor,Surgical,Medicaid,,,,,Y,27015.08,15535.94
New York City,Manhattan,7002001,001438,Bellevue Hospital Center,50 to 69,107,M,Other Race,Unknown,3,Urgent,Home or Self Care,2022,INJ011,"Open wounds of head and neck, initial encounter",EYP002,EYELID PROCEDURES,073,ORBIT AND EYE PROCEDURES,02,DISEASES AND DISORDERS OF THE EYE,2,Moderate,Minor,Surgical,Private Health Insurance,,,,,N,33928.48,19511.73
Finger Lakes,Monroe,2701005,000413,Strong Memorial Hospital,0 to 17,146,F,Black/African American,Not Span/Hispanic,2,Emergency,Home or Self Care,2022,INJ011,"Open wounds of head and neck, initial encounter",SKB006,SKIN LACERATION REPAIR (EXCLUDING PERINEUM),073,ORBIT AND EYE PROCEDURES,02,DISEASES AND DISORDERS OF THE EYE,2,Moderate,Minor,Surgical,Blue Cross/Blue Shield,,,,,Y,26417.36,12650.11
New York City,Manhattan,7002001,001438,Bellevue Hospital Center,0 to 17,104,F,Black/African American,Unknown,1,Elective,Home or Self Care,2022,MAL005,"Congenital malformations of eye, ear, face, neck",EYP001,EYE PROCEDURES,073,ORBIT AND EYE PROCEDURES,02,DISEASES AND DISORDERS OF THE EYE,3,Major,Minor,Surgical,Medicaid,,,,,N,14434.98,8301.33
New York City,Manhattan,7002001,001438,Bellevue Hospital Center,30 to 49,113,F,Other Race,Spanish/Hispanic,1,Emergency,Home or Self Care,2022,EYE005,Retinal and vitreous conditions,EYP001,EYE PROCEDURES,073,ORBIT AND EYE PROCEDURES,02,DISEASES AND DISORDERS OF THE EYE,1,Minor,Minor,Surgical,Medicaid,,,,,Y,26123.63,15023.28
New York City,Manhattan,7002001,001438,Bellevue Hospital Center,50 to 69,113,F,Other Race,Unknown,1,Elective,Home or Self Care,2022,EYE003,Glaucoma,EYP001,EYE PROCEDURES,073,ORBIT AND EYE PROCEDURES,02,DISEASES AND DISORDERS OF THE EYE,1,Minor,Minor,Surgical,Medicaid,,,,,N,17446.39,10033.14
New York City,Manhattan,7002001,001438,Bellevue Hospital Center,30 to 49,100,M,White,Unknown,4,Emergency,Home or Self Care,2022,END003,Diabetes mellitus with complication,EYP001,EYE PROCEDURES,073,ORBIT AND EYE PROCEDURES,02,DISEASES AND DISORDERS OF THE EYE,2,Moderate,Moderate,Surgical,Private Health Insurance,,,,,Y,38926.29,22385.89
New York City,Manhattan,7002001,001438,Bellevue Hospital Center,70 or Older,100,F,Black/African American,Not Span/Hispanic,1,Elective,Home or Self Care,2022,EYE002,Cataract and other lens disorders,EYP001,EYE PROCEDURES,073,ORBIT AND EYE PROCEDURES,02,DISEASES AND DISORDERS OF THE EYE,1,Minor,Minor,Surgical,Self-Pay,,,,,N,16685.05,9595.31
New York City,Manhattan,7002001,001438,Bellevue Hospital Center,50 to 69,100,M,Multi-racial,Unknown,7,Emergency,Home or Self Care,2022,INJ037,"Complication of other surgical or medical care, injury, initial encounter",EYP001,EYE PROCEDURES,073,ORBIT AND EYE PROCEDURES,02,DISEASES AND DISORDERS OF THE EYE,3,Major,Minor,Surgical,Medicaid,,,,,Y,89875.07,51685.71
New York City,Manhattan,7002001,001438,Bellevue Hospital Center,50 to 69,112,M,Black/African American,Unknown,1,Elective,Home or Self Care,2022,EYE003,Glaucoma,EYP001,EYE PROCEDURES,073,ORBIT AND EYE PROCEDURES,02,DISEASES AND DISORDERS OF THE EYE,1,Minor,Minor,Surgical,Medicaid,,,,,N,20157.16,11592.06
Finger Lakes,Monroe,2701005,000413,Strong Memorial Hospital,0 to 17,146,M,Black/African American,Not Span/Hispanic,2,Emergency,Home or Self Care,2022,INJ011,"Open wounds of head and neck, initial encounter",EYP001,EYE PROCEDURES,073,ORBIT AND EYE PROCEDURES,02,DISEASES AND DISORDERS OF THE EYE,2,Moderate,Minor,Surgical,Medicaid,,,,,Y,32995.65,14767.50
Finger Lakes,Monroe,2701005,000413,Strong Memorial Hospital,70 or Older,146,M,White,Not Span/Hispanic,14,Emergency,Home w/ Home Health Services,2022,EYE004,Uveitis and ocular inflammation,EYP001,EYE PROCEDURES,073,ORBIT AND EYE PROCEDURES,02,DISEASES AND DISORDERS OF THE EYE,3,Major,Moderate,Surgical,Medicare,,,,,Y,76072.86,32678.03
Finger Lakes,Monroe,2701005,000413,Strong Memorial Hospital,70 or Older,146,M,White,Not Span/Hispanic,2,Elective,Skilled Nursing Home,2022,EYE002,Cataract and other lens disorders,EYP001,EYE PROCEDURES,073,ORBIT AND EYE PROCEDURES,02,DISEASES AND DISORDERS OF THE EYE,3,Major,Major,Surgical,Federal/State/Local/VA,,,,,N,19406.99,9216.38
New York City,Manhattan,7002054,001464,New York-Presbyterian Hospital - Columbia Presbyterian Center,70 or Older,104,F,Other Race,Unknown,7,Urgent,Home w/ Home Health Services,2022,EYE008,Oculofacial plastics and orbital conditions,MST002,BONE AND JOINT BIOPSY,073,ORBIT AND EYE PROCEDURES,02,DISEASES AND DISORDERS OF THE EYE,3,Major,Moderate,Surgical,Medicare,Medicaid,,,,N,158657.43,37894.00
New York City,Manhattan,7002054,001464,New York-Presbyterian Hospital - Columbia Presbyterian Center,18 to 29,100,F,White,Spanish/Hispanic,1,Elective,Home or Self Care,2022,INJ001,"Fracture of head and neck, initial encounter",MST012,BONE FIXATION (EXCLUDING EXTREMITIES),073,ORBIT AND EYE PROCEDURES,02,DISEASES AND DISORDERS OF THE EYE,3,Major,Moderate,Surgical,Medicaid,,,,,N,57892.61,20303.11
New York City,Manhattan,7002054,001464,New York-Presbyterian Hospital - Columbia Presbyterian Center,50 to 69,100,M,Other Race,Not Span/Hispanic,12,Emergency,Skilled Nursing Home,2022,EYE003,Glaucoma,EYP001,EYE PROCEDURES,073,ORBIT AND EYE PROCEDURES,02,DISEASES AND DISORDERS OF THE EYE,3,Major,Minor,Surgical,Medicare,,,,,Y,221024.78,56324.96
New York City,Manhattan,7002001,001438,Bellevue Hospital Center,70 or Older,104,M,Black/African American,Unknown,1,Elective,Home or Self Care,2022,EYE002,Cataract and other lens disorders,EYP001,EYE PROCEDURES,073,ORBIT AND EYE PROCEDURES,02,DISEASES AND DISORDERS OF THE EYE,1,Minor,Minor,Surgical,Medicare,Medicaid,,,,N,20616.61,11856.28
New York City,Manhattan,7002053,001463,NYU Langone Hospitals,0 to 17,117,F,White,Not Span/Hispanic,1,Elective,Home or Self Care,2022,NEO073,Benign neoplasms,MST018,BONE EXCISION,073,ORBIT AND EYE PROCEDURES,02,DISEASES AND DISORDERS OF THE EYE,1,Minor,Minor,Surgical,Private Health Insurance,,,,,N,211182.22,32570.15
New York City,Manhattan,7002001,001438,Bellevue Hospital Center,30 to 49,OOS,M,Other Race,Spanish/Hispanic,2,Emergency,Home or Self Care,2022,INJ011,"Open wounds of head and neck, initial encounter",EYP001,EYE PROCEDURES,073,ORBIT AND EYE PROCEDURES,02,DISEASES AND DISORDERS OF THE EYE,1,Minor,Minor,Surgical,Miscellaneous/Other,,,,,Y,27645.97,15898.76
New York City,Manhattan,7002001,001438,Bellevue Hospital Center,50 to 69,103,M,Black/African American,Not Span/Hispanic,1,Elective,Home or Self Care,2022,EYE002,Cataract and other lens disorders,EYP001,EYE PROCEDURES,073,ORBIT AND EYE PROCEDURES,02,DISEASES AND DISORDERS OF THE EYE,2,Moderate,Minor,Surgical,Medicaid,,,,,N,17993.11,10347.55
New York City,Manhattan,7002001,001438,Bellevue Hospital Center,30 to 49,100,M,Black/African American,Unknown,2,Elective,Home or Self Care,2022,EYE003,Glaucoma,EYP001,EYE PROCEDURES,073,ORBIT AND EYE PROCEDURES,02,DISEASES AND DISORDERS OF THE EYE,1,Minor,Minor,Surgical,Medicaid,,,,,N,39424.68,22672.50
New York City,Manhattan,7002001,001438,Bellevue Hospital Center,70 or Older,112,M,Other Race,Spanish/Hispanic,1,Elective,Home or Self Care,2022,EYE001,Cornea and external disease,EYP001,EYE PROCEDURES,073,ORBIT AND EYE PROCEDURES,02,DISEASES AND DISORDERS OF THE EYE,1,Minor,Minor,Surgical,Medicare,Medicaid,,,,N,20570.94,11830.02
New York City,Manhattan,7002054,001464,New York-Presbyterian Hospital - Columbia Presbyterian Center,18 to 29,100,M,Other Race,Spanish/Hispanic,1,Emergency,Home or Self Care,2022,INJ011,"Open wounds of head and neck, initial encounter",MST012,BONE FIXATION (EXCLUDING EXTREMITIES),073,ORBIT AND EYE PROCEDURES,02,DISEASES AND DISORDERS OF THE EYE,2,Moderate,Minor,Surgical,Private Health Insurance,,,,,Y,56705.96,14566.36
Long Island,Nassau,2951001,000541,North Shore University Hospital,70 or Older,115,F,White,Not Span/Hispanic,1,Emergency,Home or Self Care,2022,INJ011,"Open wounds of head and neck, initial encounter",EYP001,EYE PROCEDURES,073,ORBIT AND EYE PROCEDURES,02,DISEASES AND DISORDERS OF THE EYE,2,Moderate,Minor,Surgical,Medicare,Private Health Insurance,,,,Y,48349.25,7865.34
New York City,Manhattan,7002053,001463,NYU Langone Hospitals,0 to 17,115,M,White,Not Span/Hispanic,6,Emergency,Home or Self Care,2022,EYE008,Oculofacial plastics and orbital conditions,MST004,INCISION AND DRAINAGE OF MUSCULOSKELETAL TISSUE AND JOINTS,073,ORBIT AND EYE PROCEDURES,02,DISEASES AND DISORDERS OF THE EYE,2,Moderate,Minor,Surgical,Blue Cross/Blue Shield,,,,,Y,152000.86,30558.69
New York City,Manhattan,7002001,001438,Bellevue Hospital Center,50 to 69,100,M,Other Race,Unknown,3,Emergency,Left Against Medical Advice,2022,INJ011,"Open wounds of head and neck, initial encounter",EYP002,EYELID PROCEDURES,073,ORBIT AND EYE PROCEDURES,02,DISEASES AND DISORDERS OF THE EYE,1,Minor,Minor,Surgical,Medicaid,,,,,Y,38774.70,22298.71
New York City,Manhattan,7002054,001464,New York-Presbyterian Hospital - Columbia Presbyterian Center,30 to 49,100,F,Black/African American,Not Span/Hispanic,1,Emergency,Home or Self Care,2022,EYE004,Uveitis and ocular inflammation,EYP001,EYE PROCEDURES,073,ORBIT AND EYE PROCEDURES,02,DISEASES AND DISORDERS OF THE EYE,3,Major,Minor,Surgical,Medicaid,,,,,Y,52615.81,
New York City,Manhattan,7002054,001464,New York-Presbyterian Hospital - Columbia Presbyterian Center,70 or Older,100,F,Other Race,Unknown,1,Elective,Home or Self Care,2022,EYE008,Oculofacial plastics and orbital conditions,MST029,"MUSCULOSKELETAL DEVICE PROCEDURES, NEC",073,ORBIT AND EYE PROCEDURES,02,DISEASES AND DISORDERS OF THE EYE,1,Minor,Minor,Surgical,Medicare,Medicaid,,,,N,87225.22,
New York City,Manhattan,7002054,001464,New York-Presbyterian Hospital - Columbia Presbyterian Center,30 to 49,100,M,Black/African American,Not Span/Hispanic,2,Elective,Home or Self Care,2022,EYE001,Cornea and external disease,EYP001,EYE PROCEDURES,073,ORBIT AND EYE PROCEDURES,02,DISEASES AND DISORDERS OF THE EYE,1,Minor,Minor,Surgical,Blue Cross/Blue Shield,,,,,N,73053.74,24691.45
New York City,Manhattan,7002054,001464,New York-Presbyterian Hospital - Columbia Presbyterian Center,30 to 49,100,M,Other Race,Unknown,5,Urgent,Home or Self Care,2022,EYE008,Oculofacial plastics and orbital conditions,MST002,BONE AND JOINT BIOPSY,073,ORBIT AND EYE PROCEDURES,02,DISEASES AND DISORDERS OF THE EYE,1,Minor,Minor,Surgical,Self-Pay,,,,,N,119300.65,27381.57
New York City,Manhattan,7002001,001438,Bellevue Hospital Center,50 to 69,112,M,Black/African American,Unknown,7,Emergency,Home or Self Care,2022,END003,Diabetes mellitus with complication,EYP001,EYE PROCEDURES,073,ORBIT AND EYE PROCEDURES,02,DISEASES AND DISORDERS OF THE EYE,2,Moderate,Minor,Surgical,Medicaid,,,,,Y,61530.10,35384.98
Finger Lakes,Monroe,2701005,000413,Strong Memorial Hospital,30 to 49,140,M,Other Race,Unknown,13,Elective,Skilled Nursing Home,2022,END003,Diabetes mellitus with complication,EYP001,EYE PROCEDURES,073,ORBIT AND EYE PROCEDURES,02,DISEASES AND DISORDERS OF THE EYE,4,Extreme,Extreme,Surgical,Medicaid,,,,,N,101472.82,39388.47
Finger Lakes,Monroe,2701005,000413,Strong Memorial Hospital,50 to 69,146,F,White,Unknown,2,Emergency,Home or Self Care,2022,INJ011,"Open wounds of head and neck, initial encounter",MST012,BONE FIXATION (EXCLUDING EXTREMITIES),073,ORBIT AND EYE PROCEDURES,02,DISEASES AND DISORDERS OF THE EYE,2,Moderate,Minor,Surgical,Medicare,Medicaid,,,,Y,23491.89,9862.53
Finger Lakes,Monroe,2701005,000413,Strong Memorial Hospital,18 to 29,145,M,White,Not Span/Hispanic,1,Emergency,Home or Self Care,2022,INJ011,"Open wounds of head and neck, initial encounter",EYP001,EYE PROCEDURES,073,ORBIT AND EYE PROCEDURES,02,DISEASES AND DISORDERS OF THE EYE,1,Minor,Minor,Surgical,Miscellaneous/Other,Blue Cross/Blue Shield,,,,Y,24926.87,11331.68
Finger Lakes,Monroe,2701005,000413,Strong Memorial Hospital,30 to 49,140,M,White,Not Span/Hispanic,29,Urgent,Short-term Hospital,2022,EYE001,Cornea and external disease,EYP002,EYELID PROCEDURES,073,ORBIT AND EYE PROCEDURES,02,DISEASES AND DISORDERS OF THE EYE,4,Extreme,Extreme,Surgical,Medicaid,,,,,N,464237.64,163992.09
New York City,Manhattan,7002001,001438,Bellevue Hospital Center,70 or Older,100,M,Other Race,Unknown,5,Emergency,Medicaid Cert Nursing Facility,2022,INJ011,"Open wounds of head and neck, initial encounter",EYP002,EYELID PROCEDURES,073,ORBIT AND EYE PROCEDURES,02,DISEASES AND DISORDERS OF THE EYE,2,Moderate,Minor,Surgical,Medicaid,,,,,Y,51511.59,29623.49
New York City,Manhattan,7002054,001464,New York-Presbyterian Hospital - Columbia Presbyterian Center,50 to 69,104,M,Black/African American,Not Span/Hispanic,3,Emergency,Home or Self Care,2022,EYE002,Cataract and other lens disorders,EYP001,EYE PROCEDURES,073,ORBIT AND EYE PROCEDURES,02,DISEASES AND DISORDERS OF THE EYE,1,Minor,Minor,Surgical,Private Health Insurance,,,,,Y,74936.75,3970456.20
New York City,Manhattan,7002001,001438,Bellevue Hospital Center,50 to 69,104,F,Other Race,Spanish/Hispanic,1,Emergency,Home or Self Care,2022,EYE005,Retinal and vitreous conditions,EYP001,EYE PROCEDURES,073,ORBIT AND EYE PROCEDURES,02,DISEASES AND DISORDERS OF THE EYE,1,Minor,Minor,Surgical,Medicaid,,,,,Y,24963.57,14356.15
New York City,Manhattan,7002001,001438,Bellevue Hospital Center,18 to 29,104,M,Other Race,Spanish/Hispanic,2,Emergency,Home or Self Care,2022,INJ011,"Open wounds of head and neck, initial encounter",EYP002,EYELID PROCEDURES,073,ORBIT AND EYE PROCEDURES,02,DISEASES AND DISORDERS OF THE EYE,1,Minor,Minor,Surgical,Miscellaneous/Other,,,,,Y,33588.08,19315.97
Finger Lakes,Monroe,2701005,000413,Strong Memorial Hospital,50 to 69,142,M,Other Race,Unknown,19,Urgent,Home w/ Home Health Services,2022,EYE005,Retinal and vitreous conditions,EYP001,EYE PROCEDURES,073,ORBIT AND EYE PROCEDURES,02,DISEASES AND DISORDERS OF THE EYE,4,Extreme,Moderate,Surgical,Medicare,Medicaid,,,,N,56751.41,28245.79
New York City,Manhattan,7002054,001464,New York-Presbyterian Hospital - Columbia Presbyterian Center,18 to 29,117,F,White,Not Span/Hispanic,1,Elective,Home or Self Care,2022,EYE008,Oculofacial plastics and orbital conditions,EYP001,EYE PROCEDURES,073,ORBIT AND EYE PROCEDURES,02,DISEASES AND DISORDERS OF THE EYE,1,Minor,Minor,Surgical,Private Health Insurance,,,,,N,75932.07,20765.01
New York City,Manhattan,7002054,001464,New York-Presbyterian Hospital - Columbia Presbyterian Center,0 to 17,107,M,White,Not Span/Hispanic,1,Elective,Home or Self Care,2022,INJ001,"Fracture of head and neck, initial encounter",MST012,BONE FIXATION (EXCLUDING EXTREMITIES),073,ORBIT AND EYE PROCEDURES,02,DISEASES AND DISORDERS OF THE EYE,1,Minor,Minor,Surgical,Blue Cross/Blue Shield,,,,,N,43931.09,15799.41
Finger Lakes,Monroe,2701005,000413,Strong Memorial Hospital,30 to 49,146,M,White,Not Span/Hispanic,17,Emergency,Home or Self Care,2022,EYE004,Uveitis and ocular inflammation,EYP001,EYE PROCEDURES,073,ORBIT AND EYE PROCEDURES,02,DISEASES AND DISORDERS OF THE EYE,3,Major,Minor,Surgical,Medicaid,,,,,Y,168115.79,75357.05
New York City,Manhattan,7002054,001464,New York-Presbyterian Hospital - Columbia Presbyterian Center,50 to 69,OOS,F,Other Race,Unknown,1,Elective,Home or Self Care,2022,NEO073,Benign neoplasms,MST018,BONE EXCISION,073,ORBIT AND EYE PROCEDURES,02,DISEASES AND DISORDERS OF THE EYE,2,Moderate,Minor,Surgical,Medicaid,,,,,N,63250.00,19768.59
New York City,Manhattan,7002054,001464,New York-Presbyterian Hospital - Columbia Presbyterian Center,18 to 29,117,F,White,Not Span/Hispanic,2,Emergency,Home or Self Care,2022,EYE008,Oculofacial plastics and orbital conditions,MST004,INCISION AND DRAINAGE OF MUSCULOSKELETAL TISSUE AND JOINTS,073,ORBIT AND EYE PROCEDURES,02,DISEASES AND DISORDERS OF THE EYE,1,Minor,Minor,Surgical,Private Health Insurance,,,,,Y,58869.13,16855.92
Long Island,Nassau,2951001,000541,North Shore University Hospital,50 to 69,117,M,White,Not Span/Hispanic,16,Emergency,Home or Self Care,2022,EYE008,Oculofacial plastics and orbital conditions,EYP001,EYE PROCEDURES,073,ORBIT AND EYE PROCEDURES,02,DISEASES AND DISORDERS OF THE EYE,3,Major,Minor,Surgical,Private Health Insurance,,,,,Y,359403.40,62637.00
Long Island,Nassau,2951001,000541,North Shore University Hospital,70 or Older,110,M,Other Race,Not Span/Hispanic,4,Emergency,Home or Self Care,2022,EYE008,Oculofacial plastics and orbital conditions,EYP002,EYELID PROCEDURES,073,ORBIT AND EYE PROCEDURES,02,DISEASES AND DISORDERS OF THE EYE,1,Minor,Minor,Surgical,Medicare,Medicaid,,,,Y,66021.43,10045.08
New York City,Manhattan,7002053,001463,NYU Langone Hospitals,70 or Older,100,M,White,Not Span/Hispanic,9,Emergency,Home w/ Home Health Services,2022,EYE004,Uveitis and ocular inflammation,ADM015,ADMINISTRATION OF ANTIBIOTICS,073,ORBIT AND EYE PROCEDURES,02,DISEASES AND DISORDERS OF THE EYE,3,Major,Moderate,Surgical,Medicare,,,,,Y,137383.71,64419.20
New York City,Manhattan,7002053,001463,NYU Langone Hospitals,50 to 69,112,F,Other Race,Spanish/Hispanic,11,Emergency,Home w/ Home Health Services,2022,INJ037,"Complication of other surgical or medical care, injury, initial encounter",EYP001,EYE PROCEDURES,073,ORBIT AND EYE PROCEDURES,02,DISEASES AND DISORDERS OF THE EYE,3,Major,Major,Surgical,Medicare,,,,,Y,306756.04,93222.20
New York City,Manhattan,7002001,001438,Bellevue Hospital Center,50 to 69,104,M,Black/African American,Unknown,16,Emergency,Home or Self Care,2022,EYE002,Cataract and other lens disorders,EYP001,EYE PROCEDURES,073,ORBIT AND EYE PROCEDURES,02,DISEASES AND DISORDERS OF THE EYE,1,Minor,Minor,Surgical,Medicaid,,,,,Y,132742.80,76338.26
New York City,Manhattan,7002001,001438,Bellevue Hospital Center,30 to 49,113,M,Other Race,Not Span/Hispanic,1,Emergency,Home or Self Care,2022,EYE005,Retinal and vitreous conditions,EYP001,EYE PROCEDURES,073,ORBIT AND EYE PROCEDURES,02,DISEASES AND DISORDERS OF THE EYE,1,Minor,Minor,Surgical,Medicaid,,,,,Y,23977.12,13788.86
Finger Lakes,Monroe,2701005,000413,Strong Memorial Hospital,50 to 69,146,M,Black/African American,Not Span/Hispanic,3,Emergency,Home or Self Care,2022,INJ011,"Open wounds of head and neck, initial encounter",EYP001,EYE PROCEDURES,073,ORBIT AND EYE PROCEDURES,02,DISEASES AND DISORDERS OF THE EYE,2,Moderate,Moderate,Surgical,Medicaid,,,,,Y,31405.35,14033.47
New York City,Manhattan,7002001,001438,Bellevue Hospital Center,50 to 69,113,F,Other Race,Spanish/Hispanic,1,Emergency,Home or Self Care,2022,EYE005,Retinal and vitreous conditions,EYP001,EYE PROCEDURES,073,ORBIT AND EYE PROCEDURES,02,DISEASES AND DISORDERS OF THE EYE,1,Minor,Minor,Surgical,Medicaid,,,,,Y,32885.50,18911.92
New York City,Manhattan,7002001,001438,Bellevue Hospital Center,50 to 69,104,M,Black/African American,Not Span/Hispanic,1,Elective,Home or Self Care,2022,EYE003,Glaucoma,EYP001,EYE PROCEDURES,073,ORBIT AND EYE PROCEDURES,02,DISEASES AND DISORDERS OF THE EYE,2,Moderate,Minor,Surgical,Medicaid,,,,,N,19269.63,11081.66
New York City,Manhattan,7002054,001464,New York-Presbyterian Hospital - Columbia Presbyterian Center,70 or Older,100,F,Other Race,Spanish/Hispanic,15,Emergency,Skilled Nursing Home,2022,INJ001,"Fracture of head and neck, initial encounter",MST012,BONE FIXATION (EXCLUDING EXTREMITIES),073,ORBIT AND EYE PROCEDURES,02,DISEASES AND DISORDERS OF THE EYE,3,Major,Moderate,Surgical,Medicare,,,,,Y,224940.07,53780.10
New York City,Manhattan,7002054,001464,New York-Presbyterian Hospital - Columbia Presbyterian Center,30 to 49,100,F,Black/African American,Not Span/Hispanic,4,Emergency,Home or Self Care,2022,EYE004,Uveitis and ocular inflammation,EYP001,EYE PROCEDURES,073,ORBIT AND EYE PROCEDURES,02,DISEASES AND DISORDERS OF THE EYE,2,Moderate,Minor,Surgical,Private Health Insurance,,,,,Y,53971.13,12438.44
New York City,Manhattan,7002001,001438,Bellevue Hospital Center,50 to 69,100,M,Other Race,Unknown,1,Elective,Home or Self Care,2022,INJ001,"Fracture of head and neck, initial encounter",MST012,BONE FIXATION (EXCLUDING EXTREMITIES),073,ORBIT AND EYE PROCEDURES,02,DISEASES AND DISORDERS OF THE EYE,2,Moderate,Minor,Surgical,Medicare,,,,,N,24974.78,14362.60
New York City,Manhattan,7002001,001438,Bellevue Hospital Center,50 to 69,113,F,Other Race,Unknown,1,Elective,Home or Self Care,2022,EYE003,Glaucoma,EYP001,EYE PROCEDURES,073,ORBIT AND EYE PROCEDURES,02,DISEASES AND DISORDERS OF THE EYE,1,Minor,Minor,Surgical,Self-Pay,,,,,N,14381.24,8270.42
Finger Lakes,Monroe,2701005,000413,Strong Memorial Hospital,70 or Older,145,F,White,Not Span/Hispanic,5,Emergency,Skilled Nursing Home,2022,INJ011,"Open wounds of head and neck, initial encounter",EYP001,EYE PROCEDURES,073,ORBIT AND EYE PROCEDURES,02,DISEASES AND DISORDERS OF THE EYE,2,Moderate,Moderate,Surgical,Medicare,Blue Cross/Blue Shield,,,,Y,28419.85,13453.83
Finger Lakes,Monroe,2701005,000413,Strong Memorial Hospital,30 to 49,145,F,White,Not Span/Hispanic,1,Emergency,Home or Self Care,2022,INJ011,"Open wounds of head and neck, initial encounter",EYP001,EYE PROCEDURES,073,ORBIT AND EYE PROCEDURES,02,DISEASES AND DISORDERS OF THE EYE,2,Moderate,Minor,Surgical,Federal/State/Local/VA,Medicaid,,,,Y,25710.27,12083.94
Finger Lakes,Monroe,2701005,000413,Strong Memorial Hospital,0 to 17,131,M,White,Not Span/Hispanic,5,Emergency,Home or Self Care,2022,INJ011,"Open wounds of head and neck, initial encounter",EYP001,EYE PROCEDURES,073,ORBIT AND EYE PROCEDURES,02,DISEASES AND DISORDERS OF THE EYE,1,Minor,Minor,Surgical,Blue Cross/Blue Shield,,,,,Y,48483.15,24238.94
New York City,Manhattan,7002054,001464,New York-Presbyterian Hospital - Columbia Presbyterian Center,0 to 17,OOS,M,Other Race,Unknown,6,Emergency,Home or Self Care,2022,NEO001,Head and neck cancers - eye,EYP001,EYE PROCEDURES,073,ORBIT AND EYE PROCEDURES,02,DISEASES AND DISORDERS OF THE EYE,2,Moderate,Minor,Surgical,Medicaid,,,,,Y,184471.58,54850.05
New York City,Manhattan,7002053,001463,NYU Langone Hospitals,70 or Older,100,M,Other Race,Not Span/Hispanic,7,Emergency,Home w/ Home Health Services,2022,EYE003,Glaucoma,EYP001,EYE PROCEDURES,073,ORBIT AND EYE PROCEDURES,02,DISEASES AND DISORDERS OF THE EYE,4,Extreme,Extreme,Surgical,Medicare,Medicare,,,,Y,149914.66,45505.13
New York City,Manhattan,7002001,001438,Bellevue Hospital Center,30 to 49,OOS,M,Other Race,Unknown,1,Emergency,Home or Self Care,2022,INJ011,"Open wounds of head and neck, initial encounter",EYP001,EYE PROCEDURES,073,ORBIT AND EYE PROCEDURES,02,DISEASES AND DISORDERS OF THE EYE,1,Minor,Minor,Surgical,Private Health Insurance,,,,,Y,27400.36,15757.51
New York City,Manhattan,7002001,001438,Bellevue Hospital Center,30 to 49,112,M,Other Race,Spanish/Hispanic,1,Emergency,Home or Self Care,2022,INJ011,"Open wounds of head and neck, initial encounter",MST030,"MUSCULOSKELETAL PROCEDURES, NEC",073,ORBIT AND EYE PROCEDURES,02,DISEASES AND DISORDERS OF THE EYE,2,Moderate,Minor,Surgical,Private Health Insurance,,,,,Y,33158.22,19068.76