Hospital Service Area,Hospital County,Operating Certificate Number,Permanent Facility Id,Facility Name,Age Group,Zip Code - 3 digits,Gender,Race,Ethnicity,Length of Stay,Type of Admission,Patient Disposition,Discharge Year,CCS Diagnosis Code,CCS Diagnosis Description,CCS Procedure Code,CCS Procedure Description,APR DRG Code,APR DRG Description,APR MDC Code,APR MDC Description,APR Severity of Illness Code,APR Severity of Illness Description,APR Risk of Mortality,APR Medical Surgical Description,Payment Typology 1,Payment Typology 2,Payment Typology 3,Birth Weight,Abortion Edit Indicator,Emergency Department Indicator,Total Charges,Total Costs
New York City,Manhattan,7002001,001438,Bellevue Hospital Center,0 to 17,100,F,Black/African American,Not Span/Hispanic,2,Emergency,Home or Self Care,2022,MBD014,Neurodevelopmental disorders,,,757,ORGANIC MENTAL HEALTH DISTURBANCES,19,MENTAL DISEASES AND DISORDERS,1,Minor,Minor,Medical,Medicaid,,,,,Y,9406.15,5409.33
New York City,Manhattan,7002054,001464,New York-Presbyterian Hospital - Columbia Presbyterian Center,0 to 17,104,M,Other Race,Spanish/Hispanic,2,Emergency,Psychiatric Hospital or Unit of Hosp,2022,MBD001,Schizophrenia spectrum and other psychotic disorders,CNS002,LUMBAR PUNCTURE,757,ORGANIC MENTAL HEALTH DISTURBANCES,19,MENTAL DISEASES AND DISORDERS,1,Minor,Minor,Medical,Medicaid,,,,,Y,55474.82,10858.60
New York City,Manhattan,7002001,001438,Bellevue Hospital Center,18 to 29,112,M,Black/African American,Not Span/Hispanic,97,Emergency,Facility w/ Custodial/Supportive Care,2022,MBD014,Neurodevelopmental disorders,ADM021,"ADMINISTRATION OF THERAPEUTIC SUBSTANCES, NEC",757,ORGANIC MENTAL HEALTH DISTURBANCES,19,MENTAL DISEASES AND DISORDERS,2,Moderate,Moderate,Medical,Medicare,Medicaid,,,,Y,599755.69,344909.90
New York City,Manhattan,7002001,001438,Bellevue Hospital Center,0 to 17,100,F,Black/African American,Not Span/Hispanic,1,Emergency,Home or Self Care,2022,MBD014,Neurodevelopmental disorders,OTR004,ISOLATION PROCEDURES,757,ORGANIC MENTAL HEALTH DISTURBANCES,19,MENTAL DISEASES AND DISORDERS,2,Moderate,Moderate,Medical,Medicaid,,,,,Y,5859.48,3369.69
New York City,Manhattan,7002001,001438,Bellevue Hospital Center,50 to 69,100,M,White,Not Span/Hispanic,11,Emergency,Home or Self Care,2022,MBD014,Neurodevelopmental disorders,MHT002,PSYCHOTHERAPY FOR MENTAL HEALTH (EXCLUDING SUBSTANCE USE),757,ORGANIC MENTAL HEALTH DISTURBANCES,19,MENTAL DISEASES AND DISORDERS,2,Moderate,Minor,Medical,Medicare,Medicaid,,,,Y,46838.83,26936.26
New York City,Manhattan,7002001,001438,Bellevue Hospital Center,18 to 29,100,F,Black/African American,Not Span/Hispanic,5,Emergency,Home or Self Care,2022,MBD014,Neurodevelopmental disorders,MHT001,PHARMACOTHERAPY FOR MENTAL HEALTH (EXCLUDING SUBSTANCE USE),757,ORGANIC MENTAL HEALTH DISTURBANCES,19,MENTAL DISEASES AND DISORDERS,1,Minor,Minor,Medical,Medicaid,,,,,Y,23793.81,13683.44
New York City,Manhattan,7002001,001438,Bellevue Hospital Center,0 to 17,104,M,Other Race,Unknown,26,Emergency,Home or Self Care,2022,MBD014,Neurodevelopmental disorders,MHT001,PHARMACOTHERAPY FOR MENTAL HEALTH (EXCLUDING SUBSTANCE USE),757,ORGANIC MENTAL HEALTH DISTURBANCES,19,MENTAL DISEASES AND DISORDERS,2,Moderate,Minor,Medical,Private Health Insurance,Private Health Insurance,Medicaid,,,N,104717.61,60221.42
Finger Lakes,Monroe,2701005,000413,Strong Memorial Hospital,0 to 17,146,M,White,Not Span/Hispanic,7,Emergency,Home or Self Care,2022,MBD014,Neurodevelopmental disorders,,,757,ORGANIC MENTAL HEALTH DISTURBANCES,19,MENTAL DISEASES AND DISORDERS,2,Moderate,Minor,Medical,Medicaid,,,,,Y,17032.60,8787.82
New York City,Manhattan,7002001,001438,Bellevue Hospital Center,0 to 17,112,M,Other Race,Spanish/Hispanic,25,Emergency,Home or Self Care,2022,MBD014,Neurodevelopmental disorders,,,757,ORGANIC MENTAL HEALTH DISTURBANCES,19,MENTAL DISEASES AND DISORDERS,1,Minor,Minor,Medical,Medicaid,,,,,Y,99579.72,57266.70
New York City,Manhattan,7002054,001464,New York-Presbyterian Hospital - Columbia Presbyterian Center,0 to 17,112,M,White,Not Span/Hispanic,1,Elective,Home or Self Care,2022,MBD014,Neurodevelopmental disorders,,,757,ORGANIC MENTAL HEALTH DISTURBANCES,19,MENTAL DISEASES AND DISORDERS,1,Minor,Minor,Medical,Private Health Insurance,Medicaid,,,,N,19305.48,5292.08
New York City,Manhattan,7002001,001438,Bellevue Hospital Center,0 to 17,113,M,Other Race,Unknown,12,Urgent,Home or Self Care,2022,MBD014,Neurodevelopmental disorders,MHT002,PSYCHOTHERAPY FOR MENTAL HEALTH (EXCLUDING SUBSTANCE USE),757,ORGANIC MENTAL HEALTH DISTURBANCES,19,MENTAL DISEASES AND DISORDERS,1,Minor,Minor,Medical,Medicaid,,,,,N,47094.64,27083.37
New York City,Manhattan,7002001,001438,Bellevue Hospital Center,0 to 17,111,M,Other Race,Spanish/Hispanic,2,Emergency,Home or Self Care,2022,MBD014,Neurodevelopmental disorders,MHT001,PHARMACOTHERAPY FOR MENTAL HEALTH (EXCLUDING SUBSTANCE USE),757,ORGANIC MENTAL HEALTH DISTURBANCES,19,MENTAL DISEASES AND DISORDERS,2,Moderate,Minor,Medical,Medicaid,,,,,Y,10612.26,6102.94
New York City,Manhattan,7002053,001463,NYU Langone Hospitals,0 to 17,113,M,Other Race,Spanish/Hispanic,3,Elective,Home or Self Care,2022,MBD014,Neurodevelopmental disorders,MAM011,ELECTROENCEPHALOGRAM (EEG),757,ORGANIC MENTAL HEALTH DISTURBANCES,19,MENTAL DISEASES AND DISORDERS,1,Minor,Minor,Medical,Medicaid,,,,,N,83430.76,10801.78
New York City,Manhattan,7002054,001464,New York-Presbyterian Hospital - Columbia Presbyterian Center,0 to 17,104,F,Black/African American,Not Span/Hispanic,11,Emergency,Home or Self Care,2022,MBD014,Neurodevelopmental disorders,ADM017,ADMINISTRATION OF NUTRITIONAL AND ELECTROLYTIC SUBSTANCES,757,ORGANIC MENTAL HEALTH DISTURBANCES,19,MENTAL DISEASES AND DISORDERS,2,Moderate,Minor,Medical,Medicaid,,,,,Y,153012.66,45888.09
Finger Lakes,Monroe,2701005,000413,Strong Memorial Hospital,0 to 17,146,M,Black/African American,Not Span/Hispanic,4,Emergency,Home or Self Care,2022,MBD014,Neurodevelopmental disorders,,,757,ORGANIC MENTAL HEALTH DISTURBANCES,19,MENTAL DISEASES AND DISORDERS,1,Minor,Minor,Medical,Medicaid,,,,,Y,11087.82,5364.00
New York City,Manhattan,7002001,001438,Bellevue Hospital Center,18 to 29,100,F,White,Unknown,3,Emergency,Home or Self Care,2022,MBD005,Anxiety and fear-related disorders,MHT001,PHARMACOTHERAPY FOR MENTAL HEALTH (EXCLUDING SUBSTANCE USE),757,ORGANIC MENTAL HEALTH DISTURBANCES,19,MENTAL DISEASES AND DISORDERS,1,Minor,Minor,Medical,Private Health Insurance,,,,,Y,15371.47,8839.89
New York City,Manhattan,7002001,001438,Bellevue Hospital Center,0 to 17,,M,White,Unknown,8,Emergency,Home or Self Care,2022,MBD014,Neurodevelopmental disorders,MHT001,PHARMACOTHERAPY FOR MENTAL HEALTH (EXCLUDING SUBSTANCE USE),757,ORGANIC MENTAL HEALTH DISTURBANCES,19,MENTAL DISEASES AND DISORDERS,2,Moderate,Minor,Medical,Private Health Insurance,,,,,Y,34002.04,19554.03
New York City,Manhattan,7002053,001463,NYU Langone Hospitals,70 or Older,100,F,White,Not Span/Hispanic,6,Emergency,Skilled Nursing Home,2022,SYM016,Other general signs and symptoms,,,757,ORGANIC MENTAL HEALTH DISTURBANCES,19,MENTAL DISEASES AND DISORDERS,1,Minor,Moderate,Medical,Medicare,Medicare,,,,Y,94015.28,31622.58
New York City,Manhattan,7002054,001464,New York-Presbyterian Hospital - Columbia Presbyterian Center,0 to 17,OOS,M,Other Race,Unknown,1,Elective,Home or Self Care,2022,MBD014,Neurodevelopmental disorders,MAM011,ELECTROENCEPHALOGRAM (EEG),757,ORGANIC MENTAL HEALTH DISTURBANCES,19,MENTAL DISEASES AND DISORDERS,1,Minor,Minor,Medical,Private Health Insurance,,,,,N,16736.41,4824.33
New York City,Manhattan,7002001,001438,Bellevue Hospital Center,0 to 17,112,F,Black/African American,Not Span/Hispanic,8,Urgent,Home or Self Care,2022,MBD014,Neurodevelopmental disorders,MHT001,PHARMACOTHERAPY FOR MENTAL HEALTH (EXCLUDING SUBSTANCE USE),757,ORGANIC MENTAL HEALTH DISTURBANCES,19,MENTAL DISEASES AND DISORDERS,1,Minor,Minor,Medical,Private Health Insurance,,,,,N,31310.79,18006.33
New York City,Manhattan,7002054,001464,New York-Presbyterian Hospital - Columbia Presbyterian Center,0 to 17,114,M,Other Race,Unknown,1,Elective,Home or Self Care,2022,MBD014,Neurodevelopmental disorders,MAM011,ELECTROENCEPHALOGRAM (EEG),757,ORGANIC MENTAL HEALTH DISTURBANCES,19,MENTAL DISEASES AND DISORDERS,1,Minor,Minor,Medical,Medicaid,,,,,N,17855.96,5037.33
New York City,Manhattan,7002001,001438,Bellevue Hospital Center,0 to 17,112,M,White,Unknown,80,Emergency,Home or Self Care,2022,MBD014,Neurodevelopmental disorders,MHT001,PHARMACOTHERAPY FOR MENTAL HEALTH (EXCLUDING SUBSTANCE USE),757,ORGANIC MENTAL HEALTH DISTURBANCES,19,MENTAL DISEASES AND DISORDERS,3,Major,Moderate,Medical,Medicaid,,,,,Y,316680.49,182117.88
New York City,Manhattan,7002001,001438,Bellevue Hospital Center,0 to 17,112,F,Black/African American,Unknown,1,Emergency,Home or Self Care,2022,MBD014,Neurodevelopmental disorders,MHT001,PHARMACOTHERAPY FOR MENTAL HEALTH (EXCLUDING SUBSTANCE USE),757,ORGANIC MENTAL HEALTH DISTURBANCES,19,MENTAL DISEASES AND DISORDERS,2,Moderate,Minor,Medical,Private Health Insurance,Medicaid,,,,Y,5502.92,3164.64
New York City,Manhattan,7002001,001438,Bellevue Hospital Center,0 to 17,104,M,Black/African American,Unknown,1,Emergency,Home or Self Care,2022,MBD014,Neurodevelopmental disorders,MHT001,PHARMACOTHERAPY FOR MENTAL HEALTH (EXCLUDING SUBSTANCE USE),757,ORGANIC MENTAL HEALTH DISTURBANCES,19,MENTAL DISEASES AND DISORDERS,2,Moderate,Minor,Medical,Medicaid,,,,,Y,5873.18,3377.57
New York City,Manhattan,7002001,001438,Bellevue Hospital Center,0 to 17,112,M,Other Race,Spanish/Hispanic,5,Emergency,Home or Self Care,2022,MBD014,Neurodevelopmental disorders,MHT001,PHARMACOTHERAPY FOR MENTAL HEALTH (EXCLUDING SUBSTANCE USE),757,ORGANIC MENTAL HEALTH DISTURBANCES,19,MENTAL DISEASES AND DISORDERS,2,Moderate,Minor,Medical,Medicaid,,,,,Y,21506.13,12367.83
Finger Lakes,Monroe,2701005,000413,Strong Memorial Hospital,18 to 29,146,F,White,Not Span/Hispanic,3,Emergency,Home or Self Care,2022,MBD014,Neurodevelopmental disorders,,,757,ORGANIC MENTAL HEALTH DISTURBANCES,19,MENTAL DISEASES AND DISORDERS,2,Moderate,Minor,Medical,Medicaid,,,,,Y,12312.31,5072.57
Finger Lakes,Monroe,2701005,000413,Strong Memorial Hospital,18 to 29,146,F,White,Not Span/Hispanic,2,Emergency,Home or Self Care,2022,MBD014,Neurodevelopmental disorders,,,757,ORGANIC MENTAL HEALTH DISTURBANCES,19,MENTAL DISEASES AND DISORDERS,2,Moderate,Minor,Medical,Medicaid,,,,,Y,7686.61,3241.10
Finger Lakes,Monroe,2701005,000413,Strong Memorial Hospital,0 to 17,144,M,White,Not Span/Hispanic,6,Emergency,Home or Self Care,2022,MBD014,Neurodevelopmental disorders,,,757,ORGANIC MENTAL HEALTH DISTURBANCES,19,MENTAL DISEASES AND DISORDERS,2,Moderate,Minor,Medical,Medicaid,,,,,Y,18325.96,8512.33
Finger Lakes,Monroe,2701005,000413,Strong Memorial Hospital,50 to 69,144,F,White,Not Span/Hispanic,8,Emergency,Psychiatric Hospital or Unit of Hosp,2022,MBD001,Schizophrenia spectrum and other psychotic disorders,CAR024,VENOUS AND ARTERIAL CATHETER PLACEMENT,757,ORGANIC MENTAL HEALTH DISTURBANCES,19,MENTAL DISEASES AND DISORDERS,3,Major,Major,Medical,Medicare,Medicaid,,,,Y,28808.62,13367.58
New York City,Manhattan,7002001,001438,Bellevue Hospital Center,0 to 17,104,M,Other Race,Unknown,25,Urgent,Home or Self Care,2022,MBD014,Neurodevelopmental disorders,MHT002,PSYCHOTHERAPY FOR MENTAL HEALTH (EXCLUDING SUBSTANCE USE),757,ORGANIC MENTAL HEALTH DISTURBANCES,19,MENTAL DISEASES AND DISORDERS,2,Moderate,Minor,Medical,Private Health Insurance,Medicaid,,,,N,98932.75,56894.64
New York City,Manhattan,7002001,001438,Bellevue Hospital Center,0 to 17,,F,Black/African American,Not Span/Hispanic,9,Emergency,Home or Self Care,2022,MBD014,Neurodevelopmental disorders,MHT002,PSYCHOTHERAPY FOR MENTAL HEALTH (EXCLUDING SUBSTANCE USE),757,ORGANIC MENTAL HEALTH DISTURBANCES,19,MENTAL DISEASES AND DISORDERS,1,Minor,Minor,Medical,Medicaid,,,,,Y,39120.77,22497.73
New York City,Manhattan,7002001,001438,Bellevue Hospital Center,0 to 17,112,F,Black/African American,Unknown,3,Emergency,Home or Self Care,2022,MBD014,Neurodevelopmental disorders,MHT001,PHARMACOTHERAPY FOR MENTAL HEALTH (EXCLUDING SUBSTANCE USE),757,ORGANIC MENTAL HEALTH DISTURBANCES,19,MENTAL DISEASES AND DISORDERS,2,Moderate,Minor,Medical,Private Health Insurance,,,,,Y,13682.30,7868.47
New York City,Manhattan,7002001,001438,Bellevue Hospital Center,0 to 17,100,M,Other Race,Spanish/Hispanic,2,Emergency,Home or Self Care,2022,MBD014,Neurodevelopmental disorders,MHT001,PHARMACOTHERAPY FOR MENTAL HEALTH (EXCLUDING SUBSTANCE USE),757,ORGANIC MENTAL HEALTH DISTURBANCES,19,MENTAL DISEASES AND DISORDERS,1,Minor,Minor,Medical,Medicaid,,,,,Y,9409.60,5411.31
Hudson Valley,Dutchess,1302001,000181,Vassar Brothers Medical Center,70 or Older,125,F,Other Race,Not Span/Hispanic,4,Emergency,Home w/ Home Health Services,2022,MBD001,Schizophrenia spectrum and other psychotic disorders,,,757,ORGANIC MENTAL HEALTH DISTURBANCES,19,MENTAL DISEASES AND DISORDERS,2,Moderate,Moderate,Medical,Medicare,Federal/State/Local/VA,,,,Y,27610.37,7929.77
New York City,Manhattan,7002054,001464,New York-Presbyterian Hospital - Columbia Presbyterian Center,18 to 29,104,M,Other Race,Unknown,4,Emergency,Home or Self Care,2022,MBD013,Miscellaneous mental and behavioral disorders/conditions,,,757,ORGANIC MENTAL HEALTH DISTURBANCES,19,MENTAL DISEASES AND DISORDERS,2,Moderate,Minor,Medical,Private Health Insurance,,,,,Y,40415.15,10467.39
New York City,Manhattan,7002054,001464,New York-Presbyterian Hospital - Columbia Presbyterian Center,0 to 17,114,F,White,Not Span/Hispanic,1,Elective,Home or Self Care,2022,MAL009,Chromosomal abnormalities,MAM011,ELECTROENCEPHALOGRAM (EEG),757,ORGANIC MENTAL HEALTH DISTURBANCES,19,MENTAL DISEASES AND DISORDERS,1,Minor,Minor,Medical,Blue Cross/Blue Shield,,,,,N,19304.00,5291.34
New York City,Manhattan,7002001,001438,Bellevue Hospital Center,0 to 17,104,M,Other Race,Unknown,3,Emergency,Home or Self Care,2022,MBD014,Neurodevelopmental disorders,MHT002,PSYCHOTHERAPY FOR MENTAL HEALTH (EXCLUDING SUBSTANCE USE),757,ORGANIC MENTAL HEALTH DISTURBANCES,19,MENTAL DISEASES AND DISORDERS,1,Minor,Minor,Medical,Medicaid,,,,,Y,14138.48,8130.81
New York City,Manhattan,7002001,001438,Bellevue Hospital Center,0 to 17,100,M,Other Race,Spanish/Hispanic,29,Emergency,Home or Self Care,2022,MBD014,Neurodevelopmental disorders,ADM021,"ADMINISTRATION OF THERAPEUTIC SUBSTANCES, NEC",757,ORGANIC MENTAL HEALTH DISTURBANCES,19,MENTAL DISEASES AND DISORDERS,1,Minor,Minor,Medical,Medicaid,,,,,Y,115984.46,66700.81
New York City,Manhattan,7002001,001438,Bellevue Hospital Center,0 to 17,112,F,Other Race,Not Span/Hispanic,45,Emergency,Home or Self Care,2022,MBD014,Neurodevelopmental disorders,MHT002,PSYCHOTHERAPY FOR MENTAL HEALTH (EXCLUDING SUBSTANCE USE),757,ORGANIC MENTAL HEALTH DISTURBANCES,19,MENTAL DISEASES AND DISORDERS,2,Moderate,Minor,Medical,Medicaid,,,,,Y,178566.33,102690.64
Finger Lakes,Monroe,2701005,000413,Strong Memorial Hospital,0 to 17,141,F,White,Not Span/Hispanic,120 +,Urgent,Home or Self Care,2022,MBD014,Neurodevelopmental disorders,ENT015,DENTAL PROCEDURES,757,ORGANIC MENTAL HEALTH DISTURBANCES,19,MENTAL DISEASES AND DISORDERS,2,Moderate,Minor,Medical,Medicaid,,,,,N,437490.21,256737.93
New York City,Manhattan,7002054,001464,New York-Presbyterian Hospital - Columbia Presbyterian Center,70 or Older,104,F,Other Race,Unknown,23,Emergency,Home w/ Home Health Services,2022,SYM010,Nervous system signs and symptoms,CNS002,LUMBAR PUNCTURE,757,ORGANIC MENTAL HEALTH DISTURBANCES,19,MENTAL DISEASES AND DISORDERS,3,Major,Major,Medical,Medicare,,,,,Y,353890.02,73385.34
New York City,Manhattan,7002054,001464,New York-Presbyterian Hospital - Columbia Presbyterian Center,30 to 49,104,F,Black/African American,Spanish/Hispanic,1,Emergency,Home or Self Care,2022,MBD005,Anxiety and fear-related disorders,,,757,ORGANIC MENTAL HEALTH DISTURBANCES,19,MENTAL DISEASES AND DISORDERS,1,Minor,Minor,Medical,Self-Pay,,,,,Y,15065.11,3550.39
New York City,Manhattan,7002054,001464,New York-Presbyterian Hospital - Columbia Presbyterian Center,0 to 17,104,F,Other Race,Spanish/Hispanic,1,Elective,Home or Self Care,2022,MBD014,Neurodevelopmental disorders,MAM011,ELECTROENCEPHALOGRAM (EEG),757,ORGANIC MENTAL HEALTH DISTURBANCES,19,MENTAL DISEASES AND DISORDERS,1,Minor,Minor,Medical,Medicaid,,,,,N,19304.00,5291.34
New York City,Manhattan,7002054,001464,New York-Presbyterian Hospital - Columbia Presbyterian Center,30 to 49,100,M,Other Race,Spanish/Hispanic,1,Emergency,Home or Self Care,2022,MBD014,Neurodevelopmental disorders,,,757,ORGANIC MENTAL HEALTH DISTURBANCES,19,MENTAL DISEASES AND DISORDERS,2,Moderate,Minor,Medical,Medicaid,,,,,Y,11342.71,2771.26
New York City,Manhattan,7002054,001464,New York-Presbyterian Hospital - Columbia Presbyterian Center,18 to 29,100,M,White,Not Span/Hispanic,3,Urgent,Home or Self Care,2022,MBD014,Neurodevelopmental disorders,,,757,ORGANIC MENTAL HEALTH DISTURBANCES,19,MENTAL DISEASES AND DISORDERS,2,Moderate,Minor,Medical,Private Health Insurance,Medicaid,,,,Y,22934.47,5746.27
New York City,Manhattan,7002053,001463,NYU Langone Hospitals,18 to 29,OOS,M,Other Race,Spanish/Hispanic,11,Emergency,Home or Self Care,2022,MBD014,Neurodevelopmental disorders,OTR004,ISOLATION PROCEDURES,757,ORGANIC MENTAL HEALTH DISTURBANCES,19,MENTAL DISEASES AND DISORDERS,2,Moderate,Minor,Medical,Medicaid,,,,,Y,115946.96,54340.85
New York City,Manhattan,7002053,001463,NYU Langone Hospitals,0 to 17,112,F,Other Race,Unknown,1,Elective,Home or Self Care,2022,MBD014,Neurodevelopmental disorders,MAM011,ELECTROENCEPHALOGRAM (EEG),757,ORGANIC MENTAL HEALTH DISTURBANCES,19,MENTAL DISEASES AND DISORDERS,1,Minor,Minor,Medical,Private Health Insurance,,,,,N,32865.85,3802.92
New York City,Manhattan,7002053,001463,NYU Langone Hospitals,0 to 17,127,M,White,Not Span/Hispanic,2,Elective,Home or Self Care,2022,MAL009,Chromosomal abnormalities,MAM011,ELECTROENCEPHALOGRAM (EEG),757,ORGANIC MENTAL HEALTH DISTURBANCES,19,MENTAL DISEASES AND DISORDERS,2,Moderate,Minor,Medical,Blue Cross/Blue Shield,Medicaid,,,,N,64640.14,7534.85
New York City,Manhattan,7002053,001463,NYU Langone Hospitals,0 to 17,112,M,Black/African American,Unknown,9,Emergency,Psychiatric Hospital or Unit of Hosp,2022,MBD014,Neurodevelopmental disorders,MAM011,ELECTROENCEPHALOGRAM (EEG),757,ORGANIC MENTAL HEALTH DISTURBANCES,19,MENTAL DISEASES AND DISORDERS,1,Minor,Minor,Medical,Private Health Insurance,,,,,Y,134202.79,29432.00
New York City,Manhattan,7002054,001464,New York-Presbyterian Hospital - Columbia Presbyterian Center,0 to 17,100,M,White,Spanish/Hispanic,1,Emergency,Home or Self Care,2022,MBD014,Neurodevelopmental disorders,ADM017,ADMINISTRATION OF NUTRITIONAL AND ELECTROLYTIC SUBSTANCES,757,ORGANIC MENTAL HEALTH DISTURBANCES,19,MENTAL DISEASES AND DISORDERS,1,Minor,Minor,Medical,Medicaid,,,,,Y,19963.47,4580.78
New York City,Manhattan,7002001,001438,Bellevue Hospital Center,0 to 17,100,M,Other Race,Spanish/Hispanic,15,Emergency,Home or Self Care,2022,MBD014,Neurodevelopmental disorders,MHT001,PHARMACOTHERAPY FOR MENTAL HEALTH (EXCLUDING SUBSTANCE USE),757,ORGANIC MENTAL HEALTH DISTURBANCES,19,MENTAL DISEASES AND DISORDERS,2,Moderate,Minor,Medical,Medicaid,,,,,Y,61975.75,35641.26
New York City,Manhattan,7002001,001438,Bellevue Hospital Center,0 to 17,104,M,Black/African American,Unknown,15,Emergency,Short-term Hospital,2022,MBD014,Neurodevelopmental disorders,MHT001,PHARMACOTHERAPY FOR MENTAL HEALTH (EXCLUDING SUBSTANCE USE),757,ORGANIC MENTAL HEALTH DISTURBANCES,19,MENTAL DISEASES AND DISORDERS,1,Minor,Minor,Medical,Medicaid,,,,,Y,62001.86,35656.28
New York City,Manhattan,7002001,001438,Bellevue Hospital Center,0 to 17,112,M,Other Race,Spanish/Hispanic,38,Emergency,Home or Self Care,2022,MBD014,Neurodevelopmental disorders,MHT002,PSYCHOTHERAPY FOR MENTAL HEALTH (EXCLUDING SUBSTANCE USE),757,ORGANIC MENTAL HEALTH DISTURBANCES,19,MENTAL DISEASES AND DISORDERS,3,Major,Moderate,Medical,Medicaid,,,,,Y,152511.11,87706.70
New York City,Manhattan,7002001,001438,Bellevue Hospital Center,0 to 17,112,M,Other Race,Unknown,20,Emergency,Home or Self Care,2022,MBD014,Neurodevelopmental disorders,MHT001,PHARMACOTHERAPY FOR MENTAL HEALTH (EXCLUDING SUBSTANCE USE),757,ORGANIC MENTAL HEALTH DISTURBANCES,19,MENTAL DISEASES AND DISORDERS,1,Minor,Minor,Medical,Medicaid,,,,,Y,82665.63,47539.68
New York City,Manhattan,7002053,001463,NYU Langone Hospitals,18 to 29,100,M,Other Race,Unknown,5,Emergency,Left Against Medical Advice,2022,MBD014,Neurodevelopmental disorders,MHT002,PSYCHOTHERAPY FOR MENTAL HEALTH (EXCLUDING SUBSTANCE USE),757,ORGANIC MENTAL HEALTH DISTURBANCES,19,MENTAL DISEASES AND DISORDERS,2,Moderate,Moderate,Medical,Medicaid,,,,,Y,48770.49,20068.12
New York City,Manhattan,7002001,001438,Bellevue Hospital Center,0 to 17,112,M,Other Race,Spanish/Hispanic,36,Emergency,Home or Self Care,2022,MBD014,Neurodevelopmental disorders,MHT001,PHARMACOTHERAPY FOR MENTAL HEALTH (EXCLUDING SUBSTANCE USE),757,ORGANIC MENTAL HEALTH DISTURBANCES,19,MENTAL DISEASES AND DISORDERS,2,Moderate,Minor,Medical,Medicaid,,,,,Y,144040.41,82835.34
New York City,Manhattan,7002001,001438,Bellevue Hospital Center,0 to 17,112,M,White,Unknown,25,Urgent,Home or Self Care,2022,MBD014,Neurodevelopmental disorders,MHT001,PHARMACOTHERAPY FOR MENTAL HEALTH (EXCLUDING SUBSTANCE USE),757,ORGANIC MENTAL HEALTH DISTURBANCES,19,MENTAL DISEASES AND DISORDERS,2,Moderate,Minor,Medical,Medicaid,,,,,N,98001.61,56359.16
Capital/Adirond,Warren,5601000,001005,Glens Falls Hospital,50 to 69,128,M,White,Not Span/Hispanic,4,Emergency,Skilled Nursing Home,2022,SYM016,Other general signs and symptoms,,,757,ORGANIC MENTAL HEALTH DISTURBANCES,19,MENTAL DISEASES AND DISORDERS,1,Minor,Moderate,Medical,Medicare,,,,,Y,16525.96,5848.68
New York City,Manhattan,7002001,001438,Bellevue Hospital Center,0 to 17,100,M,White,Spanish/Hispanic,5,Emergency,Facility w/ Custodial/Supportive Care,2022,MBD014,Neurodevelopmental disorders,,,757,ORGANIC MENTAL HEALTH DISTURBANCES,19,MENTAL DISEASES AND DISORDERS,2,Moderate,Minor,Medical,Medicaid,,,,,Y,21472.48,12348.48
New York City,Manhattan,7002053,001463,NYU Langone Hospitals,18 to 29,113,F,White,Not Span/Hispanic,8,Elective,Home or Self Care,2022,MBD004,Other specified and unspecified mood disorders,OTR004,ISOLATION PROCEDURES,757,ORGANIC MENTAL HEALTH DISTURBANCES,19,MENTAL DISEASES AND DISORDERS,3,Major,Minor,Medical,Medicaid,,,,,N,76704.85,31120.52
Long Island,Nassau,2951001,000541,North Shore University Hospital,18 to 29,110,F,White,Not Span/Hispanic,4,Urgent,Home or Self Care,2022,MAL009,Chromosomal abnormalities,ADM003,ADMINISTRATION OF ALBUMIN AND GLOBULIN,757,ORGANIC MENTAL HEALTH DISTURBANCES,19,MENTAL DISEASES AND DISORDERS,2,Moderate,Minor,Medical,Private Health Insurance,Medicare,Medicaid,,,N,121174.08,26252.92
New York City,Manhattan,7002001,001438,Bellevue Hospital Center,0 to 17,112,M,Other Race,Unknown,54,Emergency,Home or Self Care,2022,MBD014,Neurodevelopmental disorders,,,757,ORGANIC MENTAL HEALTH DISTURBANCES,19,MENTAL DISEASES AND DISORDERS,1,Minor,Minor,Medical,Medicaid,,,,,Y,216474.63,124491.10
New York City,Manhattan,7002001,001438,Bellevue Hospital Center,30 to 49,100,M,Black/African American,Unknown,1,Emergency,Short-term Hospital,2022,MBD001,Schizophrenia spectrum and other psychotic disorders,MHT001,PHARMACOTHERAPY FOR MENTAL HEALTH (EXCLUDING SUBSTANCE USE),757,ORGANIC MENTAL HEALTH DISTURBANCES,19,MENTAL DISEASES AND DISORDERS,2,Moderate,Minor,Medical,Medicare,Medicaid,,,,Y,6398.24,3679.53
New York City,Manhattan,7002001,001438,Bellevue Hospital Center,18 to 29,100,M,Black/African American,Unknown,1,Emergency,Home or Self Care,2022,MBD014,Neurodevelopmental disorders,MHT001,PHARMACOTHERAPY FOR MENTAL HEALTH (EXCLUDING SUBSTANCE USE),757,ORGANIC MENTAL HEALTH DISTURBANCES,19,MENTAL DISEASES AND DISORDERS,2,Moderate,Minor,Medical,Medicaid,,,,,Y,5502.90,3164.63