Hospital Service Area,Hospital County,Operating Certificate Number,Permanent Facility Id,Facility Name,Age Group,Zip Code - 3 digits,Gender,Race,Ethnicity,Length of Stay,Type of Admission,Patient Disposition,Discharge Year,CCS Diagnosis Code,CCS Diagnosis Description,CCS Procedure Code,CCS Procedure Description,APR DRG Code,APR DRG Description,APR MDC Code,APR MDC Description,APR Severity of Illness Code,APR Severity of Illness Description,APR Risk of Mortality,APR Medical Surgical Description,Payment Typology 1,Payment Typology 2,Payment Typology 3,Birth Weight,Abortion Edit Indicator,Emergency Department Indicator,Total Charges,Total Costs
New York City,Manhattan,7002001,001438,Bellevue Hospital Center,0 to 17,100,M,Black/African American,Unknown,14,Emergency,Short-term Hospital,2022,MBD014,Neurodevelopmental disorders,MHT002,PSYCHOTHERAPY FOR MENTAL HEALTH (EXCLUDING SUBSTANCE USE),758,BEHAVIORAL DISORDERS,19,MENTAL DISEASES AND DISORDERS,2,Moderate,Minor,Medical,Medicaid,,,,,Y,57604.65,33127.51
New York City,Manhattan,7002001,001438,Bellevue Hospital Center,0 to 17,100,M,Black/African American,Unknown,12,Emergency,Home or Self Care,2022,MBD014,Neurodevelopmental disorders,MHT001,PHARMACOTHERAPY FOR MENTAL HEALTH (EXCLUDING SUBSTANCE USE),758,BEHAVIORAL DISORDERS,19,MENTAL DISEASES AND DISORDERS,2,Moderate,Minor,Medical,Medicaid,,,,,Y,49756.81,28614.35
New York City,Manhattan,7002001,001438,Bellevue Hospital Center,0 to 17,100,M,Black/African American,Not Span/Hispanic,14,Elective,Home or Self Care,2022,MBD014,Neurodevelopmental disorders,MHT002,PSYCHOTHERAPY FOR MENTAL HEALTH (EXCLUDING SUBSTANCE USE),758,BEHAVIORAL DISORDERS,19,MENTAL DISEASES AND DISORDERS,3,Major,Moderate,Medical,Medicaid,,,,,N,55410.43,31865.65
New York City,Manhattan,7002001,001438,Bellevue Hospital Center,0 to 17,104,F,Black/African American,Not Span/Hispanic,10,Emergency,Home or Self Care,2022,MBD014,Neurodevelopmental disorders,MHT002,PSYCHOTHERAPY FOR MENTAL HEALTH (EXCLUDING SUBSTANCE USE),758,BEHAVIORAL DISORDERS,19,MENTAL DISEASES AND DISORDERS,2,Moderate,Minor,Medical,Medicaid,,,,,Y,42330.63,24343.67
New York City,Manhattan,7002001,001438,Bellevue Hospital Center,0 to 17,,M,Multi-racial,Not Span/Hispanic,2,Emergency,Home or Self Care,2022,MBD014,Neurodevelopmental disorders,MHT001,PHARMACOTHERAPY FOR MENTAL HEALTH (EXCLUDING SUBSTANCE USE),758,BEHAVIORAL DISORDERS,19,MENTAL DISEASES AND DISORDERS,1,Minor,Minor,Medical,Medicaid,,,,,Y,9767.90,5617.36
New York City,Manhattan,7002001,001438,Bellevue Hospital Center,0 to 17,111,M,Other Race,Spanish/Hispanic,15,Emergency,Home or Self Care,2022,MBD014,Neurodevelopmental disorders,MHT001,PHARMACOTHERAPY FOR MENTAL HEALTH (EXCLUDING SUBSTANCE USE),758,BEHAVIORAL DISORDERS,19,MENTAL DISEASES AND DISORDERS,2,Moderate,Minor,Medical,Medicaid,,,,,Y,62890.84,36167.52
Finger Lakes,Monroe,2701005,000413,Strong Memorial Hospital,0 to 17,146,F,White,Not Span/Hispanic,3,Emergency,Home or Self Care,2022,MBD008,"Disruptive, impulse-control and conduct disorders",,,758,BEHAVIORAL DISORDERS,19,MENTAL DISEASES AND DISORDERS,2,Moderate,Minor,Medical,Blue Cross/Blue Shield,,,,,Y,9251.08,4261.27
New York City,Manhattan,7002001,001438,Bellevue Hospital Center,0 to 17,112,F,Black/African American,Unknown,1,Emergency,Home or Self Care,2022,MBD014,Neurodevelopmental disorders,MHT001,PHARMACOTHERAPY FOR MENTAL HEALTH (EXCLUDING SUBSTANCE USE),758,BEHAVIORAL DISORDERS,19,MENTAL DISEASES AND DISORDERS,2,Moderate,Minor,Medical,Medicaid,,,,,Y,5967.03,3431.54
New York City,Manhattan,7002001,001438,Bellevue Hospital Center,0 to 17,100,F,Black/African American,Not Span/Hispanic,14,Urgent,Home or Self Care,2022,MBD014,Neurodevelopmental disorders,MHT001,PHARMACOTHERAPY FOR MENTAL HEALTH (EXCLUDING SUBSTANCE USE),758,BEHAVIORAL DISORDERS,19,MENTAL DISEASES AND DISORDERS,3,Major,Moderate,Medical,Medicaid,,,,,N,55352.46,31832.31
New York City,Manhattan,7002001,001438,Bellevue Hospital Center,0 to 17,104,M,Other Race,Spanish/Hispanic,8,Emergency,Home or Self Care,2022,MBD014,Neurodevelopmental disorders,MHT001,PHARMACOTHERAPY FOR MENTAL HEALTH (EXCLUDING SUBSTANCE USE),758,BEHAVIORAL DISORDERS,19,MENTAL DISEASES AND DISORDERS,2,Moderate,Minor,Medical,Medicaid,,,,,N,31478.40,18102.72
New York City,Manhattan,7002001,001438,Bellevue Hospital Center,0 to 17,100,M,Other Race,Unknown,13,Emergency,Home or Self Care,2022,MBD014,Neurodevelopmental disorders,MHT001,PHARMACOTHERAPY FOR MENTAL HEALTH (EXCLUDING SUBSTANCE USE),758,BEHAVIORAL DISORDERS,19,MENTAL DISEASES AND DISORDERS,2,Moderate,Minor,Medical,Private Health Insurance,,,,,Y,53262.78,30630.57
New York City,Manhattan,7002001,001438,Bellevue Hospital Center,30 to 49,100,M,Other Race,Spanish/Hispanic,10,Emergency,Home or Self Care,2022,MBD008,"Disruptive, impulse-control and conduct disorders",MHT001,PHARMACOTHERAPY FOR MENTAL HEALTH (EXCLUDING SUBSTANCE USE),758,BEHAVIORAL DISORDERS,19,MENTAL DISEASES AND DISORDERS,2,Moderate,Moderate,Medical,Medicaid,,,,,Y,46457.71,26717.09
New York City,Manhattan,7002001,001438,Bellevue Hospital Center,0 to 17,112,M,Black/African American,Unknown,77,Urgent,Home or Self Care,2022,MBD014,Neurodevelopmental disorders,MHT002,PSYCHOTHERAPY FOR MENTAL HEALTH (EXCLUDING SUBSTANCE USE),758,BEHAVIORAL DISORDERS,19,MENTAL DISEASES AND DISORDERS,3,Major,Moderate,Medical,Medicaid,,,,,N,307242.92,176690.49
New York City,Manhattan,7002001,001438,Bellevue Hospital Center,0 to 17,100,M,Black/African American,Not Span/Hispanic,1,Emergency,Home or Self Care,2022,MBD014,Neurodevelopmental disorders,,,758,BEHAVIORAL DISORDERS,19,MENTAL DISEASES AND DISORDERS,2,Moderate,Minor,Medical,Medicaid,,,,,Y,5859.48,3369.69
New York City,Manhattan,7002001,001438,Bellevue Hospital Center,30 to 49,100,F,Other Race,Spanish/Hispanic,9,Emergency,Home or Self Care,2022,MBD008,"Disruptive, impulse-control and conduct disorders",MAM008,CARDIAC MONITORING,758,BEHAVIORAL DISORDERS,19,MENTAL DISEASES AND DISORDERS,1,Minor,Minor,Medical,Medicare,Medicaid,,,,Y,55895.77,32144.76
New York City,Manhattan,7002001,001438,Bellevue Hospital Center,0 to 17,104,F,Other Race,Spanish/Hispanic,14,Emergency,Home or Self Care,2022,MBD014,Neurodevelopmental disorders,MHT001,PHARMACOTHERAPY FOR MENTAL HEALTH (EXCLUDING SUBSTANCE USE),758,BEHAVIORAL DISORDERS,19,MENTAL DISEASES AND DISORDERS,2,Moderate,Minor,Medical,Medicaid,,,,,Y,60061.64,34540.49
New York City,Manhattan,7002001,001438,Bellevue Hospital Center,0 to 17,112,M,Black/African American,Unknown,17,Emergency,Home or Self Care,2022,MBD014,Neurodevelopmental disorders,ADM021,"ADMINISTRATION OF THERAPEUTIC SUBSTANCES, NEC",758,BEHAVIORAL DISORDERS,19,MENTAL DISEASES AND DISORDERS,2,Moderate,Minor,Medical,Medicaid,,,,,Y,69141.45,39762.14
New York City,Manhattan,7002001,001438,Bellevue Hospital Center,0 to 17,104,M,Black/African American,Unknown,14,Elective,Home or Self Care,2022,MBD014,Neurodevelopmental disorders,MHT001,PHARMACOTHERAPY FOR MENTAL HEALTH (EXCLUDING SUBSTANCE USE),758,BEHAVIORAL DISORDERS,19,MENTAL DISEASES AND DISORDERS,2,Moderate,Minor,Medical,Medicaid,,,,,N,54939.82,31595.01
New York City,Manhattan,7002001,001438,Bellevue Hospital Center,30 to 49,100,M,White,Unknown,1,Emergency,Home or Self Care,2022,MBD014,Neurodevelopmental disorders,MHT005,"MENTAL HEALTH PROCEDURES, NEC",758,BEHAVIORAL DISORDERS,19,MENTAL DISEASES AND DISORDERS,2,Moderate,Major,Medical,Private Health Insurance,,,,,Y,6901.77,3969.10
New York City,Manhattan,7002001,001438,Bellevue Hospital Center,0 to 17,100,M,Other Race,Spanish/Hispanic,1,Emergency,Home or Self Care,2022,MBD014,Neurodevelopmental disorders,MHT001,PHARMACOTHERAPY FOR MENTAL HEALTH (EXCLUDING SUBSTANCE USE),758,BEHAVIORAL DISORDERS,19,MENTAL DISEASES AND DISORDERS,1,Minor,Minor,Medical,Medicaid,,,,,Y,6227.27,3581.20
New York City,Manhattan,7002001,001438,Bellevue Hospital Center,0 to 17,104,M,Other Race,Unknown,9,Emergency,Home or Self Care,2022,MBD014,Neurodevelopmental disorders,MHT001,PHARMACOTHERAPY FOR MENTAL HEALTH (EXCLUDING SUBSTANCE USE),758,BEHAVIORAL DISORDERS,19,MENTAL DISEASES AND DISORDERS,2,Moderate,Minor,Medical,Medicaid,,,,,N,35398.49,20357.11
Finger Lakes,Monroe,2701005,000413,Strong Memorial Hospital,0 to 17,146,M,Black/African American,Not Span/Hispanic,7,Emergency,Home or Self Care,2022,MBD008,"Disruptive, impulse-control and conduct disorders",,,758,BEHAVIORAL DISORDERS,19,MENTAL DISEASES AND DISORDERS,2,Moderate,Minor,Medical,Medicaid,,,,,Y,19298.85,9480.52
New York City,Manhattan,7002001,001438,Bellevue Hospital Center,0 to 17,112,F,Black/African American,Not Span/Hispanic,25,Emergency,Home or Self Care,2022,MBD014,Neurodevelopmental disorders,MHT001,PHARMACOTHERAPY FOR MENTAL HEALTH (EXCLUDING SUBSTANCE USE),758,BEHAVIORAL DISORDERS,19,MENTAL DISEASES AND DISORDERS,2,Moderate,Minor,Medical,Medicaid,,,,,Y,100906.47,58029.70
New York City,Manhattan,7002001,001438,Bellevue Hospital Center,0 to 17,114,F,Black/African American,Not Span/Hispanic,21,Emergency,Home or Self Care,2022,MBD014,Neurodevelopmental disorders,MHT001,PHARMACOTHERAPY FOR MENTAL HEALTH (EXCLUDING SUBSTANCE USE),758,BEHAVIORAL DISORDERS,19,MENTAL DISEASES AND DISORDERS,2,Moderate,Minor,Medical,Medicaid,,,,,N,82611.69,47508.66
New York City,Manhattan,7002001,001438,Bellevue Hospital Center,0 to 17,112,F,Black/African American,Not Span/Hispanic,17,Emergency,Home or Self Care,2022,MBD014,Neurodevelopmental disorders,MHT001,PHARMACOTHERAPY FOR MENTAL HEALTH (EXCLUDING SUBSTANCE USE),758,BEHAVIORAL DISORDERS,19,MENTAL DISEASES AND DISORDERS,1,Minor,Minor,Medical,Medicaid,,,,,Y,68716.03,39517.49
New York City,Manhattan,7002001,001438,Bellevue Hospital Center,0 to 17,112,M,Black/African American,Unknown,14,Emergency,Home or Self Care,2022,MBD014,Neurodevelopmental disorders,MHT001,PHARMACOTHERAPY FOR MENTAL HEALTH (EXCLUDING SUBSTANCE USE),758,BEHAVIORAL DISORDERS,19,MENTAL DISEASES AND DISORDERS,2,Moderate,Minor,Medical,Medicaid,,,,,N,55973.57,32189.50
New York City,Manhattan,7002001,001438,Bellevue Hospital Center,0 to 17,100,M,Other Race,Unknown,1,Emergency,Home or Self Care,2022,MBD014,Neurodevelopmental disorders,MHT001,PHARMACOTHERAPY FOR MENTAL HEALTH (EXCLUDING SUBSTANCE USE),758,BEHAVIORAL DISORDERS,19,MENTAL DISEASES AND DISORDERS,2,Moderate,Minor,Medical,Private Health Insurance,,,,,Y,6214.80,3574.03
New York City,Manhattan,7002001,001438,Bellevue Hospital Center,0 to 17,100,M,Black/African American,Unknown,16,Emergency,Home or Self Care,2022,MBD014,Neurodevelopmental disorders,MHT001,PHARMACOTHERAPY FOR MENTAL HEALTH (EXCLUDING SUBSTANCE USE),758,BEHAVIORAL DISORDERS,19,MENTAL DISEASES AND DISORDERS,1,Minor,Minor,Medical,Medicaid,,,,,Y,64773.62,37250.27
New York City,Manhattan,7002001,001438,Bellevue Hospital Center,0 to 17,112,F,Black/African American,Unknown,19,Emergency,Home or Self Care,2022,MBD014,Neurodevelopmental disorders,MHT001,PHARMACOTHERAPY FOR MENTAL HEALTH (EXCLUDING SUBSTANCE USE),758,BEHAVIORAL DISORDERS,19,MENTAL DISEASES AND DISORDERS,1,Minor,Minor,Medical,Medicaid,,,,,Y,77644.24,44651.96
New York City,Manhattan,7002001,001438,Bellevue Hospital Center,0 to 17,104,M,Other Race,Spanish/Hispanic,112,Urgent,Home or Self Care,2022,MBD014,Neurodevelopmental disorders,MHT001,PHARMACOTHERAPY FOR MENTAL HEALTH (EXCLUDING SUBSTANCE USE),758,BEHAVIORAL DISORDERS,19,MENTAL DISEASES AND DISORDERS,3,Major,Minor,Medical,Medicaid,,,,,N,447232.08,257196.01
New York City,Manhattan,7002001,001438,Bellevue Hospital Center,30 to 49,OOS,M,Black/African American,Not Span/Hispanic,6,Emergency,Court/Law Enforcement,2022,MBD008,"Disruptive, impulse-control and conduct disorders",MHT001,PHARMACOTHERAPY FOR MENTAL HEALTH (EXCLUDING SUBSTANCE USE),758,BEHAVIORAL DISORDERS,19,MENTAL DISEASES AND DISORDERS,2,Moderate,Minor,Medical,Medicare,,,,,Y,28771.96,16546.29
New York City,Manhattan,7002001,001438,Bellevue Hospital Center,0 to 17,112,M,Black/African American,Unknown,2,Emergency,Facility w/ Custodial/Supportive Care,2022,MBD014,Neurodevelopmental disorders,MHT001,PHARMACOTHERAPY FOR MENTAL HEALTH (EXCLUDING SUBSTANCE USE),758,BEHAVIORAL DISORDERS,19,MENTAL DISEASES AND DISORDERS,2,Moderate,Minor,Medical,Medicaid,,,,,Y,9419.78,5417.16
New York City,Manhattan,7002001,001438,Bellevue Hospital Center,18 to 29,116,F,Black/African American,Not Span/Hispanic,14,Emergency,Home or Self Care,2022,MBD008,"Disruptive, impulse-control and conduct disorders",MHT001,PHARMACOTHERAPY FOR MENTAL HEALTH (EXCLUDING SUBSTANCE USE),758,BEHAVIORAL DISORDERS,19,MENTAL DISEASES AND DISORDERS,2,Moderate,Minor,Medical,Medicaid,,,,,Y,59737.91,34354.32
New York City,Manhattan,7002001,001438,Bellevue Hospital Center,0 to 17,100,M,White,Unknown,1,Emergency,Home or Self Care,2022,MBD008,"Disruptive, impulse-control and conduct disorders",MHT005,"MENTAL HEALTH PROCEDURES, NEC",758,BEHAVIORAL DISORDERS,19,MENTAL DISEASES AND DISORDERS,1,Minor,Minor,Medical,Medicaid,,,,,Y,6882.96,3958.28
New York City,Manhattan,7002001,001438,Bellevue Hospital Center,0 to 17,104,F,Black/African American,Unknown,3,Emergency,Home or Self Care,2022,MBD014,Neurodevelopmental disorders,MHT001,PHARMACOTHERAPY FOR MENTAL HEALTH (EXCLUDING SUBSTANCE USE),758,BEHAVIORAL DISORDERS,19,MENTAL DISEASES AND DISORDERS,2,Moderate,Minor,Medical,Medicaid,,,,,Y,14583.90,8386.97
New York City,Manhattan,7002001,001438,Bellevue Hospital Center,0 to 17,111,M,Other Race,Spanish/Hispanic,13,Emergency,Home or Self Care,2022,MBD014,Neurodevelopmental disorders,MHT001,PHARMACOTHERAPY FOR MENTAL HEALTH (EXCLUDING SUBSTANCE USE),758,BEHAVIORAL DISORDERS,19,MENTAL DISEASES AND DISORDERS,1,Minor,Minor,Medical,Medicaid,,,,,N,51279.78,29490.18
New York City,Manhattan,7002001,001438,Bellevue Hospital Center,0 to 17,100,M,White,Unknown,22,Emergency,Home or Self Care,2022,MBD014,Neurodevelopmental disorders,MHT002,PSYCHOTHERAPY FOR MENTAL HEALTH (EXCLUDING SUBSTANCE USE),758,BEHAVIORAL DISORDERS,19,MENTAL DISEASES AND DISORDERS,2,Moderate,Moderate,Medical,Private Health Insurance,Private Health Insurance,,,,Y,89254.09,51328.60
New York City,Manhattan,7002001,001438,Bellevue Hospital Center,0 to 17,100,M,White,Unknown,3,Emergency,Facility w/ Custodial/Supportive Care,2022,MBD014,Neurodevelopmental disorders,MHT001,PHARMACOTHERAPY FOR MENTAL HEALTH (EXCLUDING SUBSTANCE USE),758,BEHAVIORAL DISORDERS,19,MENTAL DISEASES AND DISORDERS,2,Moderate,Minor,Medical,Medicaid,,,,,Y,13671.62,7862.33
Finger Lakes,Monroe,2701005,000413,Strong Memorial Hospital,0 to 17,146,M,White,Not Span/Hispanic,26,Emergency,Home or Self Care,2022,MBD008,"Disruptive, impulse-control and conduct disorders",,,758,BEHAVIORAL DISORDERS,19,MENTAL DISEASES AND DISORDERS,2,Moderate,Minor,Medical,Medicaid,,,,,Y,56378.71,30714.02
Finger Lakes,Monroe,2701005,000413,Strong Memorial Hospital,0 to 17,146,F,Black/African American,Not Span/Hispanic,27,Emergency,Another Type Not Listed,2022,MBD008,"Disruptive, impulse-control and conduct disorders",,,758,BEHAVIORAL DISORDERS,19,MENTAL DISEASES AND DISORDERS,2,Moderate,Minor,Medical,Medicaid,,,,,Y,53782.45,30864.58
Finger Lakes,Monroe,2701005,000413,Strong Memorial Hospital,0 to 17,146,M,Other Race,Spanish/Hispanic,9,Emergency,Court/Law Enforcement,2022,MBD008,"Disruptive, impulse-control and conduct disorders",,,758,BEHAVIORAL DISORDERS,19,MENTAL DISEASES AND DISORDERS,2,Moderate,Minor,Medical,Medicaid,,,,,Y,20845.48,10996.43
New York City,Manhattan,7002001,001438,Bellevue Hospital Center,0 to 17,104,M,Black/African American,Unknown,21,Emergency,Home or Self Care,2022,MBD014,Neurodevelopmental disorders,ADM021,"ADMINISTRATION OF THERAPEUTIC SUBSTANCES, NEC",758,BEHAVIORAL DISORDERS,19,MENTAL DISEASES AND DISORDERS,1,Minor,Minor,Medical,Medicaid,,,,,N,82294.59,47326.30
New York City,Manhattan,7002001,001438,Bellevue Hospital Center,0 to 17,100,M,Black/African American,Spanish/Hispanic,1,Emergency,Facility w/ Custodial/Supportive Care,2022,MBD014,Neurodevelopmental disorders,MHT001,PHARMACOTHERAPY FOR MENTAL HEALTH (EXCLUDING SUBSTANCE USE),758,BEHAVIORAL DISORDERS,19,MENTAL DISEASES AND DISORDERS,2,Moderate,Minor,Medical,Medicaid,,,,,Y,6086.88,3500.47
New York City,Manhattan,7002001,001438,Bellevue Hospital Center,0 to 17,112,F,Black/African American,Unknown,1,Emergency,Home or Self Care,2022,MBD008,"Disruptive, impulse-control and conduct disorders",MHT005,"MENTAL HEALTH PROCEDURES, NEC",758,BEHAVIORAL DISORDERS,19,MENTAL DISEASES AND DISORDERS,1,Minor,Minor,Medical,Medicaid,,,,,Y,6904.33,3970.57
New York City,Manhattan,7002001,001438,Bellevue Hospital Center,0 to 17,100,F,Other Race,Unknown,2,Emergency,Home or Self Care,2022,MBD014,Neurodevelopmental disorders,MHT001,PHARMACOTHERAPY FOR MENTAL HEALTH (EXCLUDING SUBSTANCE USE),758,BEHAVIORAL DISORDERS,19,MENTAL DISEASES AND DISORDERS,2,Moderate,Minor,Medical,Medicaid,,,,,Y,9763.27,5614.70
New York City,Manhattan,7002001,001438,Bellevue Hospital Center,0 to 17,104,F,Other Race,Unknown,1,Emergency,Home or Self Care,2022,MBD014,Neurodevelopmental disorders,MHT001,PHARMACOTHERAPY FOR MENTAL HEALTH (EXCLUDING SUBSTANCE USE),758,BEHAVIORAL DISORDERS,19,MENTAL DISEASES AND DISORDERS,2,Moderate,Minor,Medical,Medicaid,,,,,Y,5867.65,3374.39
New York City,Manhattan,7002001,001438,Bellevue Hospital Center,0 to 17,114,M,Black/African American,Unknown,12,Emergency,Home or Self Care,2022,MBD014,Neurodevelopmental disorders,MHT001,PHARMACOTHERAPY FOR MENTAL HEALTH (EXCLUDING SUBSTANCE USE),758,BEHAVIORAL DISORDERS,19,MENTAL DISEASES AND DISORDERS,2,Moderate,Minor,Medical,Medicaid,,,,,Y,49058.92,28213.00
New York City,Manhattan,7002001,001438,Bellevue Hospital Center,0 to 17,100,F,Other Race,Spanish/Hispanic,2,Emergency,Home or Self Care,2022,MBD014,Neurodevelopmental disorders,MHT001,PHARMACOTHERAPY FOR MENTAL HEALTH (EXCLUDING SUBSTANCE USE),758,BEHAVIORAL DISORDERS,19,MENTAL DISEASES AND DISORDERS,2,Moderate,Minor,Medical,Private Health Insurance,Medicaid,,,,Y,13839.17,7958.69
Western NY,Cattaraugus,0401001,000066,Olean General Hospital,30 to 49,147,M,White,Not Span/Hispanic,3,Emergency,Home or Self Care,2022,MBD008,"Disruptive, impulse-control and conduct disorders",,,758,BEHAVIORAL DISORDERS,19,MENTAL DISEASES AND DISORDERS,2,Moderate,Minor,Medical,Medicaid,,,,,Y,4502.90,2624.07
New York City,Manhattan,7002001,001438,Bellevue Hospital Center,0 to 17,100,F,Black/African American,Spanish/Hispanic,26,Emergency,Home or Self Care,2022,MBD014,Neurodevelopmental disorders,MHT002,PSYCHOTHERAPY FOR MENTAL HEALTH (EXCLUDING SUBSTANCE USE),758,BEHAVIORAL DISORDERS,19,MENTAL DISEASES AND DISORDERS,2,Moderate,Minor,Medical,Medicaid,,,,,Y,103845.03,59719.62
New York City,Manhattan,7002001,001438,Bellevue Hospital Center,0 to 17,113,M,Other Race,Spanish/Hispanic,1,Emergency,Home or Self Care,2022,MBD014,Neurodevelopmental disorders,,,758,BEHAVIORAL DISORDERS,19,MENTAL DISEASES AND DISORDERS,2,Moderate,Minor,Medical,Private Health Insurance,,,,,Y,6224.96,3579.87
Finger Lakes,Monroe,2701005,000413,Strong Memorial Hospital,0 to 17,145,F,White,Not Span/Hispanic,10,Emergency,Home or Self Care,2022,MBD014,Neurodevelopmental disorders,,,758,BEHAVIORAL DISORDERS,19,MENTAL DISEASES AND DISORDERS,1,Minor,Minor,Medical,Medicaid,,,,,Y,26088.58,12988.23
Finger Lakes,Monroe,2701005,000413,Strong Memorial Hospital,0 to 17,146,F,Other Race,Spanish/Hispanic,8,Urgent,Home or Self Care,2022,MBD014,Neurodevelopmental disorders,,,758,BEHAVIORAL DISORDERS,19,MENTAL DISEASES AND DISORDERS,1,Minor,Minor,Medical,Medicaid,,,,,N,14678.88,8815.15
Finger Lakes,Monroe,2701005,000413,Strong Memorial Hospital,0 to 17,145,M,White,Not Span/Hispanic,6,Emergency,Home or Self Care,2022,MBD014,Neurodevelopmental disorders,,,758,BEHAVIORAL DISORDERS,19,MENTAL DISEASES AND DISORDERS,1,Minor,Minor,Medical,Medicaid,,,,,Y,15342.86,7682.03
New York City,Manhattan,7002001,001438,Bellevue Hospital Center,0 to 17,100,M,Black/African American,Not Span/Hispanic,2,Emergency,Home or Self Care,2022,MBD014,Neurodevelopmental disorders,MHT001,PHARMACOTHERAPY FOR MENTAL HEALTH (EXCLUDING SUBSTANCE USE),758,BEHAVIORAL DISORDERS,19,MENTAL DISEASES AND DISORDERS,2,Moderate,Minor,Medical,Medicaid,,,,,Y,10000.80,5751.30
New York City,Manhattan,7002001,001438,Bellevue Hospital Center,0 to 17,104,M,Other Race,Unknown,15,Urgent,Home or Self Care,2022,MBD014,Neurodevelopmental disorders,MHT002,PSYCHOTHERAPY FOR MENTAL HEALTH (EXCLUDING SUBSTANCE USE),758,BEHAVIORAL DISORDERS,19,MENTAL DISEASES AND DISORDERS,2,Moderate,Minor,Medical,Medicaid,,,,,N,59071.76,33971.22
Finger Lakes,Monroe,2701005,000413,Strong Memorial Hospital,0 to 17,145,M,White,Spanish/Hispanic,8,Emergency,Home or Self Care,2022,MBD008,"Disruptive, impulse-control and conduct disorders",ADM017,ADMINISTRATION OF NUTRITIONAL AND ELECTROLYTIC SUBSTANCES,758,BEHAVIORAL DISORDERS,19,MENTAL DISEASES AND DISORDERS,2,Moderate,Minor,Medical,Blue Cross/Blue Shield,Medicaid,,,,Y,20200.31,11022.05
New York City,Manhattan,7002001,001438,Bellevue Hospital Center,0 to 17,114,M,Black/African American,Unknown,1,Emergency,Home or Self Care,2022,MBD014,Neurodevelopmental disorders,MHT001,PHARMACOTHERAPY FOR MENTAL HEALTH (EXCLUDING SUBSTANCE USE),758,BEHAVIORAL DISORDERS,19,MENTAL DISEASES AND DISORDERS,2,Moderate,Minor,Medical,Medicaid,,,,,Y,5937.09,3414.33
New York City,Manhattan,7002001,001438,Bellevue Hospital Center,0 to 17,111,M,Other Race,Spanish/Hispanic,4,Emergency,Home or Self Care,2022,MBD014,Neurodevelopmental disorders,MHT001,PHARMACOTHERAPY FOR MENTAL HEALTH (EXCLUDING SUBSTANCE USE),758,BEHAVIORAL DISORDERS,19,MENTAL DISEASES AND DISORDERS,2,Moderate,Minor,Medical,Medicaid,,,,,Y,17572.09,10105.43
New York City,Manhattan,7002001,001438,Bellevue Hospital Center,0 to 17,100,M,Other Race,Unknown,38,Emergency,Home or Self Care,2022,MBD014,Neurodevelopmental disorders,MHT001,PHARMACOTHERAPY FOR MENTAL HEALTH (EXCLUDING SUBSTANCE USE),758,BEHAVIORAL DISORDERS,19,MENTAL DISEASES AND DISORDERS,2,Moderate,Minor,Medical,Private Health Insurance,,,,,Y,151295.49,87007.62
New York City,Manhattan,7002001,001438,Bellevue Hospital Center,0 to 17,100,M,Black/African American,Not Span/Hispanic,20,Elective,Home or Self Care,2022,MBD014,Neurodevelopmental disorders,MHT002,PSYCHOTHERAPY FOR MENTAL HEALTH (EXCLUDING SUBSTANCE USE),758,BEHAVIORAL DISORDERS,19,MENTAL DISEASES AND DISORDERS,2,Moderate,Minor,Medical,Medicaid,,,,,N,78762.61,45295.12
New York City,Manhattan,7002001,001438,Bellevue Hospital Center,0 to 17,100,M,Black/African American,Unknown,13,Emergency,Home or Self Care,2022,MBD014,Neurodevelopmental disorders,MHT001,PHARMACOTHERAPY FOR MENTAL HEALTH (EXCLUDING SUBSTANCE USE),758,BEHAVIORAL DISORDERS,19,MENTAL DISEASES AND DISORDERS,2,Moderate,Minor,Medical,Medicaid,,,,,Y,53031.67,30497.66
New York City,Manhattan,7002053,001463,NYU Langone Hospitals,18 to 29,104,F,Black/African American,Not Span/Hispanic,10,Emergency,Home or Self Care,2022,MBD014,Neurodevelopmental disorders,,,758,BEHAVIORAL DISORDERS,19,MENTAL DISEASES AND DISORDERS,1,Minor,Minor,Medical,Medicaid,,,,,Y,86527.28,38927.95
New York City,Manhattan,7002001,001438,Bellevue Hospital Center,0 to 17,100,M,Black/African American,Unknown,1,Emergency,Home or Self Care,2022,MBD014,Neurodevelopmental disorders,MHT001,PHARMACOTHERAPY FOR MENTAL HEALTH (EXCLUDING SUBSTANCE USE),758,BEHAVIORAL DISORDERS,19,MENTAL DISEASES AND DISORDERS,2,Moderate,Minor,Medical,Medicaid,Medicaid,,,,Y,6104.35,3510.51
New York City,Manhattan,7002001,001438,Bellevue Hospital Center,0 to 17,100,M,Black/African American,Not Span/Hispanic,14,Emergency,Home or Self Care,2022,MBD014,Neurodevelopmental disorders,MHT001,PHARMACOTHERAPY FOR MENTAL HEALTH (EXCLUDING SUBSTANCE USE),758,BEHAVIORAL DISORDERS,19,MENTAL DISEASES AND DISORDERS,2,Moderate,Minor,Medical,Medicaid,,,,,Y,56827.44,32680.55