Hospital Service Area,Hospital County,Operating Certificate Number,Permanent Facility Id,Facility Name,Age Group,Zip Code - 3 digits,Gender,Race,Ethnicity,Length of Stay,Type of Admission,Patient Disposition,Discharge Year,CCS Diagnosis Code,CCS Diagnosis Description,CCS Procedure Code,CCS Procedure Description,APR DRG Code,APR DRG Description,APR MDC Code,APR MDC Description,APR Severity of Illness Code,APR Severity of Illness Description,APR Risk of Mortality,APR Medical Surgical Description,Payment Typology 1,Payment Typology 2,Payment Typology 3,Birth Weight,Abortion Edit Indicator,Emergency Department Indicator,Total Charges,Total Costs
New York City,Manhattan,7002054,001464,New York-Presbyterian Hospital - Columbia Presbyterian Center,30 to 49,100,M,Other Race,Not Span/Hispanic,1,Emergency,Home or Self Care,2022,MBD001,Schizophrenia spectrum and other psychotic disorders,,,760,OTHER MENTAL HEALTH DISORDERS,19,MENTAL DISEASES AND DISORDERS,1,Minor,Minor,Medical,Private Health Insurance,,,,,Y,13700.92,3273.94
New York City,Manhattan,7002001,001438,Bellevue Hospital Center,50 to 69,112,F,White,Unknown,29,Emergency,Home or Self Care,2022,MBD001,Schizophrenia spectrum and other psychotic disorders,MHT002,PSYCHOTHERAPY FOR MENTAL HEALTH (EXCLUDING SUBSTANCE USE),760,OTHER MENTAL HEALTH DISORDERS,19,MENTAL DISEASES AND DISORDERS,2,Moderate,Moderate,Medical,Medicaid,,,,,Y,119558.03,68755.91
New York City,Manhattan,7002001,001438,Bellevue Hospital Center,18 to 29,112,M,Black/African American,Unknown,1,Emergency,Home or Self Care,2022,SYM008,Symptoms of mental and substance use conditions,MHT001,PHARMACOTHERAPY FOR MENTAL HEALTH (EXCLUDING SUBSTANCE USE),760,OTHER MENTAL HEALTH DISORDERS,19,MENTAL DISEASES AND DISORDERS,1,Minor,Minor,Medical,Medicaid,,,,,Y,6611.92,3802.41
New York City,Manhattan,7002001,001438,Bellevue Hospital Center,18 to 29,100,F,Other Race,Unknown,15,Emergency,Home or Self Care,2022,MBD001,Schizophrenia spectrum and other psychotic disorders,MHT001,PHARMACOTHERAPY FOR MENTAL HEALTH (EXCLUDING SUBSTANCE USE),760,OTHER MENTAL HEALTH DISORDERS,19,MENTAL DISEASES AND DISORDERS,2,Moderate,Moderate,Medical,Medicaid,,,,,Y,65567.19,37706.64
New York City,Manhattan,7002054,001464,New York-Presbyterian Hospital - Columbia Presbyterian Center,18 to 29,115,F,White,Not Span/Hispanic,8,Urgent,Short-term Hospital,2022,MBD001,Schizophrenia spectrum and other psychotic disorders,ADM017,ADMINISTRATION OF NUTRITIONAL AND ELECTROLYTIC SUBSTANCES,760,OTHER MENTAL HEALTH DISORDERS,19,MENTAL DISEASES AND DISORDERS,4,Extreme,Moderate,Medical,Private Health Insurance,,,,,N,58166.11,14290.73
New York City,Manhattan,7002054,001464,New York-Presbyterian Hospital - Columbia Presbyterian Center,0 to 17,,M,White,Unknown,2,Elective,Home or Self Care,2022,NVS016,Sleep wake disorders,MAM011,ELECTROENCEPHALOGRAM (EEG),760,OTHER MENTAL HEALTH DISORDERS,19,MENTAL DISEASES AND DISORDERS,1,Minor,Minor,Medical,Private Health Insurance,,,,,N,35411.48,9995.17
Finger Lakes,Monroe,2701005,000413,Strong Memorial Hospital,0 to 17,145,F,White,Not Span/Hispanic,3,Elective,Left Against Medical Advice,2022,MBD010,Feeding and eating disorders,,,760,OTHER MENTAL HEALTH DISORDERS,19,MENTAL DISEASES AND DISORDERS,2,Moderate,Minor,Medical,Blue Cross/Blue Shield,,,,,N,6880.06,3875.77
Finger Lakes,Monroe,2701005,000413,Strong Memorial Hospital,30 to 49,145,F,White,Not Span/Hispanic,22,Emergency,Home w/ Home Health Services,2022,MBD010,Feeding and eating disorders,,,760,OTHER MENTAL HEALTH DISORDERS,19,MENTAL DISEASES AND DISORDERS,3,Major,Major,Medical,Medicaid,,,,,Y,46665.30,27033.59
New York City,Manhattan,7002001,001438,Bellevue Hospital Center,30 to 49,100,F,White,Unknown,1,Emergency,Home or Self Care,2022,MBD001,Schizophrenia spectrum and other psychotic disorders,MHT001,PHARMACOTHERAPY FOR MENTAL HEALTH (EXCLUDING SUBSTANCE USE),760,OTHER MENTAL HEALTH DISORDERS,19,MENTAL DISEASES AND DISORDERS,1,Minor,Minor,Medical,Private Health Insurance,,,,,Y,6850.28,3939.49
New York City,Manhattan,7002001,001438,Bellevue Hospital Center,30 to 49,100,M,Other Race,Unknown,1,Emergency,Home or Self Care,2022,MBD001,Schizophrenia spectrum and other psychotic disorders,MHT001,PHARMACOTHERAPY FOR MENTAL HEALTH (EXCLUDING SUBSTANCE USE),760,OTHER MENTAL HEALTH DISORDERS,19,MENTAL DISEASES AND DISORDERS,2,Moderate,Minor,Medical,Self-Pay,,,,,Y,6185.77,3557.34
New York City,Manhattan,7002054,001464,New York-Presbyterian Hospital - Columbia Presbyterian Center,30 to 49,100,F,Other Race,Not Span/Hispanic,2,Elective,Home or Self Care,2022,MBD007,Trauma- and stressor-related disorders,MAM011,ELECTROENCEPHALOGRAM (EEG),760,OTHER MENTAL HEALTH DISORDERS,19,MENTAL DISEASES AND DISORDERS,1,Minor,Minor,Medical,Private Health Insurance,,,,,N,32010.17,6507.64
New York City,Manhattan,7002054,001464,New York-Presbyterian Hospital - Columbia Presbyterian Center,18 to 29,104,M,Black/African American,Not Span/Hispanic,1,Emergency,Home or Self Care,2022,MBD001,Schizophrenia spectrum and other psychotic disorders,,,760,OTHER MENTAL HEALTH DISORDERS,19,MENTAL DISEASES AND DISORDERS,1,Minor,Minor,Medical,Medicaid,,,,,Y,11704.28,2737.84
New York City,Manhattan,7002053,001463,NYU Langone Hospitals,30 to 49,112,F,White,Not Span/Hispanic,3,Elective,Home or Self Care,2022,NVS016,Sleep wake disorders,MAM011,ELECTROENCEPHALOGRAM (EEG),760,OTHER MENTAL HEALTH DISORDERS,19,MENTAL DISEASES AND DISORDERS,1,Minor,Minor,Medical,Medicaid,,,,,N,98922.05,16052.32
New York City,Manhattan,7002001,001438,Bellevue Hospital Center,18 to 29,100,M,White,Unknown,1,Emergency,Court/Law Enforcement,2022,SYM008,Symptoms of mental and substance use conditions,MHT001,PHARMACOTHERAPY FOR MENTAL HEALTH (EXCLUDING SUBSTANCE USE),760,OTHER MENTAL HEALTH DISORDERS,19,MENTAL DISEASES AND DISORDERS,2,Moderate,Minor,Medical,Medicaid,,,,,Y,6160.57,3542.85
New York City,Manhattan,7002001,001438,Bellevue Hospital Center,50 to 69,,F,Black/African American,Unknown,26,Emergency,Home or Self Care,2022,MBD001,Schizophrenia spectrum and other psychotic disorders,MHT001,PHARMACOTHERAPY FOR MENTAL HEALTH (EXCLUDING SUBSTANCE USE),760,OTHER MENTAL HEALTH DISORDERS,19,MENTAL DISEASES AND DISORDERS,3,Major,Moderate,Medical,Medicare,Medicaid,,,,Y,122363.76,70369.44
Finger Lakes,Monroe,2701005,000413,Strong Memorial Hospital,18 to 29,146,F,White,Not Span/Hispanic,2,Urgent,Left Against Medical Advice,2022,MBD010,Feeding and eating disorders,GIS017,GASTROSTOMY,760,OTHER MENTAL HEALTH DISORDERS,19,MENTAL DISEASES AND DISORDERS,1,Minor,Minor,Medical,Medicaid,,,,,N,4656.95,2591.40
Finger Lakes,Monroe,2701005,000413,Strong Memorial Hospital,0 to 17,146,F,White,Spanish/Hispanic,10,Urgent,Home or Self Care,2022,MBD010,Feeding and eating disorders,,,760,OTHER MENTAL HEALTH DISORDERS,19,MENTAL DISEASES AND DISORDERS,2,Moderate,Moderate,Medical,Private Health Insurance,,,,,N,20342.53,12195.62
New York City,Manhattan,7002001,001438,Bellevue Hospital Center,30 to 49,100,M,Other Race,Spanish/Hispanic,3,Emergency,Court/Law Enforcement,2022,MBD001,Schizophrenia spectrum and other psychotic disorders,MHT001,PHARMACOTHERAPY FOR MENTAL HEALTH (EXCLUDING SUBSTANCE USE),760,OTHER MENTAL HEALTH DISORDERS,19,MENTAL DISEASES AND DISORDERS,2,Moderate,Minor,Medical,Medicaid,,,,,Y,15357.82,8832.04
New York City,Manhattan,7002001,001438,Bellevue Hospital Center,30 to 49,100,M,Black/African American,Unknown,3,Emergency,Home or Self Care,2022,SYM008,Symptoms of mental and substance use conditions,MHT001,PHARMACOTHERAPY FOR MENTAL HEALTH (EXCLUDING SUBSTANCE USE),760,OTHER MENTAL HEALTH DISORDERS,19,MENTAL DISEASES AND DISORDERS,1,Minor,Minor,Medical,Medicaid,,,,,Y,15400.51,8856.59
Long Island,Nassau,2951001,000541,North Shore University Hospital,70 or Older,113,M,White,Not Span/Hispanic,1,Emergency,Home or Self Care,2022,SYM015,General sensation/perception signs and symptoms,,,760,OTHER MENTAL HEALTH DISORDERS,19,MENTAL DISEASES AND DISORDERS,2,Moderate,Minor,Medical,Medicare,Medicare,,,,Y,28400.34,3544.59
Long Island,Nassau,2951001,000541,North Shore University Hospital,18 to 29,113,F,White,Not Span/Hispanic,42,Emergency,Home or Self Care,2022,SYM008,Symptoms of mental and substance use conditions,,,760,OTHER MENTAL HEALTH DISORDERS,19,MENTAL DISEASES AND DISORDERS,3,Major,Moderate,Medical,Medicare,Medicaid,,,,Y,419384.03,72954.83
Long Island,Nassau,2951001,000541,North Shore University Hospital,70 or Older,110,F,White,Not Span/Hispanic,2,Emergency,Home or Self Care,2022,SYM008,Symptoms of mental and substance use conditions,,,760,OTHER MENTAL HEALTH DISORDERS,19,MENTAL DISEASES AND DISORDERS,2,Moderate,Minor,Medical,Medicare,Private Health Insurance,,,,Y,32045.36,5363.76
New York City,Manhattan,7002001,001438,Bellevue Hospital Center,30 to 49,112,M,Other Race,Spanish/Hispanic,9,Emergency,Home or Self Care,2022,MBD001,Schizophrenia spectrum and other psychotic disorders,MHT001,PHARMACOTHERAPY FOR MENTAL HEALTH (EXCLUDING SUBSTANCE USE),760,OTHER MENTAL HEALTH DISORDERS,19,MENTAL DISEASES AND DISORDERS,2,Moderate,Minor,Medical,Private Health Insurance,,,,,Y,39744.24,22856.28
New York City,Manhattan,7002054,001464,New York-Presbyterian Hospital - Columbia Presbyterian Center,0 to 17,112,F,Other Race,Unknown,1,Elective,Home or Self Care,2022,NVS016,Sleep wake disorders,MAM011,ELECTROENCEPHALOGRAM (EEG),760,OTHER MENTAL HEALTH DISORDERS,19,MENTAL DISEASES AND DISORDERS,1,Minor,Minor,Medical,Private Health Insurance,,,,,N,18275.87,5096.64
New York City,Manhattan,7002001,001438,Bellevue Hospital Center,30 to 49,100,M,Black/African American,Not Span/Hispanic,1,Emergency,Home or Self Care,2022,MBD001,Schizophrenia spectrum and other psychotic disorders,MHT001,PHARMACOTHERAPY FOR MENTAL HEALTH (EXCLUDING SUBSTANCE USE),760,OTHER MENTAL HEALTH DISORDERS,19,MENTAL DISEASES AND DISORDERS,1,Minor,Minor,Medical,Medicaid,,,,,Y,6820.30,3922.25
New York City,Manhattan,7002053,001463,NYU Langone Hospitals,30 to 49,100,M,Black/African American,Not Span/Hispanic,7,Emergency,Home or Self Care,2022,MBD001,Schizophrenia spectrum and other psychotic disorders,,,760,OTHER MENTAL HEALTH DISORDERS,19,MENTAL DISEASES AND DISORDERS,1,Minor,Minor,Medical,Private Health Insurance,,,,,Y,63293.38,27456.73
New York City,Manhattan,7002053,001463,NYU Langone Hospitals,70 or Older,104,M,Other Race,Spanish/Hispanic,6,Emergency,Home w/ Home Health Services,2022,MBD001,Schizophrenia spectrum and other psychotic disorders,CNS002,LUMBAR PUNCTURE,760,OTHER MENTAL HEALTH DISORDERS,19,MENTAL DISEASES AND DISORDERS,3,Major,Major,Medical,Medicare,Medicaid,,,,Y,186630.53,34209.55
New York City,Manhattan,7002054,001464,New York-Presbyterian Hospital - Columbia Presbyterian Center,70 or Older,104,F,Other Race,Spanish/Hispanic,24,Emergency,Psychiatric Hospital or Unit of Hosp,2022,MBD001,Schizophrenia spectrum and other psychotic disorders,CNS002,LUMBAR PUNCTURE,760,OTHER MENTAL HEALTH DISORDERS,19,MENTAL DISEASES AND DISORDERS,3,Major,Major,Medical,Medicare,,,,,Y,408998.87,105310.64
New York City,Manhattan,7002001,001438,Bellevue Hospital Center,0 to 17,100,M,Black/African American,Not Span/Hispanic,36,Emergency,Psychiatric Hospital or Unit of Hosp,2022,SYM008,Symptoms of mental and substance use conditions,MHT001,PHARMACOTHERAPY FOR MENTAL HEALTH (EXCLUDING SUBSTANCE USE),760,OTHER MENTAL HEALTH DISORDERS,19,MENTAL DISEASES AND DISORDERS,2,Moderate,Minor,Medical,Medicaid,,,,,Y,150957.22,86813.08
Finger Lakes,Monroe,2701005,000413,Strong Memorial Hospital,30 to 49,146,M,Black/African American,Not Span/Hispanic,3,Emergency,Home or Self Care,2022,MBD001,Schizophrenia spectrum and other psychotic disorders,,,760,OTHER MENTAL HEALTH DISORDERS,19,MENTAL DISEASES AND DISORDERS,2,Moderate,Minor,Medical,Medicaid,,,,,Y,9404.05,4309.72
Finger Lakes,Monroe,2701005,000413,Strong Memorial Hospital,70 or Older,145,F,Black/African American,Not Span/Hispanic,19,Emergency,Home or Self Care,2022,MBD001,Schizophrenia spectrum and other psychotic disorders,,,760,OTHER MENTAL HEALTH DISORDERS,19,MENTAL DISEASES AND DISORDERS,1,Minor,Minor,Medical,Medicare,,,,,Y,44673.40,23438.77
Finger Lakes,Monroe,2701005,000413,Strong Memorial Hospital,18 to 29,145,F,Other Race,Spanish/Hispanic,9,Urgent,Home or Self Care,2022,MBD010,Feeding and eating disorders,,,760,OTHER MENTAL HEALTH DISORDERS,19,MENTAL DISEASES AND DISORDERS,2,Moderate,Moderate,Medical,Medicaid,,,,,N,18682.21,10915.61
Finger Lakes,Monroe,2701005,000413,Strong Memorial Hospital,0 to 17,130,F,White,Not Span/Hispanic,10,Urgent,Home or Self Care,2022,MBD010,Feeding and eating disorders,,,760,OTHER MENTAL HEALTH DISORDERS,19,MENTAL DISEASES AND DISORDERS,2,Moderate,Moderate,Medical,Blue Cross/Blue Shield,,,,,N,22277.74,12708.84
Finger Lakes,Monroe,2701005,000413,Strong Memorial Hospital,0 to 17,146,M,White,Spanish/Hispanic,5,Urgent,Home w/ Home Health Services,2022,MBD010,Feeding and eating disorders,GIS017,GASTROSTOMY,760,OTHER MENTAL HEALTH DISORDERS,19,MENTAL DISEASES AND DISORDERS,2,Moderate,Minor,Medical,Medicaid,,,,,N,10690.73,6291.60
New York City,Manhattan,7002001,001438,Bellevue Hospital Center,18 to 29,100,M,Black/African American,Unknown,25,Emergency,Home or Self Care,2022,MBD001,Schizophrenia spectrum and other psychotic disorders,MHT001,PHARMACOTHERAPY FOR MENTAL HEALTH (EXCLUDING SUBSTANCE USE),760,OTHER MENTAL HEALTH DISORDERS,19,MENTAL DISEASES AND DISORDERS,1,Minor,Minor,Medical,Medicaid,,,,,Y,100119.29,57577.00
New York City,Manhattan,7002001,001438,Bellevue Hospital Center,30 to 49,100,M,Multi-racial,Not Span/Hispanic,1,Emergency,Home or Self Care,2022,SYM008,Symptoms of mental and substance use conditions,MHT001,PHARMACOTHERAPY FOR MENTAL HEALTH (EXCLUDING SUBSTANCE USE),760,OTHER MENTAL HEALTH DISORDERS,19,MENTAL DISEASES AND DISORDERS,2,Moderate,Minor,Medical,Medicaid,,,,,Y,6158.17,3541.47
Long Island,Nassau,2951001,000541,North Shore University Hospital,18 to 29,113,F,White,Not Span/Hispanic,5,Emergency,Home or Self Care,2022,SYM008,Symptoms of mental and substance use conditions,,,760,OTHER MENTAL HEALTH DISORDERS,19,MENTAL DISEASES AND DISORDERS,2,Moderate,Minor,Medical,Medicare,Medicaid,,,,Y,60104.38,10740.81
Long Island,Nassau,2951001,000541,North Shore University Hospital,18 to 29,112,M,Other Race,Spanish/Hispanic,3,Elective,Home or Self Care,2022,MBD013,Miscellaneous mental and behavioral disorders/conditions,,,760,OTHER MENTAL HEALTH DISORDERS,19,MENTAL DISEASES AND DISORDERS,1,Minor,Minor,Medical,Medicaid,Medicaid,,,,N,92136.99,17094.78
New York City,Manhattan,7002054,001464,New York-Presbyterian Hospital - Columbia Presbyterian Center,50 to 69,100,M,White,Not Span/Hispanic,2,Emergency,Home or Self Care,2022,MBD001,Schizophrenia spectrum and other psychotic disorders,,,760,OTHER MENTAL HEALTH DISORDERS,19,MENTAL DISEASES AND DISORDERS,1,Minor,Minor,Medical,Self-Pay,,,,,Y,21828.40,5221.20
New York City,Manhattan,7002001,001438,Bellevue Hospital Center,0 to 17,100,M,Black/African American,Unknown,17,Emergency,Home or Self Care,2022,MBD014,Neurodevelopmental disorders,MHT001,PHARMACOTHERAPY FOR MENTAL HEALTH (EXCLUDING SUBSTANCE USE),760,OTHER MENTAL HEALTH DISORDERS,19,MENTAL DISEASES AND DISORDERS,2,Moderate,Minor,Medical,Medicaid,,,,,Y,70333.72,40447.80
Finger Lakes,Monroe,2701005,000413,Strong Memorial Hospital,18 to 29,144,F,White,Not Span/Hispanic,5,Emergency,Home or Self Care,2022,MBD010,Feeding and eating disorders,GIS025,OTHER GI SYSTEM DEVICE PROCEDURES,760,OTHER MENTAL HEALTH DISORDERS,19,MENTAL DISEASES AND DISORDERS,2,Moderate,Moderate,Medical,Medicaid,,,,,Y,19483.53,8644.37
New York City,Manhattan,7002054,001464,New York-Presbyterian Hospital - Columbia Presbyterian Center,0 to 17,100,M,Black/African American,Spanish/Hispanic,1,Elective,Home or Self Care,2022,MBD014,Neurodevelopmental disorders,MAM011,ELECTROENCEPHALOGRAM (EEG),760,OTHER MENTAL HEALTH DISORDERS,19,MENTAL DISEASES AND DISORDERS,1,Minor,Minor,Medical,Medicaid,,,,,N,17856.18,5037.44
Finger Lakes,Monroe,2701005,000413,Strong Memorial Hospital,30 to 49,144,M,White,Not Span/Hispanic,27,Emergency,Home or Self Care,2022,SYM008,Symptoms of mental and substance use conditions,,,760,OTHER MENTAL HEALTH DISORDERS,19,MENTAL DISEASES AND DISORDERS,2,Moderate,Minor,Medical,Medicaid,,,,,Y,67404.08,37652.23
Finger Lakes,Monroe,2701005,000413,Strong Memorial Hospital,30 to 49,146,M,White,Not Span/Hispanic,6,Emergency,Home or Self Care,2022,SYM008,Symptoms of mental and substance use conditions,,,760,OTHER MENTAL HEALTH DISORDERS,19,MENTAL DISEASES AND DISORDERS,2,Moderate,Minor,Medical,Medicare,Medicaid,,,,Y,18419.06,8991.13
Finger Lakes,Monroe,2701005,000413,Strong Memorial Hospital,70 or Older,146,M,White,Not Span/Hispanic,7,Emergency,Home or Self Care,2022,SYM008,Symptoms of mental and substance use conditions,,,760,OTHER MENTAL HEALTH DISORDERS,19,MENTAL DISEASES AND DISORDERS,2,Moderate,Moderate,Medical,Medicare,Medicaid,,,,Y,16653.19,9027.59
New York City,Manhattan,7002001,001438,Bellevue Hospital Center,18 to 29,100,F,Other Race,Not Span/Hispanic,2,Emergency,Home or Self Care,2022,MBD001,Schizophrenia spectrum and other psychotic disorders,MHT001,PHARMACOTHERAPY FOR MENTAL HEALTH (EXCLUDING SUBSTANCE USE),760,OTHER MENTAL HEALTH DISORDERS,19,MENTAL DISEASES AND DISORDERS,1,Minor,Minor,Medical,Medicaid,,,,,Y,10670.56,6136.47
New York City,Manhattan,7002054,001464,New York-Presbyterian Hospital - Columbia Presbyterian Center,18 to 29,104,M,Black/African American,Not Span/Hispanic,1,Emergency,Home or Self Care,2022,NVS016,Sleep wake disorders,MAM011,ELECTROENCEPHALOGRAM (EEG),760,OTHER MENTAL HEALTH DISORDERS,19,MENTAL DISEASES AND DISORDERS,1,Minor,Minor,Medical,Medicaid,,,,,Y,44081.48,9405.21
New York City,Manhattan,7002054,001464,New York-Presbyterian Hospital - Columbia Presbyterian Center,0 to 17,104,M,Other Race,Unknown,1,Elective,Home or Self Care,2022,NVS016,Sleep wake disorders,MAM011,ELECTROENCEPHALOGRAM (EEG),760,OTHER MENTAL HEALTH DISORDERS,19,MENTAL DISEASES AND DISORDERS,1,Minor,Minor,Medical,Medicaid,,,,,N,25969.85,6350.19
Long Island,Nassau,2951001,000541,North Shore University Hospital,30 to 49,113,F,Other Race,Not Span/Hispanic,3,Emergency,Home or Self Care,2022,NVS016,Sleep wake disorders,,,760,OTHER MENTAL HEALTH DISORDERS,19,MENTAL DISEASES AND DISORDERS,3,Major,Moderate,Medical,Blue Cross/Blue Shield,,,,,Y,51673.83,7534.56
New York City,Manhattan,7002054,001464,New York-Presbyterian Hospital - Columbia Presbyterian Center,0 to 17,109,M,White,Spanish/Hispanic,2,Emergency,Home or Self Care,2022,MBD014,Neurodevelopmental disorders,MAM011,ELECTROENCEPHALOGRAM (EEG),760,OTHER MENTAL HEALTH DISORDERS,19,MENTAL DISEASES AND DISORDERS,2,Moderate,Major,Medical,Private Health Insurance,,,,,Y,40652.89,9783.44
New York City,Manhattan,7002001,001438,Bellevue Hospital Center,30 to 49,104,M,Other Race,Spanish/Hispanic,1,Emergency,Home or Self Care,2022,SYM008,Symptoms of mental and substance use conditions,ADM021,"ADMINISTRATION OF THERAPEUTIC SUBSTANCES, NEC",760,OTHER MENTAL HEALTH DISORDERS,19,MENTAL DISEASES AND DISORDERS,1,Minor,Minor,Medical,Medicaid,,,,,Y,5971.55,3434.14
Finger Lakes,Monroe,2701005,000413,Strong Memorial Hospital,70 or Older,145,M,White,Not Span/Hispanic,5,Emergency,Home w/ Home Health Services,2022,MBD014,Neurodevelopmental disorders,,,760,OTHER MENTAL HEALTH DISORDERS,19,MENTAL DISEASES AND DISORDERS,2,Moderate,Major,Medical,Medicare,Medicaid,,,,Y,17442.11,8141.30
New York City,Manhattan,7002001,001438,Bellevue Hospital Center,50 to 69,100,M,Black/African American,Not Span/Hispanic,6,Emergency,Home or Self Care,2022,MBD001,Schizophrenia spectrum and other psychotic disorders,MHT001,PHARMACOTHERAPY FOR MENTAL HEALTH (EXCLUDING SUBSTANCE USE),760,OTHER MENTAL HEALTH DISORDERS,19,MENTAL DISEASES AND DISORDERS,3,Major,Moderate,Medical,Medicaid,,,,,Y,28009.63,16107.89
Finger Lakes,Monroe,2701005,000413,Strong Memorial Hospital,0 to 17,144,F,White,Not Span/Hispanic,24,Emergency,Home or Self Care,2022,MBD010,Feeding and eating disorders,GIS017,GASTROSTOMY,760,OTHER MENTAL HEALTH DISORDERS,19,MENTAL DISEASES AND DISORDERS,4,Extreme,Major,Medical,Medicaid,,,,,Y,94961.98,45986.32
New York City,Manhattan,7002001,001438,Bellevue Hospital Center,0 to 17,104,F,Other Race,Unknown,14,Emergency,Home or Self Care,2022,MBD007,Trauma- and stressor-related disorders,ADM021,"ADMINISTRATION OF THERAPEUTIC SUBSTANCES, NEC",760,OTHER MENTAL HEALTH DISORDERS,19,MENTAL DISEASES AND DISORDERS,1,Minor,Minor,Medical,Federal/State/Local/VA,Medicaid,,,,N,56965.39,32759.88
New York City,Manhattan,7002001,001438,Bellevue Hospital Center,30 to 49,104,F,Black/African American,Unknown,2,Emergency,Home or Self Care,2022,MBD001,Schizophrenia spectrum and other psychotic disorders,OTR004,ISOLATION PROCEDURES,760,OTHER MENTAL HEALTH DISORDERS,19,MENTAL DISEASES AND DISORDERS,2,Moderate,Moderate,Medical,Medicare,Medicaid,,,,Y,11237.64,6462.59
New York City,Manhattan,7002053,001463,NYU Langone Hospitals,0 to 17,112,M,Other Race,Spanish/Hispanic,1,Elective,Home or Self Care,2022,MBD014,Neurodevelopmental disorders,MAM011,ELECTROENCEPHALOGRAM (EEG),760,OTHER MENTAL HEALTH DISORDERS,19,MENTAL DISEASES AND DISORDERS,1,Minor,Minor,Medical,Medicaid,,,,,N,31908.80,3651.63
New York City,Manhattan,7002054,001464,New York-Presbyterian Hospital - Columbia Presbyterian Center,0 to 17,100,M,Other Race,Unknown,1,Elective,Home or Self Care,2022,NVS016,Sleep wake disorders,,,760,OTHER MENTAL HEALTH DISORDERS,19,MENTAL DISEASES AND DISORDERS,1,Minor,Minor,Medical,Medicaid,,,,,N,19308.13,5293.40
New York City,Manhattan,7002001,001438,Bellevue Hospital Center,30 to 49,100,M,White,Not Span/Hispanic,1,Emergency,Home or Self Care,2022,MBD001,Schizophrenia spectrum and other psychotic disorders,MHT001,PHARMACOTHERAPY FOR MENTAL HEALTH (EXCLUDING SUBSTANCE USE),760,OTHER MENTAL HEALTH DISORDERS,19,MENTAL DISEASES AND DISORDERS,2,Moderate,Minor,Medical,Medicaid,,,,,Y,6154.62,3539.42
New York City,Manhattan,7002001,001438,Bellevue Hospital Center,18 to 29,OOS,F,Other Race,Unknown,8,Emergency,Home or Self Care,2022,MBD001,Schizophrenia spectrum and other psychotic disorders,MHT002,PSYCHOTHERAPY FOR MENTAL HEALTH (EXCLUDING SUBSTANCE USE),760,OTHER MENTAL HEALTH DISORDERS,19,MENTAL DISEASES AND DISORDERS,1,Minor,Minor,Medical,Medicaid,,,,,Y,34848.87,20041.03
New York City,Manhattan,7002053,001463,NYU Langone Hospitals,0 to 17,,F,Other Race,Unknown,28,Emergency,Home w/ Home Health Services,2022,MBD014,Neurodevelopmental disorders,GIS017,GASTROSTOMY,760,OTHER MENTAL HEALTH DISORDERS,19,MENTAL DISEASES AND DISORDERS,3,Major,Moderate,Medical,Medicaid,,,,,Y,416728.11,97366.04
Long Island,Nassau,2951001,000541,North Shore University Hospital,50 to 69,113,M,Other Race,Not Span/Hispanic,3,Emergency,Home or Self Care,2022,SYM015,General sensation/perception signs and symptoms,,,760,OTHER MENTAL HEALTH DISORDERS,19,MENTAL DISEASES AND DISORDERS,2,Moderate,Minor,Medical,Medicare,Medicaid,,,,Y,67185.04,8491.24
Long Island,Nassau,2951001,000541,North Shore University Hospital,18 to 29,113,F,White,Not Span/Hispanic,1,Emergency,Home or Self Care,2022,SYM008,Symptoms of mental and substance use conditions,,,760,OTHER MENTAL HEALTH DISORDERS,19,MENTAL DISEASES AND DISORDERS,2,Moderate,Minor,Medical,Medicare,Medicaid,,,,Y,18618.79,3838.67
Long Island,Nassau,2951001,000541,North Shore University Hospital,18 to 29,113,F,White,Not Span/Hispanic,1,Emergency,Home or Self Care,2022,SYM008,Symptoms of mental and substance use conditions,,,760,OTHER MENTAL HEALTH DISORDERS,19,MENTAL DISEASES AND DISORDERS,2,Moderate,Minor,Medical,Medicare,Medicaid,,,,Y,18166.49,3268.64
New York City,Manhattan,7002001,001438,Bellevue Hospital Center,30 to 49,113,M,Other Race,Unknown,2,Emergency,Court/Law Enforcement,2022,FAC020,Lifestyle/life management factors,,,760,OTHER MENTAL HEALTH DISORDERS,19,MENTAL DISEASES AND DISORDERS,1,Minor,Minor,Medical,Medicaid,,,,,Y,10726.39,6168.58