Hospital Service Area,Hospital County,Operating Certificate Number,Permanent Facility Id,Facility Name,Age Group,Zip Code - 3 digits,Gender,Race,Ethnicity,Length of Stay,Type of Admission,Patient Disposition,Discharge Year,CCS Diagnosis Code,CCS Diagnosis Description,CCS Procedure Code,CCS Procedure Description,APR DRG Code,APR DRG Description,APR MDC Code,APR MDC Description,APR Severity of Illness Code,APR Severity of Illness Description,APR Risk of Mortality,APR Medical Surgical Description,Payment Typology 1,Payment Typology 2,Payment Typology 3,Birth Weight,Abortion Edit Indicator,Emergency Department Indicator,Total Charges,Total Costs
New York City,Manhattan,7002001,001438,Bellevue Hospital Center,50 to 69,100,M,Black/African American,Not Span/Hispanic,4,Emergency,Home or Self Care,2022,INJ022,"Poisoning by drugs, initial encounter",OTR004,ISOLATION PROCEDURES,816,TOXIC EFFECTS OF NON-MEDICINAL SUBSTANCES,21,"INJURIES, POISONINGS AND TOXIC EFFECTS OF DRUGS",3,Major,Major,Medical,Medicaid,,,,,Y,31248.91,17970.75
New York City,Manhattan,7002054,001464,New York-Presbyterian Hospital - Columbia Presbyterian Center,50 to 69,100,F,Black/African American,Not Span/Hispanic,11,Emergency,Home or Self Care,2022,INJ022,"Poisoning by drugs, initial encounter",ADM019,POTENTIAL COVID-19 THERAPIES,816,TOXIC EFFECTS OF NON-MEDICINAL SUBSTANCES,21,"INJURIES, POISONINGS AND TOXIC EFFECTS OF DRUGS",4,Extreme,Extreme,Medical,Medicare,Medicaid,,,,Y,178084.68,39628.70
New York City,Manhattan,7002054,001464,New York-Presbyterian Hospital - Columbia Presbyterian Center,30 to 49,100,M,Other Race,Spanish/Hispanic,2,Emergency,Home or Self Care,2022,INJ022,"Poisoning by drugs, initial encounter",ADM021,"ADMINISTRATION OF THERAPEUTIC SUBSTANCES, NEC",816,TOXIC EFFECTS OF NON-MEDICINAL SUBSTANCES,21,"INJURIES, POISONINGS AND TOXIC EFFECTS OF DRUGS",4,Extreme,Extreme,Medical,Medicaid,,,,,Y,34634.14,7207.22
New York City,Manhattan,7002001,001438,Bellevue Hospital Center,50 to 69,100,F,Other Race,Unknown,6,Emergency,Home or Self Care,2022,INJ022,"Poisoning by drugs, initial encounter",ESA003,MECHANICAL VENTILATION,816,TOXIC EFFECTS OF NON-MEDICINAL SUBSTANCES,21,"INJURIES, POISONINGS AND TOXIC EFFECTS OF DRUGS",3,Major,Major,Medical,Medicare,Medicaid,,,,Y,66990.09,38524.93
New York City,Manhattan,7002054,001464,New York-Presbyterian Hospital - Columbia Presbyterian Center,50 to 69,100,M,Other Race,Spanish/Hispanic,1,Emergency,Home or Self Care,2022,INJ022,"Poisoning by drugs, initial encounter",ADM021,"ADMINISTRATION OF THERAPEUTIC SUBSTANCES, NEC",816,TOXIC EFFECTS OF NON-MEDICINAL SUBSTANCES,21,"INJURIES, POISONINGS AND TOXIC EFFECTS OF DRUGS",1,Minor,Moderate,Medical,Blue Cross/Blue Shield,Medicaid,,,,Y,32359.03,6172.69
New York City,Manhattan,7002054,001464,New York-Presbyterian Hospital - Columbia Presbyterian Center,50 to 69,104,M,Black/African American,Not Span/Hispanic,13,Emergency,Inpatient Rehabilitation Facility,2022,INJ022,"Poisoning by drugs, initial encounter",,,816,TOXIC EFFECTS OF NON-MEDICINAL SUBSTANCES,21,"INJURIES, POISONINGS AND TOXIC EFFECTS OF DRUGS",2,Moderate,Moderate,Medical,Medicaid,,,,,Y,247828.96,122176.99
New York City,Manhattan,7002054,001464,New York-Presbyterian Hospital - Columbia Presbyterian Center,30 to 49,100,M,Other Race,Spanish/Hispanic,1,Emergency,Left Against Medical Advice,2022,INJ022,"Poisoning by drugs, initial encounter",,,816,TOXIC EFFECTS OF NON-MEDICINAL SUBSTANCES,21,"INJURIES, POISONINGS AND TOXIC EFFECTS OF DRUGS",2,Moderate,Moderate,Medical,Private Health Insurance,,,,,Y,21346.74,4398.87
New York City,Manhattan,7002054,001464,New York-Presbyterian Hospital - Columbia Presbyterian Center,30 to 49,100,M,Black/African American,Not Span/Hispanic,1,Emergency,Left Against Medical Advice,2022,INJ022,"Poisoning by drugs, initial encounter",,,816,TOXIC EFFECTS OF NON-MEDICINAL SUBSTANCES,21,"INJURIES, POISONINGS AND TOXIC EFFECTS OF DRUGS",2,Moderate,Minor,Medical,Medicaid,,,,,Y,20760.92,4669.04
New York City,Manhattan,7002054,001464,New York-Presbyterian Hospital - Columbia Presbyterian Center,50 to 69,100,M,Other Race,Not Span/Hispanic,8,Emergency,Expired,2022,INJ022,"Poisoning by drugs, initial encounter",RES007,AIRWAY INTUBATION,816,TOXIC EFFECTS OF NON-MEDICINAL SUBSTANCES,21,"INJURIES, POISONINGS AND TOXIC EFFECTS OF DRUGS",4,Extreme,Extreme,Medical,Medicaid,,,,,Y,355883.46,130809.67
Finger Lakes,Monroe,2701005,000413,Strong Memorial Hospital,30 to 49,OOS,M,Black/African American,Not Span/Hispanic,2,Emergency,Home or Self Care,2022,INJ022,"Poisoning by drugs, initial encounter",,,816,TOXIC EFFECTS OF NON-MEDICINAL SUBSTANCES,21,"INJURIES, POISONINGS AND TOXIC EFFECTS OF DRUGS",2,Moderate,Major,Medical,Private Health Insurance,,,,,Y,9186.96,3549.64
Finger Lakes,Monroe,2701005,000413,Strong Memorial Hospital,0 to 17,146,F,Black/African American,Not Span/Hispanic,5,Emergency,Home or Self Care,2022,INJ022,"Poisoning by drugs, initial encounter",,,816,TOXIC EFFECTS OF NON-MEDICINAL SUBSTANCES,21,"INJURIES, POISONINGS AND TOXIC EFFECTS OF DRUGS",2,Moderate,Moderate,Medical,Medicaid,,,,,Y,13269.50,6821.64
Finger Lakes,Monroe,2701005,000413,Strong Memorial Hospital,50 to 69,148,F,White,Not Span/Hispanic,15,Urgent,Skilled Nursing Home,2022,INJ023,"Toxic effects, initial encounter",RES001,BRONCHOSCOPY (DIAGNOSTIC),816,TOXIC EFFECTS OF NON-MEDICINAL SUBSTANCES,21,"INJURIES, POISONINGS AND TOXIC EFFECTS OF DRUGS",3,Major,Major,Medical,Medicaid,,,,,N,90245.19,34569.33
New York City,Manhattan,7002001,001438,Bellevue Hospital Center,50 to 69,104,M,Black/African American,Unknown,5,Emergency,Home or Self Care,2022,INJ023,"Toxic effects, initial encounter",GIS025,OTHER GI SYSTEM DEVICE PROCEDURES,816,TOXIC EFFECTS OF NON-MEDICINAL SUBSTANCES,21,"INJURIES, POISONINGS AND TOXIC EFFECTS OF DRUGS",3,Major,Major,Medical,Medicaid,,,,,Y,68187.27,39213.41
New York City,Manhattan,7002054,001464,New York-Presbyterian Hospital - Columbia Presbyterian Center,30 to 49,100,M,Black/African American,Spanish/Hispanic,2,Emergency,Left Against Medical Advice,2022,INJ022,"Poisoning by drugs, initial encounter",ESA001,HEMODIALYSIS,816,TOXIC EFFECTS OF NON-MEDICINAL SUBSTANCES,21,"INJURIES, POISONINGS AND TOXIC EFFECTS OF DRUGS",3,Major,Major,Medical,Private Health Insurance,Medicare,,,,Y,34302.77,
New York City,Manhattan,7002054,001464,New York-Presbyterian Hospital - Columbia Presbyterian Center,70 or Older,100,F,White,Not Span/Hispanic,6,Emergency,Skilled Nursing Home,2022,INJ023,"Toxic effects, initial encounter",,,816,TOXIC EFFECTS OF NON-MEDICINAL SUBSTANCES,21,"INJURIES, POISONINGS AND TOXIC EFFECTS OF DRUGS",3,Major,Major,Medical,Medicare,,,,,Y,94575.41,20133.05
New York City,Manhattan,7002001,001438,Bellevue Hospital Center,50 to 69,100,M,Black/African American,Unknown,5,Emergency,Home or Self Care,2022,INJ022,"Poisoning by drugs, initial encounter",NCM002,TOMOGRAPHIC NUCLEAR MEDICINE IMAGING,816,TOXIC EFFECTS OF NON-MEDICINAL SUBSTANCES,21,"INJURIES, POISONINGS AND TOXIC EFFECTS OF DRUGS",2,Moderate,Major,Medical,Medicaid,,,,,Y,46817.70,26924.11
New York City,Manhattan,7002001,001438,Bellevue Hospital Center,50 to 69,100,M,Black/African American,Not Span/Hispanic,4,Emergency,Left Against Medical Advice,2022,INJ022,"Poisoning by drugs, initial encounter",IMG008,ULTRASONOGRAPHY,816,TOXIC EFFECTS OF NON-MEDICINAL SUBSTANCES,21,"INJURIES, POISONINGS AND TOXIC EFFECTS OF DRUGS",2,Moderate,Major,Medical,Medicaid,,,,,Y,32571.86,18731.56
Finger Lakes,Monroe,2701005,000413,Strong Memorial Hospital,50 to 69,146,F,Black/African American,Not Span/Hispanic,2,Emergency,Home or Self Care,2022,INJ022,"Poisoning by drugs, initial encounter",,,816,TOXIC EFFECTS OF NON-MEDICINAL SUBSTANCES,21,"INJURIES, POISONINGS AND TOXIC EFFECTS OF DRUGS",3,Major,Major,Medical,Medicare,Medicaid,,,,Y,10881.37,4095.14
Finger Lakes,Monroe,2701005,000413,Strong Memorial Hospital,30 to 49,146,M,Black/African American,Not Span/Hispanic,5,Emergency,Left Against Medical Advice,2022,INJ022,"Poisoning by drugs, initial encounter",RES007,AIRWAY INTUBATION,816,TOXIC EFFECTS OF NON-MEDICINAL SUBSTANCES,21,"INJURIES, POISONINGS AND TOXIC EFFECTS OF DRUGS",4,Extreme,Extreme,Medical,Medicaid,,,,,Y,52786.70,19504.16
Finger Lakes,Monroe,2701005,000413,Strong Memorial Hospital,50 to 69,146,M,Black/African American,Not Span/Hispanic,59,Emergency,Skilled Nursing Home,2022,INJ022,"Poisoning by drugs, initial encounter",GIS017,GASTROSTOMY,816,TOXIC EFFECTS OF NON-MEDICINAL SUBSTANCES,21,"INJURIES, POISONINGS AND TOXIC EFFECTS OF DRUGS",4,Extreme,Extreme,Medical,Medicare,Medicaid,,,,Y,193278.96,101183.28
Finger Lakes,Monroe,2701005,000413,Strong Memorial Hospital,0 to 17,149,F,Multi-racial,Not Span/Hispanic,3,Urgent,Home or Self Care,2022,INJ023,"Toxic effects, initial encounter",,,816,TOXIC EFFECTS OF NON-MEDICINAL SUBSTANCES,21,"INJURIES, POISONINGS AND TOXIC EFFECTS OF DRUGS",2,Moderate,Minor,Medical,Medicaid,,,,,N,7891.54,4570.02
Finger Lakes,Monroe,2701005,000413,Strong Memorial Hospital,30 to 49,146,F,White,Not Span/Hispanic,11,Emergency,Inpatient Rehabilitation Facility,2022,INJ022,"Poisoning by drugs, initial encounter",,,816,TOXIC EFFECTS OF NON-MEDICINAL SUBSTANCES,21,"INJURIES, POISONINGS AND TOXIC EFFECTS OF DRUGS",3,Major,Major,Medical,Medicaid,,,,,Y,38581.32,18076.49
New York City,Manhattan,7002054,001464,New York-Presbyterian Hospital - Columbia Presbyterian Center,50 to 69,100,M,Black/African American,Not Span/Hispanic,27,Emergency,Skilled Nursing Home,2022,INJ022,"Poisoning by drugs, initial encounter",ESA003,MECHANICAL VENTILATION,816,TOXIC EFFECTS OF NON-MEDICINAL SUBSTANCES,21,"INJURIES, POISONINGS AND TOXIC EFFECTS OF DRUGS",4,Extreme,Extreme,Medical,Medicare,,,,,Y,488667.43,134943.39
New York City,Manhattan,7002054,001464,New York-Presbyterian Hospital - Columbia Presbyterian Center,50 to 69,100,M,Black/African American,Not Span/Hispanic,6,Emergency,Psychiatric Hospital or Unit of Hosp,2022,INJ022,"Poisoning by drugs, initial encounter",,,816,TOXIC EFFECTS OF NON-MEDICINAL SUBSTANCES,21,"INJURIES, POISONINGS AND TOXIC EFFECTS OF DRUGS",2,Moderate,Moderate,Medical,Medicaid,,,,,Y,94906.79,22017.94
New York City,Manhattan,7002001,001438,Bellevue Hospital Center,50 to 69,100,M,Black/African American,Not Span/Hispanic,6,Emergency,Home or Self Care,2022,INJ022,"Poisoning by drugs, initial encounter",ADM015,ADMINISTRATION OF ANTIBIOTICS,816,TOXIC EFFECTS OF NON-MEDICINAL SUBSTANCES,21,"INJURIES, POISONINGS AND TOXIC EFFECTS OF DRUGS",2,Moderate,Moderate,Medical,Medicaid,,,,,Y,53250.33,30623.41
New York City,Manhattan,7002001,001438,Bellevue Hospital Center,50 to 69,100,M,Black/African American,Unknown,3,Emergency,Home or Self Care,2022,INJ022,"Poisoning by drugs, initial encounter",ADM021,"ADMINISTRATION OF THERAPEUTIC SUBSTANCES, NEC",816,TOXIC EFFECTS OF NON-MEDICINAL SUBSTANCES,21,"INJURIES, POISONINGS AND TOXIC EFFECTS OF DRUGS",2,Moderate,Major,Medical,Medicare,Medicaid,,,,Y,23796.67,13685.08
New York City,Manhattan,7002001,001438,Bellevue Hospital Center,30 to 49,100,M,Other Race,Unknown,5,Emergency,Home or Self Care,2022,INJ023,"Toxic effects, initial encounter",ADM017,ADMINISTRATION OF NUTRITIONAL AND ELECTROLYTIC SUBSTANCES,816,TOXIC EFFECTS OF NON-MEDICINAL SUBSTANCES,21,"INJURIES, POISONINGS AND TOXIC EFFECTS OF DRUGS",3,Major,Major,Medical,Medicaid,,,,,Y,51623.96,29688.11
New York City,Manhattan,7002054,001464,New York-Presbyterian Hospital - Columbia Presbyterian Center,50 to 69,100,M,Black/African American,Not Span/Hispanic,1,Emergency,Home or Self Care,2022,INJ023,"Toxic effects, initial encounter",ESA004,NON-INVASIVE VENTILATION,816,TOXIC EFFECTS OF NON-MEDICINAL SUBSTANCES,21,"INJURIES, POISONINGS AND TOXIC EFFECTS OF DRUGS",3,Major,Major,Medical,Medicaid,,,,,Y,51967.43,16684.04
New York City,Manhattan,7002054,001464,New York-Presbyterian Hospital - Columbia Presbyterian Center,70 or Older,100,F,Other Race,Spanish/Hispanic,29,Emergency,Skilled Nursing Home,2022,INJ023,"Toxic effects, initial encounter",ESA001,HEMODIALYSIS,816,TOXIC EFFECTS OF NON-MEDICINAL SUBSTANCES,21,"INJURIES, POISONINGS AND TOXIC EFFECTS OF DRUGS",3,Major,Major,Medical,Medicare,,,,,Y,448598.88,110325.93
New York City,Manhattan,7002054,001464,New York-Presbyterian Hospital - Columbia Presbyterian Center,50 to 69,100,M,White,Spanish/Hispanic,3,Emergency,Home or Self Care,2022,INJ022,"Poisoning by drugs, initial encounter",,,816,TOXIC EFFECTS OF NON-MEDICINAL SUBSTANCES,21,"INJURIES, POISONINGS AND TOXIC EFFECTS OF DRUGS",3,Major,Major,Medical,Medicare,,,,,Y,64913.51,14265.16
Finger Lakes,Monroe,2701005,000413,Strong Memorial Hospital,50 to 69,146,F,Black/African American,Not Span/Hispanic,1,Emergency,Left Against Medical Advice,2022,INJ022,"Poisoning by drugs, initial encounter",,,816,TOXIC EFFECTS OF NON-MEDICINAL SUBSTANCES,21,"INJURIES, POISONINGS AND TOXIC EFFECTS OF DRUGS",4,Extreme,Extreme,Medical,Medicaid,,,,,Y,10101.11,3605.74
New York City,Manhattan,7002001,001438,Bellevue Hospital Center,30 to 49,112,M,Black/African American,Unknown,1,Emergency,Left Against Medical Advice,2022,INJ022,"Poisoning by drugs, initial encounter",MAM009,ELECTROPHYSIOLOGIC STUDIES,816,TOXIC EFFECTS OF NON-MEDICINAL SUBSTANCES,21,"INJURIES, POISONINGS AND TOXIC EFFECTS OF DRUGS",3,Major,Major,Medical,Medicare,Medicaid,,,,Y,11422.52,6568.91
New York City,Manhattan,7002054,001464,New York-Presbyterian Hospital - Columbia Presbyterian Center,50 to 69,OOS,M,Black/African American,Not Span/Hispanic,10,Emergency,Psychiatric Hospital or Unit of Hosp,2022,INJ022,"Poisoning by drugs, initial encounter",,,816,TOXIC EFFECTS OF NON-MEDICINAL SUBSTANCES,21,"INJURIES, POISONINGS AND TOXIC EFFECTS OF DRUGS",2,Moderate,Minor,Medical,Medicaid,,,,,Y,119380.90,26408.55
New York City,Manhattan,7002054,001464,New York-Presbyterian Hospital - Columbia Presbyterian Center,50 to 69,100,M,Other Race,Spanish/Hispanic,1,Emergency,Home or Self Care,2022,INJ022,"Poisoning by drugs, initial encounter",ADM021,"ADMINISTRATION OF THERAPEUTIC SUBSTANCES, NEC",816,TOXIC EFFECTS OF NON-MEDICINAL SUBSTANCES,21,"INJURIES, POISONINGS AND TOXIC EFFECTS OF DRUGS",2,Moderate,Moderate,Medical,Self-Pay,,,,,Y,19011.85,4158.53
New York City,Manhattan,7002054,001464,New York-Presbyterian Hospital - Columbia Presbyterian Center,50 to 69,100,M,Other Race,Spanish/Hispanic,1,Emergency,Home or Self Care,2022,INJ022,"Poisoning by drugs, initial encounter",SUD001,SUBSTANCE USE DETOXIFICATION,816,TOXIC EFFECTS OF NON-MEDICINAL SUBSTANCES,21,"INJURIES, POISONINGS AND TOXIC EFFECTS OF DRUGS",1,Minor,Moderate,Medical,Medicare,,,,,Y,24939.45,6102.72
New York City,Manhattan,7002054,001464,New York-Presbyterian Hospital - Columbia Presbyterian Center,50 to 69,104,M,Other Race,Spanish/Hispanic,3,Emergency,Home or Self Care,2022,INJ022,"Poisoning by drugs, initial encounter",,,816,TOXIC EFFECTS OF NON-MEDICINAL SUBSTANCES,21,"INJURIES, POISONINGS AND TOXIC EFFECTS OF DRUGS",2,Moderate,Moderate,Medical,Medicaid,,,,,Y,45738.66,9814.80
New York City,Manhattan,7002001,001438,Bellevue Hospital Center,30 to 49,100,F,Other Race,Spanish/Hispanic,1,Emergency,Court/Law Enforcement,2022,INJ022,"Poisoning by drugs, initial encounter",SUD002,PHARMACOTHERAPY FOR SUBSTANCE USE,816,TOXIC EFFECTS OF NON-MEDICINAL SUBSTANCES,21,"INJURIES, POISONINGS AND TOXIC EFFECTS OF DRUGS",1,Minor,Minor,Medical,Medicaid,,,,,Y,10155.18,5840.08
New York City,Manhattan,7002053,001463,NYU Langone Hospitals,50 to 69,114,M,Black/African American,Not Span/Hispanic,1,Emergency,Home or Self Care,2022,INJ022,"Poisoning by drugs, initial encounter",,,816,TOXIC EFFECTS OF NON-MEDICINAL SUBSTANCES,21,"INJURIES, POISONINGS AND TOXIC EFFECTS OF DRUGS",2,Moderate,Moderate,Medical,Medicaid,,,,,Y,50494.95,12756.68
New York City,Manhattan,7002001,001438,Bellevue Hospital Center,50 to 69,100,F,White,Not Span/Hispanic,1,Emergency,Home or Self Care,2022,INJ023,"Toxic effects, initial encounter",IMG007,COMPUTERIZED TOMOGRAPHY (CT) WITHOUT CONTRAST,816,TOXIC EFFECTS OF NON-MEDICINAL SUBSTANCES,21,"INJURIES, POISONINGS AND TOXIC EFFECTS OF DRUGS",2,Moderate,Moderate,Medical,Medicaid,,,,,Y,11162.32,6419.27
New York City,Manhattan,7002054,001464,New York-Presbyterian Hospital - Columbia Presbyterian Center,50 to 69,100,M,Other Race,Spanish/Hispanic,1,Emergency,Home or Self Care,2022,INJ022,"Poisoning by drugs, initial encounter",ADM021,"ADMINISTRATION OF THERAPEUTIC SUBSTANCES, NEC",816,TOXIC EFFECTS OF NON-MEDICINAL SUBSTANCES,21,"INJURIES, POISONINGS AND TOXIC EFFECTS OF DRUGS",2,Moderate,Moderate,Medical,Medicaid,,,,,Y,22951.99,4617.99
New York City,Manhattan,7002054,001464,New York-Presbyterian Hospital - Columbia Presbyterian Center,30 to 49,100,M,Other Race,Unknown,1,Emergency,Home or Self Care,2022,INJ022,"Poisoning by drugs, initial encounter",ADM021,"ADMINISTRATION OF THERAPEUTIC SUBSTANCES, NEC",816,TOXIC EFFECTS OF NON-MEDICINAL SUBSTANCES,21,"INJURIES, POISONINGS AND TOXIC EFFECTS OF DRUGS",1,Minor,Minor,Medical,Medicaid,,,,,Y,21119.70,
Finger Lakes,Monroe,2701005,000413,Strong Memorial Hospital,30 to 49,148,F,White,Not Span/Hispanic,11,Urgent,Home or Self Care,2022,INJ022,"Poisoning by drugs, initial encounter",MAM011,ELECTROENCEPHALOGRAM (EEG),816,TOXIC EFFECTS OF NON-MEDICINAL SUBSTANCES,21,"INJURIES, POISONINGS AND TOXIC EFFECTS OF DRUGS",2,Moderate,Minor,Medical,Federal/State/Local/VA,Medicaid,,,,N,41428.29,18492.98
Finger Lakes,Monroe,2701005,000413,Strong Memorial Hospital,30 to 49,146,M,White,Not Span/Hispanic,3,Emergency,Home or Self Care,2022,INJ023,"Toxic effects, initial encounter",,,816,TOXIC EFFECTS OF NON-MEDICINAL SUBSTANCES,21,"INJURIES, POISONINGS AND TOXIC EFFECTS OF DRUGS",3,Major,Major,Medical,Medicaid,,,,,Y,17806.60,6242.45
Finger Lakes,Monroe,2701005,000413,Strong Memorial Hospital,18 to 29,145,M,White,Not Span/Hispanic,5,Emergency,Home w/ Home Health Services,2022,INJ023,"Toxic effects, initial encounter",RES007,AIRWAY INTUBATION,816,TOXIC EFFECTS OF NON-MEDICINAL SUBSTANCES,21,"INJURIES, POISONINGS AND TOXIC EFFECTS OF DRUGS",4,Extreme,Extreme,Medical,Miscellaneous/Other,Medicaid,,,,Y,75251.12,25060.79
Capital/Adirond,Warren,5601000,001005,Glens Falls Hospital,70 or Older,128,M,White,Not Span/Hispanic,2,Emergency,Home or Self Care,2022,INJ022,"Poisoning by drugs, initial encounter",,,816,TOXIC EFFECTS OF NON-MEDICINAL SUBSTANCES,21,"INJURIES, POISONINGS AND TOXIC EFFECTS OF DRUGS",3,Major,Major,Medical,Medicare,,,,,Y,11088.98,2555.00
Capital/Adirond,Warren,5601000,001005,Glens Falls Hospital,50 to 69,128,M,White,Not Span/Hispanic,2,Emergency,Home or Self Care,2022,INJ022,"Poisoning by drugs, initial encounter",,,816,TOXIC EFFECTS OF NON-MEDICINAL SUBSTANCES,21,"INJURIES, POISONINGS AND TOXIC EFFECTS OF DRUGS",3,Major,Extreme,Medical,Medicaid,,,,,Y,12942.93,4888.25
Long Island,Nassau,2951001,000541,North Shore University Hospital,50 to 69,114,F,Black/African American,Not Span/Hispanic,1,Emergency,Home or Self Care,2022,INJ023,"Toxic effects, initial encounter",,,816,TOXIC EFFECTS OF NON-MEDICINAL SUBSTANCES,21,"INJURIES, POISONINGS AND TOXIC EFFECTS OF DRUGS",1,Minor,Minor,Medical,Private Health Insurance,Medicare,,,,Y,26556.98,3697.40
Finger Lakes,Monroe,2701005,000413,Strong Memorial Hospital,50 to 69,146,M,Black/African American,Not Span/Hispanic,4,Emergency,Skilled Nursing Home,2022,INJ023,"Toxic effects, initial encounter",ESA004,NON-INVASIVE VENTILATION,816,TOXIC EFFECTS OF NON-MEDICINAL SUBSTANCES,21,"INJURIES, POISONINGS AND TOXIC EFFECTS OF DRUGS",3,Major,Major,Medical,Medicare,Medicaid,,,,Y,33104.62,14985.80
Finger Lakes,Monroe,2701005,000413,Strong Memorial Hospital,30 to 49,146,M,White,Not Span/Hispanic,5,Emergency,Home or Self Care,2022,INJ022,"Poisoning by drugs, initial encounter",,,816,TOXIC EFFECTS OF NON-MEDICINAL SUBSTANCES,21,"INJURIES, POISONINGS AND TOXIC EFFECTS OF DRUGS",4,Extreme,Extreme,Medical,Medicaid,,,,,Y,15275.83,7403.64
Finger Lakes,Monroe,2701005,000413,Strong Memorial Hospital,50 to 69,145,M,White,Not Span/Hispanic,1,Emergency,Home or Self Care,2022,INJ023,"Toxic effects, initial encounter",,,816,TOXIC EFFECTS OF NON-MEDICINAL SUBSTANCES,21,"INJURIES, POISONINGS AND TOXIC EFFECTS OF DRUGS",1,Minor,Minor,Medical,Miscellaneous/Other,Blue Cross/Blue Shield,,,,Y,7130.96,2450.22
Finger Lakes,Monroe,2701005,000413,Strong Memorial Hospital,30 to 49,146,M,White,Not Span/Hispanic,1,Emergency,Left Against Medical Advice,2022,INJ022,"Poisoning by drugs, initial encounter",,,816,TOXIC EFFECTS OF NON-MEDICINAL SUBSTANCES,21,"INJURIES, POISONINGS AND TOXIC EFFECTS OF DRUGS",2,Moderate,Moderate,Medical,Medicaid,,,,,Y,8323.64,2645.86
New York City,Manhattan,7002001,001438,Bellevue Hospital Center,70 or Older,100,M,Black/African American,Unknown,2,Emergency,Home or Self Care,2022,INJ023,"Toxic effects, initial encounter",ADM007,INTRAVENOUS INDUCTION OF LABOR,816,TOXIC EFFECTS OF NON-MEDICINAL SUBSTANCES,21,"INJURIES, POISONINGS AND TOXIC EFFECTS OF DRUGS",1,Minor,Minor,Medical,Medicare,,,,,Y,20541.74,11813.23
New York City,Manhattan,7002001,001438,Bellevue Hospital Center,30 to 49,142,M,Other Race,Unknown,18,Urgent,Home or Self Care,2022,INJ022,"Poisoning by drugs, initial encounter",IMG001,CARDIAC AND CORONARY FLUOROSCOPY,816,TOXIC EFFECTS OF NON-MEDICINAL SUBSTANCES,21,"INJURIES, POISONINGS AND TOXIC EFFECTS OF DRUGS",2,Moderate,Moderate,Medical,Medicaid,,,,,N,129580.72,74519.80
New York City,Manhattan,7002001,001438,Bellevue Hospital Center,50 to 69,100,M,Black/African American,Unknown,3,Emergency,Inpatient Rehabilitation Facility,2022,INJ022,"Poisoning by drugs, initial encounter",MAM008,CARDIAC MONITORING,816,TOXIC EFFECTS OF NON-MEDICINAL SUBSTANCES,21,"INJURIES, POISONINGS AND TOXIC EFFECTS OF DRUGS",2,Moderate,Major,Medical,Medicare,Medicaid,,,,Y,26427.09,15197.80
Hudson Valley,Dutchess,1302001,000181,Vassar Brothers Medical Center,70 or Older,125,F,White,Not Span/Hispanic,6,Emergency,Home w/ Home Health Services,2022,INJ022,"Poisoning by drugs, initial encounter",,,816,TOXIC EFFECTS OF NON-MEDICINAL SUBSTANCES,21,"INJURIES, POISONINGS AND TOXIC EFFECTS OF DRUGS",4,Extreme,Extreme,Medical,Medicare,Blue Cross/Blue Shield,,,,Y,41131.09,18624.27
Hudson Valley,Dutchess,1302001,000181,Vassar Brothers Medical Center,30 to 49,OOS,F,White,Not Span/Hispanic,3,Urgent,Left Against Medical Advice,2022,INJ022,"Poisoning by drugs, initial encounter",ESA003,MECHANICAL VENTILATION,816,TOXIC EFFECTS OF NON-MEDICINAL SUBSTANCES,21,"INJURIES, POISONINGS AND TOXIC EFFECTS OF DRUGS",4,Extreme,Extreme,Medical,Self-Pay,,,,,N,35711.99,13408.23
New York City,Manhattan,7002054,001464,New York-Presbyterian Hospital - Columbia Presbyterian Center,50 to 69,112,M,Black/African American,Not Span/Hispanic,2,Emergency,Home or Self Care,2022,INJ022,"Poisoning by drugs, initial encounter",ADM016,ADMINISTRATION OF ANTI-INFLAMMATORY AGENTS,816,TOXIC EFFECTS OF NON-MEDICINAL SUBSTANCES,21,"INJURIES, POISONINGS AND TOXIC EFFECTS OF DRUGS",2,Moderate,Minor,Medical,Medicaid,,,,,Y,30752.53,6791.99
New York City,Manhattan,7002054,001464,New York-Presbyterian Hospital - Columbia Presbyterian Center,50 to 69,105,M,Black/African American,Not Span/Hispanic,1,Emergency,Home or Self Care,2022,INJ023,"Toxic effects, initial encounter",,,816,TOXIC EFFECTS OF NON-MEDICINAL SUBSTANCES,21,"INJURIES, POISONINGS AND TOXIC EFFECTS OF DRUGS",2,Moderate,Moderate,Medical,Medicare,Medicaid,,,,Y,24117.09,5732.40
New York City,Manhattan,7002054,001464,New York-Presbyterian Hospital - Columbia Presbyterian Center,50 to 69,100,F,Other Race,Unknown,5,Elective,Home or Self Care,2022,INJ023,"Toxic effects, initial encounter",,,816,TOXIC EFFECTS OF NON-MEDICINAL SUBSTANCES,21,"INJURIES, POISONINGS AND TOXIC EFFECTS OF DRUGS",3,Major,Moderate,Medical,Private Health Insurance,,,,,N,72601.56,15622.22