Hospital Service Area,Hospital County,Operating Certificate Number,Permanent Facility Id,Facility Name,Age Group,Zip Code - 3 digits,Gender,Race,Ethnicity,Length of Stay,Type of Admission,Patient Disposition,Discharge Year,CCS Diagnosis Code,CCS Diagnosis Description,CCS Procedure Code,CCS Procedure Description,APR DRG Code,APR DRG Description,APR MDC Code,APR MDC Description,APR Severity of Illness Code,APR Severity of Illness Description,APR Risk of Mortality,APR Medical Surgical Description,Payment Typology 1,Payment Typology 2,Payment Typology 3,Birth Weight,Abortion Edit Indicator,Emergency Department Indicator,Total Charges,Total Costs
New York City,Manhattan,7002054,001464,New York-Presbyterian Hospital - Columbia Presbyterian Center,30 to 49,104,M,Black/African American,Not Span/Hispanic,2,Emergency,Psychiatric Hospital or Unit of Hosp,2022,MBD012,Suicidal ideation/attempt/intentional self-harm,,,817,INTENTIONAL SELF-HARM AND ATTEMPTED SUICIDE,21,"INJURIES, POISONINGS AND TOXIC EFFECTS OF DRUGS",2,Moderate,Minor,Medical,Medicare,Medicaid,,,,Y,34961.26,8415.48
New York City,Manhattan,7002054,001464,New York-Presbyterian Hospital - Columbia Presbyterian Center,18 to 29,100,F,White,Not Span/Hispanic,3,Emergency,Home or Self Care,2022,MBD012,Suicidal ideation/attempt/intentional self-harm,,,817,INTENTIONAL SELF-HARM AND ATTEMPTED SUICIDE,21,"INJURIES, POISONINGS AND TOXIC EFFECTS OF DRUGS",2,Moderate,Minor,Medical,Medicaid,,,,,Y,34231.06,8337.04
New York City,Manhattan,7002001,001438,Bellevue Hospital Center,50 to 69,112,M,Other Race,Spanish/Hispanic,11,Emergency,Psychiatric Hospital or Unit of Hosp,2022,MBD012,Suicidal ideation/attempt/intentional self-harm,CAR024,VENOUS AND ARTERIAL CATHETER PLACEMENT,817,INTENTIONAL SELF-HARM AND ATTEMPTED SUICIDE,21,"INJURIES, POISONINGS AND TOXIC EFFECTS OF DRUGS",3,Major,Major,Medical,Medicare,Medicaid,,,,Y,79805.89,45895.09
New York City,Manhattan,7002054,001464,New York-Presbyterian Hospital - Columbia Presbyterian Center,0 to 17,105,F,White,Not Span/Hispanic,3,Emergency,Psychiatric Hospital or Unit of Hosp,2022,MBD012,Suicidal ideation/attempt/intentional self-harm,ADM021,"ADMINISTRATION OF THERAPEUTIC SUBSTANCES, NEC",817,INTENTIONAL SELF-HARM AND ATTEMPTED SUICIDE,21,"INJURIES, POISONINGS AND TOXIC EFFECTS OF DRUGS",2,Moderate,Minor,Medical,Private Health Insurance,,,,,Y,51160.41,15018.67
New York City,Manhattan,7002054,001464,New York-Presbyterian Hospital - Columbia Presbyterian Center,30 to 49,103,F,White,Not Span/Hispanic,13,Emergency,Home or Self Care,2022,MBD012,Suicidal ideation/attempt/intentional self-harm,,,817,INTENTIONAL SELF-HARM AND ATTEMPTED SUICIDE,21,"INJURIES, POISONINGS AND TOXIC EFFECTS OF DRUGS",2,Moderate,Minor,Medical,Medicare,Medicaid,Medicaid,,,Y,105718.13,26940.81
New York City,Manhattan,7002054,001464,New York-Presbyterian Hospital - Columbia Presbyterian Center,18 to 29,100,M,Other Race,Spanish/Hispanic,1,Emergency,Home or Self Care,2022,MBD012,Suicidal ideation/attempt/intentional self-harm,,,817,INTENTIONAL SELF-HARM AND ATTEMPTED SUICIDE,21,"INJURIES, POISONINGS AND TOXIC EFFECTS OF DRUGS",1,Minor,Minor,Medical,Medicaid,,,,,Y,13992.25,3343.95
New York City,Manhattan,7002053,001463,NYU Langone Hospitals,18 to 29,100,F,Other Race,Not Span/Hispanic,2,Emergency,Psychiatric Hospital or Unit of Hosp,2022,MBD012,Suicidal ideation/attempt/intentional self-harm,,,817,INTENTIONAL SELF-HARM AND ATTEMPTED SUICIDE,21,"INJURIES, POISONINGS AND TOXIC EFFECTS OF DRUGS",3,Major,Major,Medical,Private Health Insurance,,,,,Y,38777.59,13985.98
New York City,Manhattan,7002001,001438,Bellevue Hospital Center,0 to 17,100,F,Other Race,Unknown,4,Emergency,Psychiatric Hospital or Unit of Hosp,2022,MBD012,Suicidal ideation/attempt/intentional self-harm,SUD001,SUBSTANCE USE DETOXIFICATION,817,INTENTIONAL SELF-HARM AND ATTEMPTED SUICIDE,21,"INJURIES, POISONINGS AND TOXIC EFFECTS OF DRUGS",2,Moderate,Minor,Medical,Private Health Insurance,,,,,Y,32979.52,18965.99
New York City,Manhattan,7002001,001438,Bellevue Hospital Center,0 to 17,112,F,White,Unknown,2,Urgent,Psychiatric Hospital or Unit of Hosp,2022,MBD012,Suicidal ideation/attempt/intentional self-harm,ADM021,"ADMINISTRATION OF THERAPEUTIC SUBSTANCES, NEC",817,INTENTIONAL SELF-HARM AND ATTEMPTED SUICIDE,21,"INJURIES, POISONINGS AND TOXIC EFFECTS OF DRUGS",1,Minor,Minor,Medical,Medicaid,,,,,N,15312.58,8806.02
Finger Lakes,Monroe,2701005,000413,Strong Memorial Hospital,0 to 17,145,F,White,Not Span/Hispanic,2,Emergency,Psychiatric Hospital or Unit of Hosp,2022,MBD012,Suicidal ideation/attempt/intentional self-harm,,,817,INTENTIONAL SELF-HARM AND ATTEMPTED SUICIDE,21,"INJURIES, POISONINGS AND TOXIC EFFECTS OF DRUGS",2,Moderate,Moderate,Medical,Blue Cross/Blue Shield,,,,,Y,8060.02,3401.64
Finger Lakes,Monroe,2701005,000413,Strong Memorial Hospital,0 to 17,144,F,Other Race,Not Span/Hispanic,1,Emergency,Psychiatric Hospital or Unit of Hosp,2022,MBD012,Suicidal ideation/attempt/intentional self-harm,,,817,INTENTIONAL SELF-HARM AND ATTEMPTED SUICIDE,21,"INJURIES, POISONINGS AND TOXIC EFFECTS OF DRUGS",2,Moderate,Minor,Medical,Medicaid,,,,,Y,5392.13,2008.90
Finger Lakes,Monroe,2701005,000413,Strong Memorial Hospital,0 to 17,146,F,White,Not Span/Hispanic,1,Emergency,Psychiatric Hospital or Unit of Hosp,2022,MBD012,Suicidal ideation/attempt/intentional self-harm,,,817,INTENTIONAL SELF-HARM AND ATTEMPTED SUICIDE,21,"INJURIES, POISONINGS AND TOXIC EFFECTS OF DRUGS",1,Minor,Minor,Medical,Private Health Insurance,,,,,Y,4376.30,1804.13
Finger Lakes,Monroe,2701005,000413,Strong Memorial Hospital,0 to 17,144,M,White,Not Span/Hispanic,1,Emergency,Psychiatric Hospital or Unit of Hosp,2022,MBD012,Suicidal ideation/attempt/intentional self-harm,,,817,INTENTIONAL SELF-HARM AND ATTEMPTED SUICIDE,21,"INJURIES, POISONINGS AND TOXIC EFFECTS OF DRUGS",3,Major,Minor,Medical,Blue Cross/Blue Shield,,,,,Y,7736.98,2482.39
Finger Lakes,Monroe,2701005,000413,Strong Memorial Hospital,18 to 29,146,M,White,Not Span/Hispanic,3,Emergency,Home or Self Care,2022,MBD012,Suicidal ideation/attempt/intentional self-harm,SKB006,SKIN LACERATION REPAIR (EXCLUDING PERINEUM),817,INTENTIONAL SELF-HARM AND ATTEMPTED SUICIDE,21,"INJURIES, POISONINGS AND TOXIC EFFECTS OF DRUGS",1,Minor,Minor,Medical,Blue Cross/Blue Shield,,,,,Y,11638.61,4764.23
Finger Lakes,Monroe,2701005,000413,Strong Memorial Hospital,30 to 49,144,M,White,Not Span/Hispanic,7,Emergency,Home w/ Home Health Services,2022,MBD012,Suicidal ideation/attempt/intentional self-harm,CAR024,VENOUS AND ARTERIAL CATHETER PLACEMENT,817,INTENTIONAL SELF-HARM AND ATTEMPTED SUICIDE,21,"INJURIES, POISONINGS AND TOXIC EFFECTS OF DRUGS",4,Extreme,Extreme,Medical,Medicare,Medicaid,,,,Y,74285.79,28901.77
Finger Lakes,Monroe,2701005,000413,Strong Memorial Hospital,50 to 69,145,M,White,Not Span/Hispanic,2,Emergency,Home or Self Care,2022,MBD012,Suicidal ideation/attempt/intentional self-harm,,,817,INTENTIONAL SELF-HARM AND ATTEMPTED SUICIDE,21,"INJURIES, POISONINGS AND TOXIC EFFECTS OF DRUGS",3,Major,Major,Medical,Medicaid,,,,,Y,8136.28,3447.27
Finger Lakes,Monroe,2701005,000413,Strong Memorial Hospital,30 to 49,144,M,White,Unknown,7,Emergency,Home or Self Care,2022,MBD012,Suicidal ideation/attempt/intentional self-harm,,,817,INTENTIONAL SELF-HARM AND ATTEMPTED SUICIDE,21,"INJURIES, POISONINGS AND TOXIC EFFECTS OF DRUGS",2,Moderate,Minor,Medical,Blue Cross/Blue Shield,,,,,Y,18002.23,9398.75
Finger Lakes,Monroe,2701005,000413,Strong Memorial Hospital,0 to 17,146,F,White,Not Span/Hispanic,2,Emergency,Psychiatric Hospital or Unit of Hosp,2022,MBD012,Suicidal ideation/attempt/intentional self-harm,,,817,INTENTIONAL SELF-HARM AND ATTEMPTED SUICIDE,21,"INJURIES, POISONINGS AND TOXIC EFFECTS OF DRUGS",3,Major,Moderate,Medical,Blue Cross/Blue Shield,Medicaid,,,,Y,12217.36,5298.57
Finger Lakes,Monroe,2701005,000413,Strong Memorial Hospital,0 to 17,148,M,White,Not Span/Hispanic,2,Emergency,Inpatient Rehabilitation Facility,2022,MBD012,Suicidal ideation/attempt/intentional self-harm,,,817,INTENTIONAL SELF-HARM AND ATTEMPTED SUICIDE,21,"INJURIES, POISONINGS AND TOXIC EFFECTS OF DRUGS",2,Moderate,Minor,Medical,Private Health Insurance,,,,,Y,6997.50,3169.17
Finger Lakes,Monroe,2701005,000413,Strong Memorial Hospital,30 to 49,144,M,White,Not Span/Hispanic,1,Emergency,Left Against Medical Advice,2022,MBD012,Suicidal ideation/attempt/intentional self-harm,,,817,INTENTIONAL SELF-HARM AND ATTEMPTED SUICIDE,21,"INJURIES, POISONINGS AND TOXIC EFFECTS OF DRUGS",3,Major,Moderate,Medical,Medicare,,,,,Y,7054.90,2321.04
Finger Lakes,Monroe,2701005,000413,Strong Memorial Hospital,0 to 17,146,F,Other Race,Spanish/Hispanic,1,Emergency,Psychiatric Hospital or Unit of Hosp,2022,MBD012,Suicidal ideation/attempt/intentional self-harm,,,817,INTENTIONAL SELF-HARM AND ATTEMPTED SUICIDE,21,"INJURIES, POISONINGS AND TOXIC EFFECTS OF DRUGS",2,Moderate,Moderate,Medical,Medicaid,,,,,Y,6019.75,2197.06
Finger Lakes,Monroe,2701005,000413,Strong Memorial Hospital,0 to 17,144,F,White,Unknown,3,Emergency,Inpatient Rehabilitation Facility,2022,MBD012,Suicidal ideation/attempt/intentional self-harm,,,817,INTENTIONAL SELF-HARM AND ATTEMPTED SUICIDE,21,"INJURIES, POISONINGS AND TOXIC EFFECTS OF DRUGS",2,Moderate,Minor,Medical,Medicaid,,,,,Y,8533.61,4265.54
Finger Lakes,Monroe,2701005,000413,Strong Memorial Hospital,0 to 17,148,F,Other Race,Not Span/Hispanic,2,Emergency,Psychiatric Hospital or Unit of Hosp,2022,MBD012,Suicidal ideation/attempt/intentional self-harm,,,817,INTENTIONAL SELF-HARM AND ATTEMPTED SUICIDE,21,"INJURIES, POISONINGS AND TOXIC EFFECTS OF DRUGS",1,Minor,Minor,Medical,Blue Cross/Blue Shield,,,,,Y,6460.80,3039.93
Finger Lakes,Monroe,2701005,000413,Strong Memorial Hospital,0 to 17,144,F,Other Race,Spanish/Hispanic,7,Emergency,Inpatient Rehabilitation Facility,2022,MBD012,Suicidal ideation/attempt/intentional self-harm,ESA001,HEMODIALYSIS,817,INTENTIONAL SELF-HARM AND ATTEMPTED SUICIDE,21,"INJURIES, POISONINGS AND TOXIC EFFECTS OF DRUGS",3,Major,Major,Medical,Medicaid,,,,,Y,55587.42,20987.96
Finger Lakes,Monroe,2701005,000413,Strong Memorial Hospital,0 to 17,144,M,White,Not Span/Hispanic,3,Emergency,Home or Self Care,2022,MBD012,Suicidal ideation/attempt/intentional self-harm,,,817,INTENTIONAL SELF-HARM AND ATTEMPTED SUICIDE,21,"INJURIES, POISONINGS AND TOXIC EFFECTS OF DRUGS",2,Moderate,Minor,Medical,Medicaid,,,,,Y,9272.89,4346.99
Finger Lakes,Monroe,2701005,000413,Strong Memorial Hospital,30 to 49,146,M,White,Not Span/Hispanic,1,Emergency,Home or Self Care,2022,MBD012,Suicidal ideation/attempt/intentional self-harm,,,817,INTENTIONAL SELF-HARM AND ATTEMPTED SUICIDE,21,"INJURIES, POISONINGS AND TOXIC EFFECTS OF DRUGS",1,Minor,Moderate,Medical,Self-Pay,,,,,Y,5965.11,2106.48
Finger Lakes,Monroe,2701005,000413,Strong Memorial Hospital,50 to 69,146,M,White,Not Span/Hispanic,1,Emergency,Psychiatric Hospital or Unit of Hosp,2022,MBD012,Suicidal ideation/attempt/intentional self-harm,,,817,INTENTIONAL SELF-HARM AND ATTEMPTED SUICIDE,21,"INJURIES, POISONINGS AND TOXIC EFFECTS OF DRUGS",3,Major,Moderate,Medical,Blue Cross/Blue Shield,,,,,Y,13256.62,3811.74
Finger Lakes,Monroe,2701005,000413,Strong Memorial Hospital,0 to 17,146,F,White,Not Span/Hispanic,1,Emergency,Home or Self Care,2022,MBD012,Suicidal ideation/attempt/intentional self-harm,,,817,INTENTIONAL SELF-HARM AND ATTEMPTED SUICIDE,21,"INJURIES, POISONINGS AND TOXIC EFFECTS OF DRUGS",2,Moderate,Minor,Medical,Federal/State/Local/VA,Medicaid,,,,Y,5364.44,2003.51
Finger Lakes,Monroe,2701005,000413,Strong Memorial Hospital,18 to 29,145,F,White,Not Span/Hispanic,2,Emergency,Home or Self Care,2022,MBD012,Suicidal ideation/attempt/intentional self-harm,,,817,INTENTIONAL SELF-HARM AND ATTEMPTED SUICIDE,21,"INJURIES, POISONINGS AND TOXIC EFFECTS OF DRUGS",3,Major,Major,Medical,Medicaid,,,,,Y,9597.35,3543.12
Finger Lakes,Monroe,2701005,000413,Strong Memorial Hospital,30 to 49,144,F,White,Not Span/Hispanic,10,Emergency,Home or Self Care,2022,MBD012,Suicidal ideation/attempt/intentional self-harm,,,817,INTENTIONAL SELF-HARM AND ATTEMPTED SUICIDE,21,"INJURIES, POISONINGS AND TOXIC EFFECTS OF DRUGS",3,Major,Extreme,Medical,Medicaid,,,,,Y,27795.48,13738.96
Finger Lakes,Monroe,2701005,000413,Strong Memorial Hospital,30 to 49,144,F,White,Not Span/Hispanic,3,Emergency,Home or Self Care,2022,MBD012,Suicidal ideation/attempt/intentional self-harm,,,817,INTENTIONAL SELF-HARM AND ATTEMPTED SUICIDE,21,"INJURIES, POISONINGS AND TOXIC EFFECTS OF DRUGS",2,Moderate,Moderate,Medical,Blue Cross/Blue Shield,,,,,Y,10472.52,4550.19
New York City,Manhattan,7002001,001438,Bellevue Hospital Center,18 to 29,OOS,F,Black/African American,Unknown,3,Emergency,Psychiatric Hospital or Unit of Hosp,2022,MBD012,Suicidal ideation/attempt/intentional self-harm,MAM007,ELECTROCARDIOGRAM (ECG),817,INTENTIONAL SELF-HARM AND ATTEMPTED SUICIDE,21,"INJURIES, POISONINGS AND TOXIC EFFECTS OF DRUGS",2,Moderate,Minor,Medical,Medicaid,,,,,Y,25377.32,14594.09
New York City,Manhattan,7002054,001464,New York-Presbyterian Hospital - Columbia Presbyterian Center,30 to 49,100,F,Other Race,Spanish/Hispanic,10,Emergency,Psychiatric Hospital or Unit of Hosp,2022,MBD012,Suicidal ideation/attempt/intentional self-harm,,,817,INTENTIONAL SELF-HARM AND ATTEMPTED SUICIDE,21,"INJURIES, POISONINGS AND TOXIC EFFECTS OF DRUGS",3,Major,Moderate,Medical,Medicaid,,,,,Y,152578.52,32682.47
New York City,Manhattan,7002054,001464,New York-Presbyterian Hospital - Columbia Presbyterian Center,18 to 29,113,F,Black/African American,Not Span/Hispanic,13,Emergency,Home or Self Care,2022,MBD012,Suicidal ideation/attempt/intentional self-harm,MHT003,ELECTROCONVULSIVE THERAPY,817,INTENTIONAL SELF-HARM AND ATTEMPTED SUICIDE,21,"INJURIES, POISONINGS AND TOXIC EFFECTS OF DRUGS",3,Major,Moderate,Medical,Medicaid,,,,,Y,120534.87,32642.77
New York City,Manhattan,7002053,001463,NYU Langone Hospitals,18 to 29,104,M,Other Race,Spanish/Hispanic,9,Emergency,Home or Self Care,2022,MBD012,Suicidal ideation/attempt/intentional self-harm,RES007,AIRWAY INTUBATION,817,INTENTIONAL SELF-HARM AND ATTEMPTED SUICIDE,21,"INJURIES, POISONINGS AND TOXIC EFFECTS OF DRUGS",3,Major,Major,Medical,Medicaid,,,,,Y,159626.91,49104.97
New York City,Manhattan,7002001,001438,Bellevue Hospital Center,30 to 49,104,F,Other Race,Unknown,7,Emergency,Psychiatric Hospital or Unit of Hosp,2022,MBD012,Suicidal ideation/attempt/intentional self-harm,ADM021,"ADMINISTRATION OF THERAPEUTIC SUBSTANCES, NEC",817,INTENTIONAL SELF-HARM AND ATTEMPTED SUICIDE,21,"INJURIES, POISONINGS AND TOXIC EFFECTS OF DRUGS",3,Major,Major,Medical,Medicare,Medicaid,,,,Y,57862.33,33275.70
Finger Lakes,Monroe,2701005,000413,Strong Memorial Hospital,0 to 17,146,F,Black/African American,Not Span/Hispanic,1,Emergency,Home or Self Care,2022,MBD012,Suicidal ideation/attempt/intentional self-harm,,,817,INTENTIONAL SELF-HARM AND ATTEMPTED SUICIDE,21,"INJURIES, POISONINGS AND TOXIC EFFECTS OF DRUGS",2,Moderate,Minor,Medical,Medicaid,,,,,Y,5781.00,2141.19
Finger Lakes,Monroe,2701005,000413,Strong Memorial Hospital,50 to 69,144,F,White,Not Span/Hispanic,9,Emergency,Inpatient Rehabilitation Facility,2022,MBD012,Suicidal ideation/attempt/intentional self-harm,RES007,AIRWAY INTUBATION,817,INTENTIONAL SELF-HARM AND ATTEMPTED SUICIDE,21,"INJURIES, POISONINGS AND TOXIC EFFECTS OF DRUGS",4,Extreme,Extreme,Medical,Private Health Insurance,,,,,Y,68713.01,25411.96
Finger Lakes,Monroe,2701005,000413,Strong Memorial Hospital,0 to 17,144,F,White,Not Span/Hispanic,1,Emergency,Inpatient Rehabilitation Facility,2022,MBD012,Suicidal ideation/attempt/intentional self-harm,,,817,INTENTIONAL SELF-HARM AND ATTEMPTED SUICIDE,21,"INJURIES, POISONINGS AND TOXIC EFFECTS OF DRUGS",1,Minor,Minor,Medical,Blue Cross/Blue Shield,,,,,Y,6447.09,2524.66
Finger Lakes,Monroe,2701005,000413,Strong Memorial Hospital,18 to 29,149,F,White,Not Span/Hispanic,10,Urgent,Home or Self Care,2022,MBD012,Suicidal ideation/attempt/intentional self-harm,,,817,INTENTIONAL SELF-HARM AND ATTEMPTED SUICIDE,21,"INJURIES, POISONINGS AND TOXIC EFFECTS OF DRUGS",2,Moderate,Minor,Medical,Medicaid,,,,,N,44340.58,20945.30
Finger Lakes,Monroe,2701005,000413,Strong Memorial Hospital,30 to 49,146,F,Black/African American,Not Span/Hispanic,2,Emergency,Home or Self Care,2022,MBD012,Suicidal ideation/attempt/intentional self-harm,GIS027,"UPPER GI THERAPEUTIC PROCEDURES, NEC (ENDOSCOPIC)",817,INTENTIONAL SELF-HARM AND ATTEMPTED SUICIDE,21,"INJURIES, POISONINGS AND TOXIC EFFECTS OF DRUGS",2,Moderate,Minor,Medical,Medicare,Medicaid,,,,Y,23465.70,9851.33
Finger Lakes,Monroe,2701005,000413,Strong Memorial Hospital,50 to 69,144,M,White,Not Span/Hispanic,5,Emergency,Home or Self Care,2022,MBD012,Suicidal ideation/attempt/intentional self-harm,,,817,INTENTIONAL SELF-HARM AND ATTEMPTED SUICIDE,21,"INJURIES, POISONINGS AND TOXIC EFFECTS OF DRUGS",1,Minor,Moderate,Medical,Medicaid,,,,,Y,15010.66,7010.92
Finger Lakes,Monroe,2701005,000413,Strong Memorial Hospital,18 to 29,145,M,White,Not Span/Hispanic,6,Emergency,Psychiatric Hospital or Unit of Hosp,2022,MBD012,Suicidal ideation/attempt/intentional self-harm,,,817,INTENTIONAL SELF-HARM AND ATTEMPTED SUICIDE,21,"INJURIES, POISONINGS AND TOXIC EFFECTS OF DRUGS",2,Moderate,Minor,Medical,Blue Cross/Blue Shield,,,,,Y,17031.80,8140.15
Finger Lakes,Monroe,2701005,000413,Strong Memorial Hospital,0 to 17,146,F,Black/African American,Not Span/Hispanic,1,Emergency,Home or Self Care,2022,MBD012,Suicidal ideation/attempt/intentional self-harm,,,817,INTENTIONAL SELF-HARM AND ATTEMPTED SUICIDE,21,"INJURIES, POISONINGS AND TOXIC EFFECTS OF DRUGS",1,Minor,Minor,Medical,Medicaid,,,,,Y,5467.85,2028.93
Finger Lakes,Monroe,2701005,000413,Strong Memorial Hospital,0 to 17,145,F,White,Not Span/Hispanic,1,Emergency,Home or Self Care,2022,MBD012,Suicidal ideation/attempt/intentional self-harm,,,817,INTENTIONAL SELF-HARM AND ATTEMPTED SUICIDE,21,"INJURIES, POISONINGS AND TOXIC EFFECTS OF DRUGS",1,Minor,Minor,Medical,Medicaid,,,,,Y,5316.13,1997.65
Finger Lakes,Monroe,2701005,000413,Strong Memorial Hospital,0 to 17,144,F,White,Not Span/Hispanic,1,Emergency,Psychiatric Hospital or Unit of Hosp,2022,MBD012,Suicidal ideation/attempt/intentional self-harm,,,817,INTENTIONAL SELF-HARM AND ATTEMPTED SUICIDE,21,"INJURIES, POISONINGS AND TOXIC EFFECTS OF DRUGS",1,Minor,Minor,Medical,Medicaid,,,,,Y,5304.27,2015.17
Finger Lakes,Monroe,2701005,000413,Strong Memorial Hospital,18 to 29,146,F,White,Not Span/Hispanic,4,Emergency,Psychiatric Hospital or Unit of Hosp,2022,MBD012,Suicidal ideation/attempt/intentional self-harm,,,817,INTENTIONAL SELF-HARM AND ATTEMPTED SUICIDE,21,"INJURIES, POISONINGS AND TOXIC EFFECTS OF DRUGS",2,Moderate,Minor,Medical,Blue Cross/Blue Shield,,,,,Y,10924.99,5493.80
Finger Lakes,Monroe,2701005,000413,Strong Memorial Hospital,30 to 49,145,M,White,Not Span/Hispanic,8,Emergency,Psychiatric Hospital or Unit of Hosp,2022,MBD012,Suicidal ideation/attempt/intentional self-harm,CAR024,VENOUS AND ARTERIAL CATHETER PLACEMENT,817,INTENTIONAL SELF-HARM AND ATTEMPTED SUICIDE,21,"INJURIES, POISONINGS AND TOXIC EFFECTS OF DRUGS",4,Extreme,Extreme,Medical,Blue Cross/Blue Shield,,,,,Y,73432.65,26736.19
Finger Lakes,Monroe,2701005,000413,Strong Memorial Hospital,30 to 49,146,M,White,Not Span/Hispanic,3,Emergency,Home or Self Care,2022,MBD012,Suicidal ideation/attempt/intentional self-harm,,,817,INTENTIONAL SELF-HARM AND ATTEMPTED SUICIDE,21,"INJURIES, POISONINGS AND TOXIC EFFECTS OF DRUGS",3,Major,Major,Medical,Medicaid,,,,,Y,10735.80,4584.11
Finger Lakes,Monroe,2701005,000413,Strong Memorial Hospital,0 to 17,145,F,White,Not Span/Hispanic,5,Emergency,Inpatient Rehabilitation Facility,2022,MBD012,Suicidal ideation/attempt/intentional self-harm,,,817,INTENTIONAL SELF-HARM AND ATTEMPTED SUICIDE,21,"INJURIES, POISONINGS AND TOXIC EFFECTS OF DRUGS",2,Moderate,Minor,Medical,Blue Cross/Blue Shield,,,,,Y,14764.58,7340.49
Finger Lakes,Monroe,2701005,000413,Strong Memorial Hospital,18 to 29,146,F,White,Not Span/Hispanic,4,Emergency,Psychiatric Hospital or Unit of Hosp,2022,MBD012,Suicidal ideation/attempt/intentional self-harm,,,817,INTENTIONAL SELF-HARM AND ATTEMPTED SUICIDE,21,"INJURIES, POISONINGS AND TOXIC EFFECTS OF DRUGS",2,Moderate,Moderate,Medical,Medicaid,,,,,Y,11986.68,5761.12
Finger Lakes,Monroe,2701005,000413,Strong Memorial Hospital,50 to 69,146,M,Black/African American,Not Span/Hispanic,3,Emergency,Home or Self Care,2022,MBD012,Suicidal ideation/attempt/intentional self-harm,ENT002,ENT DIAGNOSTIC ENDOSCOPY (EXCLUDING LARYNGOSCOPY),817,INTENTIONAL SELF-HARM AND ATTEMPTED SUICIDE,21,"INJURIES, POISONINGS AND TOXIC EFFECTS OF DRUGS",4,Extreme,Extreme,Medical,Medicare,Medicaid,,,,Y,41578.88,13826.77
Finger Lakes,Monroe,2701005,000413,Strong Memorial Hospital,0 to 17,146,M,Black/African American,Not Span/Hispanic,1,Emergency,Home or Self Care,2022,MBD012,Suicidal ideation/attempt/intentional self-harm,,,817,INTENTIONAL SELF-HARM AND ATTEMPTED SUICIDE,21,"INJURIES, POISONINGS AND TOXIC EFFECTS OF DRUGS",1,Minor,Minor,Medical,Medicaid,,,,,Y,6424.83,2211.38
Finger Lakes,Monroe,2701005,000413,Strong Memorial Hospital,18 to 29,146,F,Multi-racial,Not Span/Hispanic,7,Emergency,Psychiatric Hospital or Unit of Hosp,2022,MBD012,Suicidal ideation/attempt/intentional self-harm,,,817,INTENTIONAL SELF-HARM AND ATTEMPTED SUICIDE,21,"INJURIES, POISONINGS AND TOXIC EFFECTS OF DRUGS",3,Major,Moderate,Medical,Private Health Insurance,,,,,Y,39851.26,16249.93
Finger Lakes,Monroe,2701005,000413,Strong Memorial Hospital,18 to 29,146,F,Other Race,Spanish/Hispanic,5,Emergency,Psychiatric Hospital or Unit of Hosp,2022,MBD012,Suicidal ideation/attempt/intentional self-harm,,,817,INTENTIONAL SELF-HARM AND ATTEMPTED SUICIDE,21,"INJURIES, POISONINGS AND TOXIC EFFECTS OF DRUGS",3,Major,Major,Medical,Medicaid,,,,,Y,19512.42,9078.39
New York City,Manhattan,7002054,001464,New York-Presbyterian Hospital - Columbia Presbyterian Center,0 to 17,104,F,Multi-racial,Spanish/Hispanic,2,Emergency,Psychiatric Hospital or Unit of Hosp,2022,MBD012,Suicidal ideation/attempt/intentional self-harm,,,817,INTENTIONAL SELF-HARM AND ATTEMPTED SUICIDE,21,"INJURIES, POISONINGS AND TOXIC EFFECTS OF DRUGS",3,Major,Major,Medical,Private Health Insurance,,,,,Y,34192.16,7427.47
Finger Lakes,Monroe,2701005,000413,Strong Memorial Hospital,0 to 17,144,F,White,Not Span/Hispanic,1,Emergency,Psychiatric Hospital or Unit of Hosp,2022,MBD012,Suicidal ideation/attempt/intentional self-harm,,,817,INTENTIONAL SELF-HARM AND ATTEMPTED SUICIDE,21,"INJURIES, POISONINGS AND TOXIC EFFECTS OF DRUGS",1,Minor,Minor,Medical,Medicaid,,,,,Y,5495.18,2080.95
New York City,Manhattan,7002001,001438,Bellevue Hospital Center,18 to 29,104,F,White,Unknown,7,Emergency,Psychiatric Hospital or Unit of Hosp,2022,MBD012,Suicidal ideation/attempt/intentional self-harm,ADM021,"ADMINISTRATION OF THERAPEUTIC SUBSTANCES, NEC",817,INTENTIONAL SELF-HARM AND ATTEMPTED SUICIDE,21,"INJURIES, POISONINGS AND TOXIC EFFECTS OF DRUGS",2,Moderate,Minor,Medical,Private Health Insurance,,,,,Y,57460.97,33044.88
New York City,Manhattan,7002001,001438,Bellevue Hospital Center,30 to 49,100,M,Black/African American,Unknown,6,Emergency,Psychiatric Hospital or Unit of Hosp,2022,MBD012,Suicidal ideation/attempt/intentional self-harm,ADM021,"ADMINISTRATION OF THERAPEUTIC SUBSTANCES, NEC",817,INTENTIONAL SELF-HARM AND ATTEMPTED SUICIDE,21,"INJURIES, POISONINGS AND TOXIC EFFECTS OF DRUGS",2,Moderate,Moderate,Medical,Private Health Insurance,,,,,Y,45199.22,25993.35
New York City,Manhattan,7002001,001438,Bellevue Hospital Center,30 to 49,112,M,Black/African American,Unknown,4,Emergency,Psychiatric Hospital or Unit of Hosp,2022,MBD012,Suicidal ideation/attempt/intentional self-harm,ADM021,"ADMINISTRATION OF THERAPEUTIC SUBSTANCES, NEC",817,INTENTIONAL SELF-HARM AND ATTEMPTED SUICIDE,21,"INJURIES, POISONINGS AND TOXIC EFFECTS OF DRUGS",2,Moderate,Minor,Medical,Medicaid,,,,,Y,30792.93,17708.52