Hospital Service Area,Hospital County,Operating Certificate Number,Permanent Facility Id,Facility Name,Age Group,Zip Code - 3 digits,Gender,Race,Ethnicity,Length of Stay,Type of Admission,Patient Disposition,Discharge Year,CCS Diagnosis Code,CCS Diagnosis Description,CCS Procedure Code,CCS Procedure Description,APR DRG Code,APR DRG Description,APR MDC Code,APR MDC Description,APR Severity of Illness Code,APR Severity of Illness Description,APR Risk of Mortality,APR Medical Surgical Description,Payment Typology 1,Payment Typology 2,Payment Typology 3,Birth Weight,Abortion Edit Indicator,Emergency Department Indicator,Total Charges,Total Costs
New York City,Manhattan,7002054,001464,New York-Presbyterian Hospital - Columbia Presbyterian Center,50 to 69,120,M,White,Not Span/Hispanic,3,Elective,Home or Self Care,2022,NEO001,Head and neck cancers - eye,ADM012,CHEMOTHERAPY,082,EYE INFECTIONS AND OTHER EYE DISORDERS,02,DISEASES AND DISORDERS OF THE EYE,2,Moderate,Major,Medical,Medicare,Blue Cross/Blue Shield,,,,N,43102.45,8856.87
New York City,Manhattan,7002001,001438,Bellevue Hospital Center,50 to 69,112,M,Black/African American,Unknown,1,Emergency,Left Against Medical Advice,2022,INF010,Sexually transmitted infections (excluding HIV and hepatitis),CNS002,LUMBAR PUNCTURE,082,EYE INFECTIONS AND OTHER EYE DISORDERS,02,DISEASES AND DISORDERS OF THE EYE,1,Minor,Minor,Medical,Medicare,Medicaid,,,,Y,13710.33,7884.59
New York City,Manhattan,7002054,001464,New York-Presbyterian Hospital - Columbia Presbyterian Center,50 to 69,OOS,M,Other Race,Unknown,1,Elective,Home or Self Care,2022,NEO001,Head and neck cancers - eye,,,082,EYE INFECTIONS AND OTHER EYE DISORDERS,02,DISEASES AND DISORDERS OF THE EYE,2,Moderate,Major,Medical,Medicare,Blue Cross/Blue Shield,,,,N,13174.77,2682.09
New York City,Manhattan,7002054,001464,New York-Presbyterian Hospital - Columbia Presbyterian Center,50 to 69,104,F,Other Race,Spanish/Hispanic,3,Emergency,Home or Self Care,2022,EYE006,Neuro-ophthalmology,CNS002,LUMBAR PUNCTURE,082,EYE INFECTIONS AND OTHER EYE DISORDERS,02,DISEASES AND DISORDERS OF THE EYE,1,Minor,Minor,Medical,Private Health Insurance,,,,,Y,89870.46,16725.89
New York City,Manhattan,7002054,001464,New York-Presbyterian Hospital - Columbia Presbyterian Center,50 to 69,100,F,Black/African American,Not Span/Hispanic,4,Emergency,Home or Self Care,2022,EYE004,Uveitis and ocular inflammation,ADM021,"ADMINISTRATION OF THERAPEUTIC SUBSTANCES, NEC",082,EYE INFECTIONS AND OTHER EYE DISORDERS,02,DISEASES AND DISORDERS OF THE EYE,1,Minor,Minor,Medical,Medicaid,,,,,Y,56036.18,12491.76
New York City,Manhattan,7002053,001463,NYU Langone Hospitals,30 to 49,112,M,White,Not Span/Hispanic,4,Emergency,Home or Self Care,2022,EYE008,Oculofacial plastics and orbital conditions,,,082,EYE INFECTIONS AND OTHER EYE DISORDERS,02,DISEASES AND DISORDERS OF THE EYE,1,Minor,Minor,Medical,Medicaid,,,,,Y,73185.22,21160.83
Finger Lakes,Monroe,2701005,000413,Strong Memorial Hospital,50 to 69,146,M,White,Not Span/Hispanic,5,Emergency,Home or Self Care,2022,INJ017,"Superficial injury; contusion, initial encounter",,,082,EYE INFECTIONS AND OTHER EYE DISORDERS,02,DISEASES AND DISORDERS OF THE EYE,2,Moderate,Minor,Medical,Miscellaneous/Other,Private Health Insurance,,,,Y,24168.99,8990.06
New York City,Manhattan,7002053,001463,NYU Langone Hospitals,18 to 29,100,F,White,Not Span/Hispanic,3,Emergency,Home or Self Care,2022,EYE006,Neuro-ophthalmology,CNS002,LUMBAR PUNCTURE,082,EYE INFECTIONS AND OTHER EYE DISORDERS,02,DISEASES AND DISORDERS OF THE EYE,2,Moderate,Minor,Medical,Blue Cross/Blue Shield,,,,,Y,138513.88,21872.75
New York City,Manhattan,7002053,001463,NYU Langone Hospitals,50 to 69,112,F,White,Not Span/Hispanic,5,Emergency,Home or Self Care,2022,EYE006,Neuro-ophthalmology,CAR021,"ARTERY, VEIN, AND GREAT VESSEL PROCEDURES, NEC",082,EYE INFECTIONS AND OTHER EYE DISORDERS,02,DISEASES AND DISORDERS OF THE EYE,3,Major,Moderate,Medical,Medicare,Medicare,,,,Y,182132.48,49498.11
New York City,Manhattan,7002053,001463,NYU Langone Hospitals,50 to 69,100,M,Other Race,Not Span/Hispanic,2,Emergency,Home or Self Care,2022,INF010,Sexually transmitted infections (excluding HIV and hepatitis),CNS002,LUMBAR PUNCTURE,082,EYE INFECTIONS AND OTHER EYE DISORDERS,02,DISEASES AND DISORDERS OF THE EYE,3,Major,Moderate,Medical,Private Health Insurance,,,,,Y,60108.86,13524.58
New York City,Manhattan,7002001,001438,Bellevue Hospital Center,70 or Older,100,M,White,Unknown,3,Emergency,Home w/ Home Health Services,2022,INJ011,"Open wounds of head and neck, initial encounter",SKB006,SKIN LACERATION REPAIR (EXCLUDING PERINEUM),082,EYE INFECTIONS AND OTHER EYE DISORDERS,02,DISEASES AND DISORDERS OF THE EYE,2,Moderate,Major,Medical,Medicare,Medicaid,,,,Y,36073.64,20745.37
New York City,Manhattan,7002054,001464,New York-Presbyterian Hospital - Columbia Presbyterian Center,30 to 49,104,F,Other Race,Spanish/Hispanic,4,Emergency,Home or Self Care,2022,INF010,Sexually transmitted infections (excluding HIV and hepatitis),ADM017,ADMINISTRATION OF NUTRITIONAL AND ELECTROLYTIC SUBSTANCES,082,EYE INFECTIONS AND OTHER EYE DISORDERS,02,DISEASES AND DISORDERS OF THE EYE,1,Minor,Minor,Medical,Medicaid,,,,,Y,66912.16,14763.23
New York City,Manhattan,7002054,001464,New York-Presbyterian Hospital - Columbia Presbyterian Center,0 to 17,104,M,White,Spanish/Hispanic,5,Emergency,Home or Self Care,2022,EYE001,Cornea and external disease,MST003,"SUBCUTANEOUS TISSUE, FASCIA, AND MUSCLE BIOPSY",082,EYE INFECTIONS AND OTHER EYE DISORDERS,02,DISEASES AND DISORDERS OF THE EYE,1,Minor,Minor,Medical,Medicaid,,,,,Y,76942.12,22018.09
New York City,Manhattan,7002054,001464,New York-Presbyterian Hospital - Columbia Presbyterian Center,70 or Older,105,M,Black/African American,Not Span/Hispanic,3,Emergency,Home or Self Care,2022,EYE012,Other specified eye disorders,,,082,EYE INFECTIONS AND OTHER EYE DISORDERS,02,DISEASES AND DISORDERS OF THE EYE,1,Minor,Minor,Medical,Medicare,Private Health Insurance,,,,Y,37724.46,8435.69
New York City,Manhattan,7002054,001464,New York-Presbyterian Hospital - Columbia Presbyterian Center,0 to 17,,M,Other Race,Unknown,1,Emergency,Short-term Hospital,2022,EYE005,Retinal and vitreous conditions,ESA004,NON-INVASIVE VENTILATION,082,EYE INFECTIONS AND OTHER EYE DISORDERS,02,DISEASES AND DISORDERS OF THE EYE,2,Moderate,Minor,Medical,Private Health Insurance,,,00600,,N,31614.82,6613.45
New York City,Manhattan,7002053,001463,NYU Langone Hospitals,30 to 49,112,M,Other Race,Not Span/Hispanic,1,Emergency,Home or Self Care,2022,EYE006,Neuro-ophthalmology,CNS002,LUMBAR PUNCTURE,082,EYE INFECTIONS AND OTHER EYE DISORDERS,02,DISEASES AND DISORDERS OF THE EYE,2,Moderate,Moderate,Medical,Blue Cross/Blue Shield,,,,,Y,101083.94,17397.91
New York City,Manhattan,7002053,001463,NYU Langone Hospitals,30 to 49,112,F,Black/African American,Not Span/Hispanic,1,Emergency,Home or Self Care,2022,EYE006,Neuro-ophthalmology,CNS002,LUMBAR PUNCTURE,082,EYE INFECTIONS AND OTHER EYE DISORDERS,02,DISEASES AND DISORDERS OF THE EYE,3,Major,Moderate,Medical,Blue Cross/Blue Shield,,,,,Y,104354.50,18189.74
New York City,Manhattan,7002053,001463,NYU Langone Hospitals,18 to 29,112,F,White,Not Span/Hispanic,2,Emergency,Home or Self Care,2022,EYE006,Neuro-ophthalmology,CNS002,LUMBAR PUNCTURE,082,EYE INFECTIONS AND OTHER EYE DISORDERS,02,DISEASES AND DISORDERS OF THE EYE,1,Minor,Minor,Medical,Private Health Insurance,,,,,Y,89562.03,16689.45
New York City,Manhattan,7002053,001463,NYU Langone Hospitals,0 to 17,111,M,Other Race,Not Span/Hispanic,12,Emergency,Home or Self Care,2022,EYE006,Neuro-ophthalmology,CAR029,"CARDIOVASCULAR DEVICE PROCEDURES, NEC",082,EYE INFECTIONS AND OTHER EYE DISORDERS,02,DISEASES AND DISORDERS OF THE EYE,2,Moderate,Moderate,Medical,Medicaid,,,,,Y,711596.90,69388.35
New York City,Manhattan,7002053,001463,NYU Langone Hospitals,50 to 69,112,M,Black/African American,Not Span/Hispanic,6,Emergency,Psychiatric Hospital or Unit of Hosp,2022,EYE010,Blindness and vision defects,,,082,EYE INFECTIONS AND OTHER EYE DISORDERS,02,DISEASES AND DISORDERS OF THE EYE,2,Moderate,Minor,Medical,Medicaid,,,,,N,77067.19,28141.93
Finger Lakes,Monroe,2701005,000413,Strong Memorial Hospital,0 to 17,144,F,White,Unknown,1,Emergency,Home or Self Care,2022,EYE010,Blindness and vision defects,,,082,EYE INFECTIONS AND OTHER EYE DISORDERS,02,DISEASES AND DISORDERS OF THE EYE,1,Minor,Minor,Medical,Medicaid,,,,,Y,10028.04,2950.31
Finger Lakes,Monroe,2701005,000413,Strong Memorial Hospital,18 to 29,145,M,White,Not Span/Hispanic,2,Emergency,Home or Self Care,2022,EYE006,Neuro-ophthalmology,,,082,EYE INFECTIONS AND OTHER EYE DISORDERS,02,DISEASES AND DISORDERS OF THE EYE,2,Moderate,Minor,Medical,Blue Cross/Blue Shield,,,,,Y,21403.85,6569.55
Finger Lakes,Monroe,2701005,000413,Strong Memorial Hospital,0 to 17,141,M,White,Not Span/Hispanic,1,Emergency,Home or Self Care,2022,PNL009,Perinatal infections,CNS002,LUMBAR PUNCTURE,082,EYE INFECTIONS AND OTHER EYE DISORDERS,02,DISEASES AND DISORDERS OF THE EYE,1,Minor,Minor,Medical,Medicaid,,,03200,,Y,6634.59,2404.84
Finger Lakes,Monroe,2701005,000413,Strong Memorial Hospital,50 to 69,146,F,Black/African American,Not Span/Hispanic,15,Emergency,Home or Self Care,2022,INF010,Sexually transmitted infections (excluding HIV and hepatitis),,,082,EYE INFECTIONS AND OTHER EYE DISORDERS,02,DISEASES AND DISORDERS OF THE EYE,1,Minor,Minor,Medical,Medicaid,,,,,Y,36544.52,20184.81
New York City,Manhattan,7002001,001438,Bellevue Hospital Center,70 or Older,100,M,Other Race,Spanish/Hispanic,24,Emergency,Home w/ Home Health Services,2022,END003,Diabetes mellitus with complication,ADM021,"ADMINISTRATION OF THERAPEUTIC SUBSTANCES, NEC",082,EYE INFECTIONS AND OTHER EYE DISORDERS,02,DISEASES AND DISORDERS OF THE EYE,3,Major,Major,Medical,Medicare,Medicaid,,,,Y,184003.73,105817.60
New York City,Manhattan,7002053,001463,NYU Langone Hospitals,0 to 17,100,F,Other Race,Unknown,1,Emergency,Cancer Center or Children's Hospital,2022,EYE005,Retinal and vitreous conditions,ESA004,NON-INVASIVE VENTILATION,082,EYE INFECTIONS AND OTHER EYE DISORDERS,02,DISEASES AND DISORDERS OF THE EYE,3,Major,Minor,Medical,Private Health Insurance,,,,,N,13167.77,4499.61
New York City,Manhattan,7002053,001463,NYU Langone Hospitals,70 or Older,112,F,White,Not Span/Hispanic,3,Emergency,Home or Self Care,2022,EYE010,Blindness and vision defects,,,082,EYE INFECTIONS AND OTHER EYE DISORDERS,02,DISEASES AND DISORDERS OF THE EYE,1,Minor,Minor,Medical,Medicare,Blue Cross/Blue Shield,,,,Y,82196.37,22417.83
New York City,Manhattan,7002053,001463,NYU Langone Hospitals,70 or Older,117,M,White,Not Span/Hispanic,4,Emergency,Home or Self Care,2022,EYE006,Neuro-ophthalmology,ADM016,ADMINISTRATION OF ANTI-INFLAMMATORY AGENTS,082,EYE INFECTIONS AND OTHER EYE DISORDERS,02,DISEASES AND DISORDERS OF THE EYE,2,Moderate,Moderate,Medical,Medicare,Medicare,,,,N,80446.19,21457.37
New York City,Manhattan,7002053,001463,NYU Langone Hospitals,30 to 49,114,F,Black/African American,Not Span/Hispanic,2,Emergency,Home or Self Care,2022,EYE006,Neuro-ophthalmology,CNS002,LUMBAR PUNCTURE,082,EYE INFECTIONS AND OTHER EYE DISORDERS,02,DISEASES AND DISORDERS OF THE EYE,2,Moderate,Minor,Medical,Private Health Insurance,,,,,Y,101877.89,15262.90
New York City,Manhattan,7002054,001464,New York-Presbyterian Hospital - Columbia Presbyterian Center,50 to 69,OOS,M,White,Not Span/Hispanic,3,Emergency,Home or Self Care,2022,EYE010,Blindness and vision defects,MAM011,ELECTROENCEPHALOGRAM (EEG),082,EYE INFECTIONS AND OTHER EYE DISORDERS,02,DISEASES AND DISORDERS OF THE EYE,2,Moderate,Moderate,Medical,Medicare,,,,,Y,55072.87,11192.99
New York City,Manhattan,7002054,001464,New York-Presbyterian Hospital - Columbia Presbyterian Center,0 to 17,112,M,Black/African American,Not Span/Hispanic,1,Emergency,Home or Self Care,2022,EYE006,Neuro-ophthalmology,MAM011,ELECTROENCEPHALOGRAM (EEG),082,EYE INFECTIONS AND OTHER EYE DISORDERS,02,DISEASES AND DISORDERS OF THE EYE,1,Minor,Minor,Medical,Medicaid,,,,,Y,21066.80,
Long Island,Nassau,2951001,000541,North Shore University Hospital,70 or Older,113,M,White,Not Span/Hispanic,2,Emergency,Home or Self Care,2022,EYE006,Neuro-ophthalmology,ADM022,COVID-19 VACCINATIONS,082,EYE INFECTIONS AND OTHER EYE DISORDERS,02,DISEASES AND DISORDERS OF THE EYE,1,Minor,Minor,Medical,Medicare,Medicare,,,,Y,47699.55,6327.52
Long Island,Nassau,2951001,000541,North Shore University Hospital,70 or Older,110,M,Other Race,Spanish/Hispanic,2,Emergency,Home or Self Care,2022,EYE010,Blindness and vision defects,IMG002,FLUOROSCOPIC ANGIOGRAPHY (EXCLUDING CORONARY),082,EYE INFECTIONS AND OTHER EYE DISORDERS,02,DISEASES AND DISORDERS OF THE EYE,2,Moderate,Minor,Medical,Medicare,Medicare,,,,Y,110947.99,17353.18
Long Island,Nassau,2951001,000541,North Shore University Hospital,30 to 49,115,F,Other Race,Spanish/Hispanic,2,Emergency,Home or Self Care,2022,EYE006,Neuro-ophthalmology,CNS002,LUMBAR PUNCTURE,082,EYE INFECTIONS AND OTHER EYE DISORDERS,02,DISEASES AND DISORDERS OF THE EYE,1,Minor,Minor,Medical,Blue Cross/Blue Shield,,,,,Y,85043.34,12877.83
Long Island,Nassau,2951001,000541,North Shore University Hospital,18 to 29,118,M,White,Not Span/Hispanic,2,Emergency,Home or Self Care,2022,EYE004,Uveitis and ocular inflammation,,,082,EYE INFECTIONS AND OTHER EYE DISORDERS,02,DISEASES AND DISORDERS OF THE EYE,2,Moderate,Minor,Medical,Private Health Insurance,,,,,Y,47056.27,6771.86
Long Island,Nassau,2951001,000541,North Shore University Hospital,70 or Older,117,M,White,Not Span/Hispanic,5,Emergency,Home or Self Care,2022,EYE006,Neuro-ophthalmology,CNS002,LUMBAR PUNCTURE,082,EYE INFECTIONS AND OTHER EYE DISORDERS,02,DISEASES AND DISORDERS OF THE EYE,2,Moderate,Minor,Medical,Medicare,Blue Cross/Blue Shield,,,,Y,89281.79,13192.46
Long Island,Nassau,2951001,000541,North Shore University Hospital,50 to 69,113,F,White,Not Span/Hispanic,6,Emergency,Home or Self Care,2022,EYE012,Other specified eye disorders,,,082,EYE INFECTIONS AND OTHER EYE DISORDERS,02,DISEASES AND DISORDERS OF THE EYE,2,Moderate,Moderate,Medical,Medicare,Private Health Insurance,,,,Y,129519.33,21163.58
Finger Lakes,Monroe,2701005,000413,Strong Memorial Hospital,0 to 17,145,F,Multi-racial,Unknown,1,Emergency,Home or Self Care,2022,INJ017,"Superficial injury; contusion, initial encounter",,,082,EYE INFECTIONS AND OTHER EYE DISORDERS,02,DISEASES AND DISORDERS OF THE EYE,1,Minor,Minor,Medical,Blue Cross/Blue Shield,,,,,Y,13156.15,4634.42
New York City,Manhattan,7002054,001464,New York-Presbyterian Hospital - Columbia Presbyterian Center,18 to 29,104,F,Other Race,Spanish/Hispanic,5,Emergency,Home or Self Care,2022,EYE005,Retinal and vitreous conditions,CNS002,LUMBAR PUNCTURE,082,EYE INFECTIONS AND OTHER EYE DISORDERS,02,DISEASES AND DISORDERS OF THE EYE,2,Moderate,Moderate,Medical,Medicaid,,,,,Y,88427.81,17685.00
New York City,Manhattan,7002053,001463,NYU Langone Hospitals,30 to 49,112,M,White,Not Span/Hispanic,13,Emergency,Psychiatric Hospital or Unit of Hosp,2022,INJ020,"Effect of foreign body entering opening, initial encounter",,,082,EYE INFECTIONS AND OTHER EYE DISORDERS,02,DISEASES AND DISORDERS OF THE EYE,3,Major,Moderate,Medical,Private Health Insurance,,,,,Y,189223.78,72076.47
New York City,Manhattan,7002053,001463,NYU Langone Hospitals,30 to 49,112,F,Black/African American,Not Span/Hispanic,6,Emergency,Home or Self Care,2022,EYE006,Neuro-ophthalmology,CAR024,VENOUS AND ARTERIAL CATHETER PLACEMENT,082,EYE INFECTIONS AND OTHER EYE DISORDERS,02,DISEASES AND DISORDERS OF THE EYE,1,Minor,Minor,Medical,Blue Cross/Blue Shield,Medicaid,,,,N,114442.64,32607.38
New York City,Manhattan,7002053,001463,NYU Langone Hospitals,30 to 49,112,F,Other Race,Not Span/Hispanic,3,Emergency,Home or Self Care,2022,EYE012,Other specified eye disorders,OTR004,ISOLATION PROCEDURES,082,EYE INFECTIONS AND OTHER EYE DISORDERS,02,DISEASES AND DISORDERS OF THE EYE,3,Major,Moderate,Medical,Blue Cross/Blue Shield,,,,,Y,35305.46,14948.59
New York City,Manhattan,7002001,001438,Bellevue Hospital Center,30 to 49,113,M,Black/African American,Not Span/Hispanic,1,Emergency,Home or Self Care,2022,INJ011,"Open wounds of head and neck, initial encounter",EYP002,EYELID PROCEDURES,082,EYE INFECTIONS AND OTHER EYE DISORDERS,02,DISEASES AND DISORDERS OF THE EYE,2,Moderate,Minor,Medical,Medicaid,,,,,Y,23717.11,13639.33
Hudson Valley,Dutchess,1302001,000181,Vassar Brothers Medical Center,70 or Older,125,F,White,Not Span/Hispanic,2,Emergency,Home or Self Care,2022,EYE010,Blindness and vision defects,,,082,EYE INFECTIONS AND OTHER EYE DISORDERS,02,DISEASES AND DISORDERS OF THE EYE,2,Moderate,Minor,Medical,Federal/State/Local/VA,,,,,Y,18887.05,3944.03
New York City,Manhattan,7002053,001463,NYU Langone Hospitals,0 to 17,115,M,Black/African American,Not Span/Hispanic,2,Emergency,Home or Self Care,2022,EYE008,Oculofacial plastics and orbital conditions,,,082,EYE INFECTIONS AND OTHER EYE DISORDERS,02,DISEASES AND DISORDERS OF THE EYE,1,Minor,Minor,Medical,Blue Cross/Blue Shield,,,,,Y,30845.12,7763.77
New York City,Manhattan,7002053,001463,NYU Langone Hospitals,70 or Older,113,F,Other Race,Not Span/Hispanic,1,Emergency,Home or Self Care,2022,EYE001,Cornea and external disease,,,082,EYE INFECTIONS AND OTHER EYE DISORDERS,02,DISEASES AND DISORDERS OF THE EYE,3,Major,Major,Medical,Medicare,Medicaid,,,,Y,53827.68,7934.84
New York City,Manhattan,7002054,001464,New York-Presbyterian Hospital - Columbia Presbyterian Center,30 to 49,100,F,White,Spanish/Hispanic,1,Emergency,Home or Self Care,2022,EYE003,Glaucoma,ADM021,"ADMINISTRATION OF THERAPEUTIC SUBSTANCES, NEC",082,EYE INFECTIONS AND OTHER EYE DISORDERS,02,DISEASES AND DISORDERS OF THE EYE,2,Moderate,Minor,Medical,Medicaid,,,,,Y,16185.03,3670.55
Finger Lakes,Monroe,2701005,000413,Strong Memorial Hospital,70 or Older,146,M,White,Not Span/Hispanic,2,Emergency,Home or Self Care,2022,EYE012,Other specified eye disorders,,,082,EYE INFECTIONS AND OTHER EYE DISORDERS,02,DISEASES AND DISORDERS OF THE EYE,2,Moderate,Minor,Medical,Blue Cross/Blue Shield,Medicare,,,,Y,11130.29,3907.13
Finger Lakes,Monroe,2701005,000413,Strong Memorial Hospital,50 to 69,145,M,White,Not Span/Hispanic,1,Emergency,Another Type Not Listed,2022,INJ017,"Superficial injury; contusion, initial encounter",ADM018,IRRIGATION (DIAGNOSTIC AND THERAPEUTIC),082,EYE INFECTIONS AND OTHER EYE DISORDERS,02,DISEASES AND DISORDERS OF THE EYE,2,Moderate,Moderate,Medical,Medicare,Medicaid,,,,Y,16633.99,7185.17
Finger Lakes,Monroe,2701005,000413,Strong Memorial Hospital,50 to 69,145,F,White,Not Span/Hispanic,4,Emergency,Home or Self Care,2022,EYE006,Neuro-ophthalmology,CAR021,"ARTERY, VEIN, AND GREAT VESSEL PROCEDURES, NEC",082,EYE INFECTIONS AND OTHER EYE DISORDERS,02,DISEASES AND DISORDERS OF THE EYE,1,Minor,Minor,Medical,Medicare,,,,,Y,25794.46,11284.56
Finger Lakes,Monroe,2701005,000413,Strong Memorial Hospital,70 or Older,144,M,White,Not Span/Hispanic,2,Emergency,Home or Self Care,2022,EYE006,Neuro-ophthalmology,,,082,EYE INFECTIONS AND OTHER EYE DISORDERS,02,DISEASES AND DISORDERS OF THE EYE,3,Major,Moderate,Medical,Medicare,Private Health Insurance,,,,Y,16809.95,5743.38
New York City,Manhattan,7002001,001438,Bellevue Hospital Center,70 or Older,100,M,Other Race,Spanish/Hispanic,5,Emergency,Home w/ Home Health Services,2022,EYE008,Oculofacial plastics and orbital conditions,ADM015,ADMINISTRATION OF ANTIBIOTICS,082,EYE INFECTIONS AND OTHER EYE DISORDERS,02,DISEASES AND DISORDERS OF THE EYE,3,Major,Major,Medical,Medicare,Medicaid,,,,Y,47483.73,27307.13
Long Island,Nassau,2951001,000541,North Shore University Hospital,50 to 69,114,F,Black/African American,Not Span/Hispanic,5,Emergency,Home w/ Home Health Services,2022,EYE010,Blindness and vision defects,,,082,EYE INFECTIONS AND OTHER EYE DISORDERS,02,DISEASES AND DISORDERS OF THE EYE,2,Moderate,Minor,Medical,Medicare,Private Health Insurance,,,,Y,91925.06,12971.72
Long Island,Nassau,2951001,000541,North Shore University Hospital,70 or Older,117,F,White,Not Span/Hispanic,2,Emergency,Home w/ Home Health Services,2022,INJ001,"Fracture of head and neck, initial encounter",,,082,EYE INFECTIONS AND OTHER EYE DISORDERS,02,DISEASES AND DISORDERS OF THE EYE,2,Moderate,Minor,Medical,Medicare,Private Health Insurance,,,,Y,29947.48,5363.86
Long Island,Nassau,2951001,000541,North Shore University Hospital,30 to 49,114,M,White,Spanish/Hispanic,1,Emergency,Left Against Medical Advice,2022,EYE010,Blindness and vision defects,,,082,EYE INFECTIONS AND OTHER EYE DISORDERS,02,DISEASES AND DISORDERS OF THE EYE,2,Moderate,Minor,Medical,Medicaid,Medicaid,,,,Y,25874.03,3220.47
Long Island,Nassau,2951001,000541,North Shore University Hospital,30 to 49,114,M,Other Race,Not Span/Hispanic,3,Emergency,Home or Self Care,2022,EYE010,Blindness and vision defects,,,082,EYE INFECTIONS AND OTHER EYE DISORDERS,02,DISEASES AND DISORDERS OF THE EYE,1,Minor,Minor,Medical,Private Health Insurance,,,,,Y,65208.30,9392.11
Long Island,Nassau,2951001,000541,North Shore University Hospital,50 to 69,114,F,Black/African American,Not Span/Hispanic,8,Emergency,Home w/ Home Health Services,2022,EYE001,Cornea and external disease,,,082,EYE INFECTIONS AND OTHER EYE DISORDERS,02,DISEASES AND DISORDERS OF THE EYE,3,Major,Moderate,Medical,Medicare,Medicare,,,,Y,132132.08,19356.75
Long Island,Nassau,2951001,000541,North Shore University Hospital,18 to 29,110,M,Black/African American,Not Span/Hispanic,5,Emergency,Home or Self Care,2022,EYE001,Cornea and external disease,,,082,EYE INFECTIONS AND OTHER EYE DISORDERS,02,DISEASES AND DISORDERS OF THE EYE,2,Moderate,Minor,Medical,Private Health Insurance,Medicaid,,,,Y,74140.98,11114.61
Finger Lakes,Monroe,2701005,000413,Strong Memorial Hospital,50 to 69,146,F,White,Not Span/Hispanic,1,Emergency,Home or Self Care,2022,EYE006,Neuro-ophthalmology,,,082,EYE INFECTIONS AND OTHER EYE DISORDERS,02,DISEASES AND DISORDERS OF THE EYE,2,Moderate,Minor,Medical,Blue Cross/Blue Shield,,,,,Y,21668.58,5539.28
Finger Lakes,Monroe,2701005,000413,Strong Memorial Hospital,30 to 49,146,M,White,Not Span/Hispanic,2,Emergency,Home or Self Care,2022,EYE006,Neuro-ophthalmology,CNS002,LUMBAR PUNCTURE,082,EYE INFECTIONS AND OTHER EYE DISORDERS,02,DISEASES AND DISORDERS OF THE EYE,1,Minor,Minor,Medical,Private Health Insurance,,,,,Y,15574.27,5289.56
Finger Lakes,Monroe,2701005,000413,Strong Memorial Hospital,50 to 69,144,M,White,Not Span/Hispanic,1,Emergency,Home or Self Care,2022,EYE006,Neuro-ophthalmology,IMG006,COMPUTERIZED TOMOGRAPHY (CT) WITH CONTRAST,082,EYE INFECTIONS AND OTHER EYE DISORDERS,02,DISEASES AND DISORDERS OF THE EYE,3,Major,Moderate,Medical,Blue Cross/Blue Shield,Medicare,,,,Y,13355.74,3432.79
Finger Lakes,Monroe,2701005,000413,Strong Memorial Hospital,30 to 49,145,F,Multi-racial,Not Span/Hispanic,1,Emergency,Home or Self Care,2022,EYE006,Neuro-ophthalmology,,,082,EYE INFECTIONS AND OTHER EYE DISORDERS,02,DISEASES AND DISORDERS OF THE EYE,2,Moderate,Minor,Medical,Blue Cross/Blue Shield,,,,,Y,11941.99,3462.94
New York City,Manhattan,7002001,001438,Bellevue Hospital Center,50 to 69,112,F,Other Race,Spanish/Hispanic,3,Emergency,Home or Self Care,2022,EYE005,Retinal and vitreous conditions,IMG005,MAGNETIC RESONANCE IMAGING (MRI),082,EYE INFECTIONS AND OTHER EYE DISORDERS,02,DISEASES AND DISORDERS OF THE EYE,2,Moderate,Minor,Medical,Medicare,,,,,Y,40243.12,23143.17
Hudson Valley,Dutchess,1302001,000181,Vassar Brothers Medical Center,30 to 49,124,M,White,Not Span/Hispanic,3,Emergency,Home or Self Care,2022,NVS012,Transient cerebral ischemia,,,082,EYE INFECTIONS AND OTHER EYE DISORDERS,02,DISEASES AND DISORDERS OF THE EYE,1,Minor,Minor,Medical,Medicaid,,,,,Y,23074.23,6216.65