Hospital Service Area,Hospital County,Operating Certificate Number,Permanent Facility Id,Facility Name,Age Group,Zip Code - 3 digits,Gender,Race,Ethnicity,Length of Stay,Type of Admission,Patient Disposition,Discharge Year,CCS Diagnosis Code,CCS Diagnosis Description,CCS Procedure Code,CCS Procedure Description,APR DRG Code,APR DRG Description,APR MDC Code,APR MDC Description,APR Severity of Illness Code,APR Severity of Illness Description,APR Risk of Mortality,APR Medical Surgical Description,Payment Typology 1,Payment Typology 2,Payment Typology 3,Birth Weight,Abortion Edit Indicator,Emergency Department Indicator,Total Charges,Total Costs
Finger Lakes,Monroe,2701005,000413,Strong Memorial Hospital,0 to 17,146,M,Other Race,Unknown,2,Emergency,Home w/ Home Health Services,2022,INJ019,"Burn and corrosion, initial encounter",SKB008,SKIN EXCISION AND DEBRIDEMENT,844,PARTIAL THICKNESS BURNS WITHOUT SKIN GRAFT,22,BURNS,1,Minor,Minor,Medical,Medicaid,,,,,Y,7204.74,3316.82
Finger Lakes,Monroe,2701005,000413,Strong Memorial Hospital,0 to 17,146,M,Black/African American,Not Span/Hispanic,1,Emergency,Home or Self Care,2022,INJ019,"Burn and corrosion, initial encounter",SKB008,SKIN EXCISION AND DEBRIDEMENT,844,PARTIAL THICKNESS BURNS WITHOUT SKIN GRAFT,22,BURNS,2,Moderate,Moderate,Medical,Medicaid,,,,,Y,4722.11,1921.26
Finger Lakes,Monroe,2701005,000413,Strong Memorial Hospital,50 to 69,141,M,White,Not Span/Hispanic,3,Emergency,Home or Self Care,2022,INJ019,"Burn and corrosion, initial encounter",SKB008,SKIN EXCISION AND DEBRIDEMENT,844,PARTIAL THICKNESS BURNS WITHOUT SKIN GRAFT,22,BURNS,2,Moderate,Moderate,Medical,Medicaid,,,,,Y,18564.99,10263.38
Finger Lakes,Monroe,2701005,000413,Strong Memorial Hospital,30 to 49,146,M,Other Race,Spanish/Hispanic,2,Emergency,Home or Self Care,2022,INJ019,"Burn and corrosion, initial encounter",,,844,PARTIAL THICKNESS BURNS WITHOUT SKIN GRAFT,22,BURNS,2,Moderate,Moderate,Medical,Miscellaneous/Other,,,,,Y,7199.87,3624.56
Finger Lakes,Monroe,2701005,000413,Strong Memorial Hospital,0 to 17,146,M,White,Not Span/Hispanic,2,Emergency,Home w/ Home Health Services,2022,INJ019,"Burn and corrosion, initial encounter",SKB008,SKIN EXCISION AND DEBRIDEMENT,844,PARTIAL THICKNESS BURNS WITHOUT SKIN GRAFT,22,BURNS,1,Minor,Minor,Medical,Blue Cross/Blue Shield,,,,,Y,6784.84,3275.28
Finger Lakes,Monroe,2701005,000413,Strong Memorial Hospital,0 to 17,146,M,Other Race,Unknown,2,Emergency,Home w/ Home Health Services,2022,INJ019,"Burn and corrosion, initial encounter",,,844,PARTIAL THICKNESS BURNS WITHOUT SKIN GRAFT,22,BURNS,2,Moderate,Minor,Medical,Blue Cross/Blue Shield,,,,,Y,6953.56,3322.09
Finger Lakes,Monroe,2701005,000413,Strong Memorial Hospital,50 to 69,148,M,White,Not Span/Hispanic,3,Urgent,Home w/ Home Health Services,2022,INJ019,"Burn and corrosion, initial encounter",,,844,PARTIAL THICKNESS BURNS WITHOUT SKIN GRAFT,22,BURNS,1,Minor,Minor,Medical,Medicare,Medicaid,,,,N,6372.06,3734.49
Finger Lakes,Monroe,2701005,000413,Strong Memorial Hospital,30 to 49,146,F,Multi-racial,Spanish/Hispanic,3,Emergency,Home or Self Care,2022,INJ019,"Burn and corrosion, initial encounter",MST020,SUBCUTANEOUS TISSUE AND FASCIA EXCISION,844,PARTIAL THICKNESS BURNS WITHOUT SKIN GRAFT,22,BURNS,2,Moderate,Major,Medical,Medicaid,,,,,Y,9335.17,4707.26
Finger Lakes,Monroe,2701005,000413,Strong Memorial Hospital,0 to 17,145,M,Other Race,Unknown,5,Emergency,Home w/ Home Health Services,2022,INJ019,"Burn and corrosion, initial encounter",SKB008,SKIN EXCISION AND DEBRIDEMENT,844,PARTIAL THICKNESS BURNS WITHOUT SKIN GRAFT,22,BURNS,1,Minor,Minor,Medical,Medicaid,,,,,Y,15944.90,7784.81
Finger Lakes,Monroe,2701005,000413,Strong Memorial Hospital,0 to 17,144,M,White,Not Span/Hispanic,2,Emergency,Home w/ Home Health Services,2022,INJ019,"Burn and corrosion, initial encounter",SKB008,SKIN EXCISION AND DEBRIDEMENT,844,PARTIAL THICKNESS BURNS WITHOUT SKIN GRAFT,22,BURNS,1,Minor,Minor,Medical,Private Health Insurance,,,,,Y,6749.24,3249.66
Finger Lakes,Monroe,2701005,000413,Strong Memorial Hospital,50 to 69,145,M,White,Unknown,2,Emergency,Home or Self Care,2022,INJ019,"Burn and corrosion, initial encounter",SKB008,SKIN EXCISION AND DEBRIDEMENT,844,PARTIAL THICKNESS BURNS WITHOUT SKIN GRAFT,22,BURNS,2,Moderate,Moderate,Medical,Medicare,Private Health Insurance,,,,Y,10854.34,5446.13
Finger Lakes,Monroe,2701005,000413,Strong Memorial Hospital,0 to 17,146,F,Other Race,Not Span/Hispanic,3,Emergency,Home or Self Care,2022,INJ019,"Burn and corrosion, initial encounter",SKB008,SKIN EXCISION AND DEBRIDEMENT,844,PARTIAL THICKNESS BURNS WITHOUT SKIN GRAFT,22,BURNS,1,Minor,Minor,Medical,Medicaid,,,,,Y,9784.52,4764.75
Finger Lakes,Monroe,2701005,000413,Strong Memorial Hospital,0 to 17,144,M,White,Not Span/Hispanic,3,Urgent,Home or Self Care,2022,INJ019,"Burn and corrosion, initial encounter",SKB008,SKIN EXCISION AND DEBRIDEMENT,844,PARTIAL THICKNESS BURNS WITHOUT SKIN GRAFT,22,BURNS,1,Minor,Minor,Medical,Medicaid,,,,,Y,9155.57,5903.89
Finger Lakes,Monroe,2701005,000413,Strong Memorial Hospital,0 to 17,146,F,Black/African American,Not Span/Hispanic,3,Emergency,Home w/ Home Health Services,2022,INJ019,"Burn and corrosion, initial encounter",SKB008,SKIN EXCISION AND DEBRIDEMENT,844,PARTIAL THICKNESS BURNS WITHOUT SKIN GRAFT,22,BURNS,1,Minor,Minor,Medical,Miscellaneous/Other,Medicaid,,,,Y,13455.28,5864.87
Finger Lakes,Monroe,2701005,000413,Strong Memorial Hospital,0 to 17,144,M,White,Not Span/Hispanic,1,Emergency,Home or Self Care,2022,INJ019,"Burn and corrosion, initial encounter",SKB008,SKIN EXCISION AND DEBRIDEMENT,844,PARTIAL THICKNESS BURNS WITHOUT SKIN GRAFT,22,BURNS,2,Moderate,Minor,Medical,Medicaid,,,,,Y,5303.25,2036.11
Finger Lakes,Monroe,2701005,000413,Strong Memorial Hospital,30 to 49,148,F,White,Not Span/Hispanic,1,Emergency,Left Against Medical Advice,2022,INJ019,"Burn and corrosion, initial encounter",SKB008,SKIN EXCISION AND DEBRIDEMENT,844,PARTIAL THICKNESS BURNS WITHOUT SKIN GRAFT,22,BURNS,1,Minor,Minor,Medical,Medicare,Medicaid,,,,Y,4820.40,1924.66
Finger Lakes,Monroe,2701005,000413,Strong Memorial Hospital,30 to 49,146,F,White,Not Span/Hispanic,2,Emergency,Home or Self Care,2022,INJ019,"Burn and corrosion, initial encounter",MST020,SUBCUTANEOUS TISSUE AND FASCIA EXCISION,844,PARTIAL THICKNESS BURNS WITHOUT SKIN GRAFT,22,BURNS,1,Minor,Minor,Medical,Medicaid,,,,,Y,7869.85,3682.20
Finger Lakes,Monroe,2701005,000413,Strong Memorial Hospital,0 to 17,146,M,Black/African American,Not Span/Hispanic,1,Emergency,Home w/ Home Health Services,2022,INJ019,"Burn and corrosion, initial encounter",SKB008,SKIN EXCISION AND DEBRIDEMENT,844,PARTIAL THICKNESS BURNS WITHOUT SKIN GRAFT,22,BURNS,1,Minor,Minor,Medical,Medicaid,,,,,Y,10549.24,3654.51
Finger Lakes,Monroe,2701005,000413,Strong Memorial Hospital,0 to 17,146,F,Black/African American,Not Span/Hispanic,2,Emergency,Home or Self Care,2022,INJ019,"Burn and corrosion, initial encounter",SKB008,SKIN EXCISION AND DEBRIDEMENT,844,PARTIAL THICKNESS BURNS WITHOUT SKIN GRAFT,22,BURNS,1,Minor,Minor,Medical,Medicaid,,,,,Y,7669.21,3398.64
Finger Lakes,Monroe,2701005,000413,Strong Memorial Hospital,0 to 17,131,M,White,Not Span/Hispanic,3,Emergency,Home or Self Care,2022,INJ019,"Burn and corrosion, initial encounter",SKB008,SKIN EXCISION AND DEBRIDEMENT,844,PARTIAL THICKNESS BURNS WITHOUT SKIN GRAFT,22,BURNS,1,Minor,Minor,Medical,Medicaid,,,,,Y,10802.10,4935.04
Finger Lakes,Monroe,2701005,000413,Strong Memorial Hospital,0 to 17,146,M,Black/African American,Not Span/Hispanic,1,Emergency,Home or Self Care,2022,INJ019,"Burn and corrosion, initial encounter",SKB008,SKIN EXCISION AND DEBRIDEMENT,844,PARTIAL THICKNESS BURNS WITHOUT SKIN GRAFT,22,BURNS,1,Minor,Minor,Medical,Medicaid,,,,,Y,5650.65,2321.76
Finger Lakes,Monroe,2701005,000413,Strong Memorial Hospital,0 to 17,146,F,White,Not Span/Hispanic,2,Urgent,Home or Self Care,2022,INJ019,"Burn and corrosion, initial encounter",SKB008,SKIN EXCISION AND DEBRIDEMENT,844,PARTIAL THICKNESS BURNS WITHOUT SKIN GRAFT,22,BURNS,1,Minor,Minor,Medical,Medicaid,,,,,N,5063.70,2711.19
Finger Lakes,Monroe,2701005,000413,Strong Memorial Hospital,30 to 49,146,F,Black/African American,Not Span/Hispanic,3,Emergency,Home w/ Home Health Services,2022,INJ019,"Burn and corrosion, initial encounter",SKB008,SKIN EXCISION AND DEBRIDEMENT,844,PARTIAL THICKNESS BURNS WITHOUT SKIN GRAFT,22,BURNS,1,Minor,Minor,Medical,Medicaid,,,,,Y,18236.76,10157.50
Finger Lakes,Monroe,2701005,000413,Strong Memorial Hospital,50 to 69,145,F,White,Not Span/Hispanic,2,Emergency,Home w/ Home Health Services,2022,INJ019,"Burn and corrosion, initial encounter",SKB008,SKIN EXCISION AND DEBRIDEMENT,844,PARTIAL THICKNESS BURNS WITHOUT SKIN GRAFT,22,BURNS,1,Minor,Minor,Medical,Medicaid,,,,,Y,21972.37,8545.43
Finger Lakes,Monroe,2701005,000413,Strong Memorial Hospital,0 to 17,142,F,Black/African American,Not Span/Hispanic,5,Emergency,Home or Self Care,2022,INJ019,"Burn and corrosion, initial encounter",SKB008,SKIN EXCISION AND DEBRIDEMENT,844,PARTIAL THICKNESS BURNS WITHOUT SKIN GRAFT,22,BURNS,1,Minor,Minor,Medical,Medicaid,,,,,Y,16406.40,7763.80
Finger Lakes,Monroe,2701005,000413,Strong Memorial Hospital,70 or Older,144,F,White,Not Span/Hispanic,2,Emergency,Home w/ Home Health Services,2022,INJ019,"Burn and corrosion, initial encounter",SKB008,SKIN EXCISION AND DEBRIDEMENT,844,PARTIAL THICKNESS BURNS WITHOUT SKIN GRAFT,22,BURNS,2,Moderate,Moderate,Medical,Medicare,,,,,Y,10851.31,5483.82
Finger Lakes,Monroe,2701005,000413,Strong Memorial Hospital,0 to 17,146,M,Black/African American,Not Span/Hispanic,2,Emergency,Home w/ Home Health Services,2022,INJ019,"Burn and corrosion, initial encounter",SKB008,SKIN EXCISION AND DEBRIDEMENT,844,PARTIAL THICKNESS BURNS WITHOUT SKIN GRAFT,22,BURNS,1,Minor,Minor,Medical,Medicaid,,,,,Y,6683.31,3116.33
Finger Lakes,Monroe,2701005,000413,Strong Memorial Hospital,30 to 49,OOS,M,White,Not Span/Hispanic,6,Emergency,Home or Self Care,2022,INJ019,"Burn and corrosion, initial encounter",MST020,SUBCUTANEOUS TISSUE AND FASCIA EXCISION,844,PARTIAL THICKNESS BURNS WITHOUT SKIN GRAFT,22,BURNS,1,Minor,Minor,Medical,Blue Cross/Blue Shield,,,,,Y,33948.69,19451.45
Finger Lakes,Monroe,2701005,000413,Strong Memorial Hospital,30 to 49,144,F,White,Not Span/Hispanic,1,Emergency,Home w/ Home Health Services,2022,INJ019,"Burn and corrosion, initial encounter",MST020,SUBCUTANEOUS TISSUE AND FASCIA EXCISION,844,PARTIAL THICKNESS BURNS WITHOUT SKIN GRAFT,22,BURNS,2,Moderate,Minor,Medical,Private Health Insurance,,,,,Y,19846.59,8620.06
Finger Lakes,Monroe,2701005,000413,Strong Memorial Hospital,18 to 29,146,M,White,Not Span/Hispanic,3,Emergency,Home w/ Home Health Services,2022,INJ019,"Burn and corrosion, initial encounter",MST020,SUBCUTANEOUS TISSUE AND FASCIA EXCISION,844,PARTIAL THICKNESS BURNS WITHOUT SKIN GRAFT,22,BURNS,1,Minor,Minor,Medical,Miscellaneous/Other,Blue Cross/Blue Shield,,,,Y,17883.89,10263.67
Capital/Adirond,Warren,5601000,001005,Glens Falls Hospital,30 to 49,128,M,White,Not Span/Hispanic,2,Emergency,Left Against Medical Advice,2022,INJ019,"Burn and corrosion, initial encounter",,,844,PARTIAL THICKNESS BURNS WITHOUT SKIN GRAFT,22,BURNS,1,Minor,Minor,Medical,Medicaid,,,,,Y,7710.29,3514.23
Finger Lakes,Monroe,2701005,000413,Strong Memorial Hospital,30 to 49,141,F,Black/African American,Not Span/Hispanic,5,Emergency,Home or Self Care,2022,INJ019,"Burn and corrosion, initial encounter",PLC002,PACKING AND DRESSING PROCEDURES,844,PARTIAL THICKNESS BURNS WITHOUT SKIN GRAFT,22,BURNS,2,Moderate,Minor,Medical,Medicaid,,,,,Y,12782.75,6897.40
Finger Lakes,Monroe,2701005,000413,Strong Memorial Hospital,50 to 69,144,M,White,Not Span/Hispanic,4,Emergency,Home w/ Home Health Services,2022,INJ019,"Burn and corrosion, initial encounter",SKB008,SKIN EXCISION AND DEBRIDEMENT,844,PARTIAL THICKNESS BURNS WITHOUT SKIN GRAFT,22,BURNS,2,Moderate,Minor,Medical,Miscellaneous/Other,Blue Cross/Blue Shield,Medicare,,,Y,26447.48,12643.55
Finger Lakes,Monroe,2701005,000413,Strong Memorial Hospital,0 to 17,145,F,White,Unknown,1,Emergency,Home w/ Home Health Services,2022,INJ019,"Burn and corrosion, initial encounter",SKB008,SKIN EXCISION AND DEBRIDEMENT,844,PARTIAL THICKNESS BURNS WITHOUT SKIN GRAFT,22,BURNS,1,Minor,Minor,Medical,Medicaid,,,,,Y,4679.76,1888.18
Finger Lakes,Monroe,2701005,000413,Strong Memorial Hospital,18 to 29,144,M,White,Not Span/Hispanic,1,Emergency,Home or Self Care,2022,INJ019,"Burn and corrosion, initial encounter",ENT001,LARYNGOSCOPY (DIAGNOSTIC),844,PARTIAL THICKNESS BURNS WITHOUT SKIN GRAFT,22,BURNS,1,Minor,Minor,Medical,Miscellaneous/Other,Private Health Insurance,,,,Y,6272.73,2539.95
Finger Lakes,Monroe,2701005,000413,Strong Memorial Hospital,50 to 69,145,M,White,Not Span/Hispanic,2,Emergency,Home or Self Care,2022,INJ019,"Burn and corrosion, initial encounter",,,844,PARTIAL THICKNESS BURNS WITHOUT SKIN GRAFT,22,BURNS,1,Minor,Moderate,Medical,Medicare,Medicaid,,,,Y,17103.44,8050.11
New York City,Manhattan,7002001,001438,Bellevue Hospital Center,70 or Older,100,M,White,Unknown,1,Emergency,Short-term Hospital,2022,INJ019,"Burn and corrosion, initial encounter",ADM010,VACCINATIONS,844,PARTIAL THICKNESS BURNS WITHOUT SKIN GRAFT,22,BURNS,2,Moderate,Moderate,Medical,Medicare,Private Health Insurance,,,,Y,11406.88,6559.91
Finger Lakes,Monroe,2701005,000413,Strong Memorial Hospital,18 to 29,146,M,White,Not Span/Hispanic,8,Emergency,Home or Self Care,2022,INJ019,"Burn and corrosion, initial encounter",IMG006,COMPUTERIZED TOMOGRAPHY (CT) WITH CONTRAST,844,PARTIAL THICKNESS BURNS WITHOUT SKIN GRAFT,22,BURNS,2,Moderate,Minor,Medical,Medicaid,,,,,Y,49545.84,25471.28
Finger Lakes,Monroe,2701005,000413,Strong Memorial Hospital,0 to 17,146,F,Black/African American,Not Span/Hispanic,5,Emergency,Home w/ Home Health Services,2022,INJ019,"Burn and corrosion, initial encounter",SKB008,SKIN EXCISION AND DEBRIDEMENT,844,PARTIAL THICKNESS BURNS WITHOUT SKIN GRAFT,22,BURNS,1,Minor,Minor,Medical,Medicaid,,,,,Y,13372.79,7041.62
Finger Lakes,Monroe,2701005,000413,Strong Memorial Hospital,18 to 29,144,M,White,Not Span/Hispanic,2,Emergency,Home w/ Home Health Services,2022,INJ019,"Burn and corrosion, initial encounter",SKB008,SKIN EXCISION AND DEBRIDEMENT,844,PARTIAL THICKNESS BURNS WITHOUT SKIN GRAFT,22,BURNS,1,Minor,Minor,Medical,Private Health Insurance,,,,,Y,14101.33,7822.71
Finger Lakes,Monroe,2701005,000413,Strong Memorial Hospital,0 to 17,146,F,Black/African American,Not Span/Hispanic,5,Emergency,Home w/ Home Health Services,2022,INJ019,"Burn and corrosion, initial encounter",SKB008,SKIN EXCISION AND DEBRIDEMENT,844,PARTIAL THICKNESS BURNS WITHOUT SKIN GRAFT,22,BURNS,1,Minor,Minor,Medical,Medicaid,,,,,Y,14883.08,7377.41
Finger Lakes,Monroe,2701005,000413,Strong Memorial Hospital,18 to 29,146,M,White,Not Span/Hispanic,2,Emergency,Home or Self Care,2022,INJ019,"Burn and corrosion, initial encounter",,,844,PARTIAL THICKNESS BURNS WITHOUT SKIN GRAFT,22,BURNS,2,Moderate,Moderate,Medical,Medicaid,,,,,Y,13384.57,5115.81
Finger Lakes,Monroe,2701005,000413,Strong Memorial Hospital,0 to 17,146,M,Other Race,Spanish/Hispanic,1,Emergency,Home w/ Home Health Services,2022,INJ019,"Burn and corrosion, initial encounter",SKB008,SKIN EXCISION AND DEBRIDEMENT,844,PARTIAL THICKNESS BURNS WITHOUT SKIN GRAFT,22,BURNS,1,Minor,Minor,Medical,Medicaid,,,,,Y,4856.60,2094.06
Finger Lakes,Monroe,2701005,000413,Strong Memorial Hospital,30 to 49,144,M,White,Not Span/Hispanic,5,Emergency,Home w/ Home Health Services,2022,INJ019,"Burn and corrosion, initial encounter",,,844,PARTIAL THICKNESS BURNS WITHOUT SKIN GRAFT,22,BURNS,2,Moderate,Minor,Medical,Blue Cross/Blue Shield,,,,,Y,25485.74,14494.83
Finger Lakes,Monroe,2701005,000413,Strong Memorial Hospital,0 to 17,,M,Other Race,Not Span/Hispanic,2,Emergency,Home or Self Care,2022,INJ019,"Burn and corrosion, initial encounter",SKB008,SKIN EXCISION AND DEBRIDEMENT,844,PARTIAL THICKNESS BURNS WITHOUT SKIN GRAFT,22,BURNS,1,Minor,Minor,Medical,Medicaid,,,,,Y,6368.40,3010.05
Western NY,Cattaraugus,0401001,000066,Olean General Hospital,50 to 69,147,M,White,Not Span/Hispanic,2,Emergency,Short-term Hospital,2022,INJ019,"Burn and corrosion, initial encounter",,,844,PARTIAL THICKNESS BURNS WITHOUT SKIN GRAFT,22,BURNS,1,Minor,Moderate,Medical,Medicaid,,,,,Y,6750.20,2383.01
Finger Lakes,Monroe,2701005,000413,Strong Memorial Hospital,70 or Older,140,M,White,Not Span/Hispanic,3,Emergency,Home or Self Care,2022,INJ019,"Burn and corrosion, initial encounter",SKB008,SKIN EXCISION AND DEBRIDEMENT,844,PARTIAL THICKNESS BURNS WITHOUT SKIN GRAFT,22,BURNS,2,Moderate,Moderate,Medical,Medicare,Blue Cross/Blue Shield,,,,Y,18371.75,10398.65
Finger Lakes,Monroe,2701005,000413,Strong Memorial Hospital,18 to 29,145,M,Other Race,Not Span/Hispanic,2,Emergency,Home w/ Home Health Services,2022,INJ019,"Burn and corrosion, initial encounter",PLC002,PACKING AND DRESSING PROCEDURES,844,PARTIAL THICKNESS BURNS WITHOUT SKIN GRAFT,22,BURNS,2,Moderate,Minor,Medical,Miscellaneous/Other,Medicaid,,,,Y,20250.68,8361.28
Finger Lakes,Monroe,2701005,000413,Strong Memorial Hospital,0 to 17,140,M,White,Not Span/Hispanic,4,Emergency,Home or Self Care,2022,INJ019,"Burn and corrosion, initial encounter",SKB008,SKIN EXCISION AND DEBRIDEMENT,844,PARTIAL THICKNESS BURNS WITHOUT SKIN GRAFT,22,BURNS,1,Minor,Minor,Medical,Medicaid,,,,,Y,12593.29,6032.85
Finger Lakes,Monroe,2701005,000413,Strong Memorial Hospital,0 to 17,148,M,Other Race,Unknown,7,Emergency,Home or Self Care,2022,INJ019,"Burn and corrosion, initial encounter",SKB008,SKIN EXCISION AND DEBRIDEMENT,844,PARTIAL THICKNESS BURNS WITHOUT SKIN GRAFT,22,BURNS,1,Minor,Minor,Medical,Medicaid,,,,,Y,20860.30,10520.00
Finger Lakes,Monroe,2701005,000413,Strong Memorial Hospital,18 to 29,146,M,White,Not Span/Hispanic,1,Emergency,Home or Self Care,2022,INJ019,"Burn and corrosion, initial encounter",,,844,PARTIAL THICKNESS BURNS WITHOUT SKIN GRAFT,22,BURNS,3,Major,Moderate,Medical,Miscellaneous/Other,Blue Cross/Blue Shield,,,,Y,8355.00,4067.49
Finger Lakes,Monroe,2701005,000413,Strong Memorial Hospital,18 to 29,146,M,White,Not Span/Hispanic,1,Emergency,Home or Self Care,2022,INJ019,"Burn and corrosion, initial encounter",SKB006,SKIN LACERATION REPAIR (EXCLUDING PERINEUM),844,PARTIAL THICKNESS BURNS WITHOUT SKIN GRAFT,22,BURNS,3,Major,Moderate,Medical,Miscellaneous/Other,Blue Cross/Blue Shield,,,,N,14894.17,5274.96
Finger Lakes,Monroe,2701005,000413,Strong Memorial Hospital,0 to 17,142,M,Other Race,Spanish/Hispanic,5,Emergency,Home or Self Care,2022,INJ019,"Burn and corrosion, initial encounter",SKB008,SKIN EXCISION AND DEBRIDEMENT,844,PARTIAL THICKNESS BURNS WITHOUT SKIN GRAFT,22,BURNS,1,Minor,Minor,Medical,Medicaid,,,,,Y,104684.65,32966.12
Finger Lakes,Monroe,2701005,000413,Strong Memorial Hospital,30 to 49,146,M,Black/African American,Not Span/Hispanic,2,Emergency,Home or Self Care,2022,INJ019,"Burn and corrosion, initial encounter",SKB006,SKIN LACERATION REPAIR (EXCLUDING PERINEUM),844,PARTIAL THICKNESS BURNS WITHOUT SKIN GRAFT,22,BURNS,2,Moderate,Minor,Medical,Medicaid,,,,,Y,21705.79,6424.14
Finger Lakes,Monroe,2701005,000413,Strong Memorial Hospital,0 to 17,146,M,Multi-racial,Not Span/Hispanic,3,Emergency,Home or Self Care,2022,INJ019,"Burn and corrosion, initial encounter",MST030,"MUSCULOSKELETAL PROCEDURES, NEC",844,PARTIAL THICKNESS BURNS WITHOUT SKIN GRAFT,22,BURNS,2,Moderate,Minor,Medical,Miscellaneous/Other,Medicaid,,,,Y,17529.02,6801.76
Long Island,Nassau,2951001,000541,North Shore University Hospital,30 to 49,114,M,Black/African American,Not Span/Hispanic,7,Emergency,Home w/ Home Health Services,2022,INJ019,"Burn and corrosion, initial encounter",,,844,PARTIAL THICKNESS BURNS WITHOUT SKIN GRAFT,22,BURNS,3,Major,Major,Medical,Medicaid,Medicaid,,,,Y,91089.16,15548.07
Finger Lakes,Monroe,2701005,000413,Strong Memorial Hospital,0 to 17,142,F,Black/African American,Not Span/Hispanic,8,Emergency,Home or Self Care,2022,INJ019,"Burn and corrosion, initial encounter",SKB008,SKIN EXCISION AND DEBRIDEMENT,844,PARTIAL THICKNESS BURNS WITHOUT SKIN GRAFT,22,BURNS,3,Major,Moderate,Medical,Medicaid,,,,,Y,142811.16,45660.34
Finger Lakes,Monroe,2701005,000413,Strong Memorial Hospital,0 to 17,146,M,White,Not Span/Hispanic,1,Emergency,Home or Self Care,2022,INJ019,"Burn and corrosion, initial encounter",ENT015,DENTAL PROCEDURES,844,PARTIAL THICKNESS BURNS WITHOUT SKIN GRAFT,22,BURNS,2,Moderate,Minor,Medical,Medicaid,,,,,Y,6501.68,2475.60
New York City,Manhattan,7002054,001464,New York-Presbyterian Hospital - Columbia Presbyterian Center,0 to 17,104,M,White,Spanish/Hispanic,1,Emergency,Home or Self Care,2022,INJ019,"Burn and corrosion, initial encounter",,,844,PARTIAL THICKNESS BURNS WITHOUT SKIN GRAFT,22,BURNS,1,Minor,Minor,Medical,Medicaid,,,,,Y,15197.15,3365.69
Finger Lakes,Monroe,2701005,000413,Strong Memorial Hospital,0 to 17,146,M,White,Not Span/Hispanic,2,Emergency,Home w/ Home Health Services,2022,INJ019,"Burn and corrosion, initial encounter",SKB008,SKIN EXCISION AND DEBRIDEMENT,844,PARTIAL THICKNESS BURNS WITHOUT SKIN GRAFT,22,BURNS,1,Minor,Minor,Medical,Blue Cross/Blue Shield,,,,,Y,8986.86,3778.54
Western NY,Cattaraugus,0401001,000066,Olean General Hospital,50 to 69,147,M,White,Not Span/Hispanic,8,Emergency,Left Against Medical Advice,2022,INJ019,"Burn and corrosion, initial encounter",,,844,PARTIAL THICKNESS BURNS WITHOUT SKIN GRAFT,22,BURNS,2,Moderate,Minor,Medical,Medicaid,,,,,Y,12062.42,6711.40
Finger Lakes,Monroe,2701005,000413,Strong Memorial Hospital,0 to 17,141,F,White,Not Span/Hispanic,1,Emergency,Home or Self Care,2022,INJ019,"Burn and corrosion, initial encounter",SKB008,SKIN EXCISION AND DEBRIDEMENT,844,PARTIAL THICKNESS BURNS WITHOUT SKIN GRAFT,22,BURNS,2,Moderate,Minor,Medical,Medicaid,,,,,Y,4888.67,1994.66
Finger Lakes,Monroe,2701005,000413,Strong Memorial Hospital,30 to 49,146,F,Black/African American,Not Span/Hispanic,5,Emergency,Home w/ Home Health Services,2022,INJ019,"Burn and corrosion, initial encounter",,,844,PARTIAL THICKNESS BURNS WITHOUT SKIN GRAFT,22,BURNS,2,Moderate,Moderate,Medical,Medicaid,,,,,Y,34258.97,
Finger Lakes,Monroe,2701005,000413,Strong Memorial Hospital,30 to 49,146,M,White,Not Span/Hispanic,1,Emergency,Left Against Medical Advice,2022,INJ019,"Burn and corrosion, initial encounter",,,844,PARTIAL THICKNESS BURNS WITHOUT SKIN GRAFT,22,BURNS,1,Minor,Minor,Medical,Medicaid,,,,,Y,5720.84,2455.12
Finger Lakes,Monroe,2701005,000413,Strong Memorial Hospital,0 to 17,146,M,White,Not Span/Hispanic,3,Emergency,Home w/ Home Health Services,2022,INJ019,"Burn and corrosion, initial encounter",SKB008,SKIN EXCISION AND DEBRIDEMENT,844,PARTIAL THICKNESS BURNS WITHOUT SKIN GRAFT,22,BURNS,1,Minor,Minor,Medical,Medicaid,,,,,Y,9645.15,4704.87
Finger Lakes,Monroe,2701005,000413,Strong Memorial Hospital,0 to 17,144,M,White,Unknown,2,Emergency,Home w/ Home Health Services,2022,INJ019,"Burn and corrosion, initial encounter",SKB008,SKIN EXCISION AND DEBRIDEMENT,844,PARTIAL THICKNESS BURNS WITHOUT SKIN GRAFT,22,BURNS,1,Minor,Minor,Medical,Blue Cross/Blue Shield,,,,,Y,6754.36,3248.77
Finger Lakes,Monroe,2701005,000413,Strong Memorial Hospital,0 to 17,146,M,Multi-racial,Not Span/Hispanic,3,Emergency,Home w/ Home Health Services,2022,INJ019,"Burn and corrosion, initial encounter",SKB008,SKIN EXCISION AND DEBRIDEMENT,844,PARTIAL THICKNESS BURNS WITHOUT SKIN GRAFT,22,BURNS,2,Moderate,Minor,Medical,Medicaid,,,,,Y,11446.14,5245.79
Finger Lakes,Monroe,2701005,000413,Strong Memorial Hospital,0 to 17,140,F,White,Not Span/Hispanic,2,Emergency,Home or Self Care,2022,INJ019,"Burn and corrosion, initial encounter",SKB008,SKIN EXCISION AND DEBRIDEMENT,844,PARTIAL THICKNESS BURNS WITHOUT SKIN GRAFT,22,BURNS,1,Minor,Minor,Medical,Medicaid,,,,,Y,7717.65,3524.50