Hospital Service Area,Hospital County,Operating Certificate Number,Permanent Facility Id,Facility Name,Age Group,Zip Code - 3 digits,Gender,Race,Ethnicity,Length of Stay,Type of Admission,Patient Disposition,Discharge Year,CCS Diagnosis Code,CCS Diagnosis Description,CCS Procedure Code,CCS Procedure Description,APR DRG Code,APR DRG Description,APR MDC Code,APR MDC Description,APR Severity of Illness Code,APR Severity of Illness Description,APR Risk of Mortality,APR Medical Surgical Description,Payment Typology 1,Payment Typology 2,Payment Typology 3,Birth Weight,Abortion Edit Indicator,Emergency Department Indicator,Total Charges,Total Costs
New York City,Manhattan,7002054,001464,New York-Presbyterian Hospital - Columbia Presbyterian Center,30 to 49,105,M,White,Not Span/Hispanic,10,Emergency,Skilled Nursing Home,2022,MUS037,Postprocedural or postoperative musculoskeletal system complication,MST013,SPINE FUSION,850,"PROCEDURE WITH DIAGNOSIS OF REHABILITATION, AFTERCARE OR OTHER CONTACT WITH HEALTH SERVICES",23,FACTORS INFLUENCING HEALTH STATUS AND OTHER CONTACTS WITH HEALTH SERVICES,1,Minor,Minor,Surgical,Medicaid,,,,,Y,319239.79,102307.48
New York City,Manhattan,7002054,001464,New York-Presbyterian Hospital - Columbia Presbyterian Center,50 to 69,100,M,Black/African American,Unknown,2,Urgent,Home or Self Care,2022,INJ042,"Fracture of lower limb (except hip), subsequent encounter",MST011,FIXATION OF LEG AND FOOT BONES,850,"PROCEDURE WITH DIAGNOSIS OF REHABILITATION, AFTERCARE OR OTHER CONTACT WITH HEALTH SERVICES",23,FACTORS INFLUENCING HEALTH STATUS AND OTHER CONTACTS WITH HEALTH SERVICES,2,Moderate,Moderate,Surgical,Private Health Insurance,,,,,N,78729.53,26038.42
New York City,Manhattan,7002001,001438,Bellevue Hospital Center,18 to 29,113,M,Black/African American,Not Span/Hispanic,1,Elective,Home or Self Care,2022,INJ044,"Dislocations, subsequent encounter",MST014,JOINT FUSION (EXCLUDING SPINE),850,"PROCEDURE WITH DIAGNOSIS OF REHABILITATION, AFTERCARE OR OTHER CONTACT WITH HEALTH SERVICES",23,FACTORS INFLUENCING HEALTH STATUS AND OTHER CONTACTS WITH HEALTH SERVICES,1,Minor,Minor,Surgical,Medicaid,,,,,N,14164.00,8145.49
New York City,Manhattan,7002053,001463,NYU Langone Hospitals,70 or Older,112,M,White,Not Span/Hispanic,45,Emergency,Skilled Nursing Home,2022,INJ037,"Complication of other surgical or medical care, injury, initial encounter",GIS022,GI SYSTEM LYSIS OF ADHESIONS,850,"PROCEDURE WITH DIAGNOSIS OF REHABILITATION, AFTERCARE OR OTHER CONTACT WITH HEALTH SERVICES",23,FACTORS INFLUENCING HEALTH STATUS AND OTHER CONTACTS WITH HEALTH SERVICES,3,Major,Major,Surgical,Medicare,Medicare,,,,N,1125279.88,267244.62
New York City,Manhattan,7002053,001463,NYU Langone Hospitals,50 to 69,104,F,Other Race,Spanish/Hispanic,4,Elective,Home w/ Home Health Services,2022,MUS037,Postprocedural or postoperative musculoskeletal system complication,MST013,SPINE FUSION,850,"PROCEDURE WITH DIAGNOSIS OF REHABILITATION, AFTERCARE OR OTHER CONTACT WITH HEALTH SERVICES",23,FACTORS INFLUENCING HEALTH STATUS AND OTHER CONTACTS WITH HEALTH SERVICES,2,Moderate,Minor,Surgical,Blue Cross/Blue Shield,,,,,N,429322.84,71594.14
Finger Lakes,Monroe,2701005,000413,Strong Memorial Hospital,30 to 49,146,M,Other Race,Unknown,1,Elective,Home or Self Care,2022,INJ056,"Burns and corrosion, subsequent encounter",SKB007,SKIN GRAFT,850,"PROCEDURE WITH DIAGNOSIS OF REHABILITATION, AFTERCARE OR OTHER CONTACT WITH HEALTH SERVICES",23,FACTORS INFLUENCING HEALTH STATUS AND OTHER CONTACTS WITH HEALTH SERVICES,1,Minor,Minor,Surgical,Medicaid,,,,,N,21863.88,10498.36
New York City,Manhattan,7002053,001463,NYU Langone Hospitals,50 to 69,OOS,M,White,Not Span/Hispanic,2,Elective,Home or Self Care,2022,NVS019,Nervous system pain and pain syndromes,CNS012,CNS NEUROSTIMULATOR PROCEDURES,850,"PROCEDURE WITH DIAGNOSIS OF REHABILITATION, AFTERCARE OR OTHER CONTACT WITH HEALTH SERVICES",23,FACTORS INFLUENCING HEALTH STATUS AND OTHER CONTACTS WITH HEALTH SERVICES,2,Moderate,Moderate,Surgical,Medicare,Medicare,,,,N,249140.35,40239.92
New York City,Manhattan,7002001,001438,Bellevue Hospital Center,50 to 69,100,F,White,Unknown,17,Elective,Home w/ Home Health Services,2022,INJ040,"Fracture of torso, subsequent encounter",RHB002,"PHYSICAL, OCCUPATIONAL, AND RESPIRATORY THERAPY TREATMENT",850,"PROCEDURE WITH DIAGNOSIS OF REHABILITATION, AFTERCARE OR OTHER CONTACT WITH HEALTH SERVICES",23,FACTORS INFLUENCING HEALTH STATUS AND OTHER CONTACTS WITH HEALTH SERVICES,1,Minor,Minor,Surgical,Medicare,Private Health Insurance,,,,N,146131.39,84037.82
Finger Lakes,Monroe,2701005,000413,Strong Memorial Hospital,30 to 49,145,M,White,Not Span/Hispanic,3,Emergency,Home or Self Care,2022,INJ039,"Fracture of the spine and back, subsequent encounter",MST013,SPINE FUSION,850,"PROCEDURE WITH DIAGNOSIS OF REHABILITATION, AFTERCARE OR OTHER CONTACT WITH HEALTH SERVICES",23,FACTORS INFLUENCING HEALTH STATUS AND OTHER CONTACTS WITH HEALTH SERVICES,2,Moderate,Minor,Surgical,Private Health Insurance,,,,,Y,78570.04,37356.24
New York City,Manhattan,7002053,001463,NYU Langone Hospitals,50 to 69,112,F,White,Not Span/Hispanic,6,Elective,Inpatient Rehabilitation Facility,2022,MUS037,Postprocedural or postoperative musculoskeletal system complication,MST013,SPINE FUSION,850,"PROCEDURE WITH DIAGNOSIS OF REHABILITATION, AFTERCARE OR OTHER CONTACT WITH HEALTH SERVICES",23,FACTORS INFLUENCING HEALTH STATUS AND OTHER CONTACTS WITH HEALTH SERVICES,3,Major,Major,Surgical,Blue Cross/Blue Shield,Medicare,,,,N,902688.15,143043.30
New York City,Manhattan,7002001,001438,Bellevue Hospital Center,18 to 29,113,M,Other Race,Unknown,28,Urgent,Home or Self Care,2022,INJ045,"Traumatic brain injury (TBI); concussion, subsequent encounter",RHB002,"PHYSICAL, OCCUPATIONAL, AND RESPIRATORY THERAPY TREATMENT",850,"PROCEDURE WITH DIAGNOSIS OF REHABILITATION, AFTERCARE OR OTHER CONTACT WITH HEALTH SERVICES",23,FACTORS INFLUENCING HEALTH STATUS AND OTHER CONTACTS WITH HEALTH SERVICES,2,Moderate,Moderate,Surgical,Medicaid,,,,,N,208024.09,119631.33
New York City,Manhattan,7002053,001463,NYU Langone Hospitals,30 to 49,100,M,Other Race,Not Span/Hispanic,4,Elective,Home or Self Care,2022,INJ040,"Fracture of torso, subsequent encounter",RES006,OPEN AND THORACOSCOPIC PLEURAL DRAINAGE,850,"PROCEDURE WITH DIAGNOSIS OF REHABILITATION, AFTERCARE OR OTHER CONTACT WITH HEALTH SERVICES",23,FACTORS INFLUENCING HEALTH STATUS AND OTHER CONTACTS WITH HEALTH SERVICES,2,Moderate,Minor,Surgical,Private Health Insurance,,,,,N,278491.50,50287.99
New York City,Manhattan,7002053,001463,NYU Langone Hospitals,30 to 49,109,M,White,Not Span/Hispanic,1,Elective,Home or Self Care,2022,MUS037,Postprocedural or postoperative musculoskeletal system complication,MST013,SPINE FUSION,850,"PROCEDURE WITH DIAGNOSIS OF REHABILITATION, AFTERCARE OR OTHER CONTACT WITH HEALTH SERVICES",23,FACTORS INFLUENCING HEALTH STATUS AND OTHER CONTACTS WITH HEALTH SERVICES,1,Minor,Minor,Surgical,Miscellaneous/Other,,,,,N,155209.69,24512.59
New York City,Manhattan,7002001,001438,Bellevue Hospital Center,0 to 17,113,M,Other Race,Not Span/Hispanic,7,Emergency,Home or Self Care,2022,INJ053,"Injury to blood vessels, subsequent encounter",CAR012,VESSEL REPAIR AND REPLACEMENT,850,"PROCEDURE WITH DIAGNOSIS OF REHABILITATION, AFTERCARE OR OTHER CONTACT WITH HEALTH SERVICES",23,FACTORS INFLUENCING HEALTH STATUS AND OTHER CONTACTS WITH HEALTH SERVICES,1,Minor,Minor,Surgical,Private Health Insurance,,,,,Y,94404.65,54290.60
Finger Lakes,Monroe,2701005,000413,Strong Memorial Hospital,70 or Older,145,M,White,Not Span/Hispanic,3,Emergency,Home or Self Care,2022,INJ045,"Traumatic brain injury (TBI); concussion, subsequent encounter",CNS004,INTRACRANIAL EPIDURAL AND SUBDURAL SPACE DRAINAGE,850,"PROCEDURE WITH DIAGNOSIS OF REHABILITATION, AFTERCARE OR OTHER CONTACT WITH HEALTH SERVICES",23,FACTORS INFLUENCING HEALTH STATUS AND OTHER CONTACTS WITH HEALTH SERVICES,1,Minor,Minor,Surgical,Medicare,,,,,Y,35524.92,18002.34
New York City,Manhattan,7002053,001463,NYU Langone Hospitals,50 to 69,100,M,Other Race,Spanish/Hispanic,3,Elective,Short-term Hospital,2022,FAC010,Other aftercare encounter,RHB002,"PHYSICAL, OCCUPATIONAL, AND RESPIRATORY THERAPY TREATMENT",850,"PROCEDURE WITH DIAGNOSIS OF REHABILITATION, AFTERCARE OR OTHER CONTACT WITH HEALTH SERVICES",23,FACTORS INFLUENCING HEALTH STATUS AND OTHER CONTACTS WITH HEALTH SERVICES,3,Major,Major,Surgical,Medicare,Medicare,,,,N,145333.75,27710.84
New York City,Manhattan,7002053,001463,NYU Langone Hospitals,70 or Older,100,M,White,Not Span/Hispanic,9,Elective,Home w/ Home Health Services,2022,MUS037,Postprocedural or postoperative musculoskeletal system complication,MST013,SPINE FUSION,850,"PROCEDURE WITH DIAGNOSIS OF REHABILITATION, AFTERCARE OR OTHER CONTACT WITH HEALTH SERVICES",23,FACTORS INFLUENCING HEALTH STATUS AND OTHER CONTACTS WITH HEALTH SERVICES,3,Major,Major,Surgical,Blue Cross/Blue Shield,,,,,N,1242637.17,201972.44
New York City,Manhattan,7002053,001463,NYU Langone Hospitals,30 to 49,105,F,White,Not Span/Hispanic,4,Elective,Home or Self Care,2022,MUS037,Postprocedural or postoperative musculoskeletal system complication,MST013,SPINE FUSION,850,"PROCEDURE WITH DIAGNOSIS OF REHABILITATION, AFTERCARE OR OTHER CONTACT WITH HEALTH SERVICES",23,FACTORS INFLUENCING HEALTH STATUS AND OTHER CONTACTS WITH HEALTH SERVICES,3,Major,Moderate,Surgical,Medicare,Medicaid,,,,N,827175.37,126161.22
Long Island,Nassau,2951001,000541,North Shore University Hospital,50 to 69,100,F,Black/African American,Not Span/Hispanic,78,Emergency,Home w/ Home Health Services,2022,MUS037,Postprocedural or postoperative musculoskeletal system complication,ADM019,POTENTIAL COVID-19 THERAPIES,850,"PROCEDURE WITH DIAGNOSIS OF REHABILITATION, AFTERCARE OR OTHER CONTACT WITH HEALTH SERVICES",23,FACTORS INFLUENCING HEALTH STATUS AND OTHER CONTACTS WITH HEALTH SERVICES,4,Extreme,Extreme,Surgical,Medicaid,Medicaid,,,,Y,1527837.06,311849.19
Long Island,Nassau,2951001,000541,North Shore University Hospital,50 to 69,117,M,White,Not Span/Hispanic,6,Emergency,Home w/ Home Health Services,2022,MUS037,Postprocedural or postoperative musculoskeletal system complication,MST013,SPINE FUSION,850,"PROCEDURE WITH DIAGNOSIS OF REHABILITATION, AFTERCARE OR OTHER CONTACT WITH HEALTH SERVICES",23,FACTORS INFLUENCING HEALTH STATUS AND OTHER CONTACTS WITH HEALTH SERVICES,2,Moderate,Minor,Surgical,Blue Cross/Blue Shield,,,,,Y,226603.95,48012.95
New York City,Manhattan,7002054,001464,New York-Presbyterian Hospital - Columbia Presbyterian Center,70 or Older,109,F,White,Unknown,28,Emergency,Home w/ Home Health Services,2022,SYM010,Nervous system signs and symptoms,CAR008,ANGIOPLASTY AND RELATED VESSEL PROCEDURES (ENDOVASCULAR; EXCLUDING CAROTID),850,"PROCEDURE WITH DIAGNOSIS OF REHABILITATION, AFTERCARE OR OTHER CONTACT WITH HEALTH SERVICES",23,FACTORS INFLUENCING HEALTH STATUS AND OTHER CONTACTS WITH HEALTH SERVICES,3,Major,Major,Surgical,Medicare,,,,,Y,504791.93,125198.58
New York City,Manhattan,7002053,001463,NYU Langone Hospitals,70 or Older,104,M,Other Race,Not Span/Hispanic,8,Elective,Home w/ Home Health Services,2022,MUS037,Postprocedural or postoperative musculoskeletal system complication,MST013,SPINE FUSION,850,"PROCEDURE WITH DIAGNOSIS OF REHABILITATION, AFTERCARE OR OTHER CONTACT WITH HEALTH SERVICES",23,FACTORS INFLUENCING HEALTH STATUS AND OTHER CONTACTS WITH HEALTH SERVICES,3,Major,Major,Surgical,Medicare,Medicaid,,,,N,538730.75,97026.35
New York City,Manhattan,7002053,001463,NYU Langone Hospitals,50 to 69,115,M,White,Not Span/Hispanic,3,Elective,Home w/ Home Health Services,2022,MUS037,Postprocedural or postoperative musculoskeletal system complication,MST013,SPINE FUSION,850,"PROCEDURE WITH DIAGNOSIS OF REHABILITATION, AFTERCARE OR OTHER CONTACT WITH HEALTH SERVICES",23,FACTORS INFLUENCING HEALTH STATUS AND OTHER CONTACTS WITH HEALTH SERVICES,1,Minor,Minor,Surgical,Miscellaneous/Other,Medicare,,,,N,284662.40,49004.98
New York City,Manhattan,7002053,001463,NYU Langone Hospitals,50 to 69,OOS,F,White,Not Span/Hispanic,1,Elective,Home or Self Care,2022,INJ037,"Complication of other surgical or medical care, injury, initial encounter",MST029,"MUSCULOSKELETAL DEVICE PROCEDURES, NEC",850,"PROCEDURE WITH DIAGNOSIS OF REHABILITATION, AFTERCARE OR OTHER CONTACT WITH HEALTH SERVICES",23,FACTORS INFLUENCING HEALTH STATUS AND OTHER CONTACTS WITH HEALTH SERVICES,1,Minor,Minor,Surgical,Medicare,,,,,N,93417.74,16324.21
Finger Lakes,Monroe,2701005,000413,Strong Memorial Hospital,70 or Older,145,M,White,Not Span/Hispanic,3,Emergency,Home w/ Home Health Services,2022,INJ045,"Traumatic brain injury (TBI); concussion, subsequent encounter",CNS004,INTRACRANIAL EPIDURAL AND SUBDURAL SPACE DRAINAGE,850,"PROCEDURE WITH DIAGNOSIS OF REHABILITATION, AFTERCARE OR OTHER CONTACT WITH HEALTH SERVICES",23,FACTORS INFLUENCING HEALTH STATUS AND OTHER CONTACTS WITH HEALTH SERVICES,1,Minor,Minor,Surgical,Medicare,,,,,Y,34383.44,17551.69
Finger Lakes,Monroe,2701005,000413,Strong Memorial Hospital,70 or Older,144,F,White,Not Span/Hispanic,6,Emergency,Home w/ Home Health Services,2022,SYM007,Malaise and fatigue,MST016,VERTEBRAL DISCECTOMY,850,"PROCEDURE WITH DIAGNOSIS OF REHABILITATION, AFTERCARE OR OTHER CONTACT WITH HEALTH SERVICES",23,FACTORS INFLUENCING HEALTH STATUS AND OTHER CONTACTS WITH HEALTH SERVICES,2,Moderate,Moderate,Surgical,Medicare,,,,,Y,39811.85,19467.02
Finger Lakes,Monroe,2701005,000413,Strong Memorial Hospital,70 or Older,144,F,White,Not Span/Hispanic,8,Elective,Skilled Nursing Home,2022,INJ039,"Fracture of the spine and back, subsequent encounter",MST013,SPINE FUSION,850,"PROCEDURE WITH DIAGNOSIS OF REHABILITATION, AFTERCARE OR OTHER CONTACT WITH HEALTH SERVICES",23,FACTORS INFLUENCING HEALTH STATUS AND OTHER CONTACTS WITH HEALTH SERVICES,2,Moderate,Moderate,Surgical,Medicare,,,,,N,105836.82,56236.99
Long Island,Nassau,2951001,000541,North Shore University Hospital,30 to 49,113,M,Other Race,Not Span/Hispanic,1,Emergency,Home or Self Care,2022,FAC004,Encounter for prophylactic or other procedures,GIS008,APPENDECTOMY,850,"PROCEDURE WITH DIAGNOSIS OF REHABILITATION, AFTERCARE OR OTHER CONTACT WITH HEALTH SERVICES",23,FACTORS INFLUENCING HEALTH STATUS AND OTHER CONTACTS WITH HEALTH SERVICES,2,Moderate,Minor,Surgical,Private Health Insurance,,,,,Y,51914.47,8925.23
Long Island,Nassau,2951001,000541,North Shore University Hospital,50 to 69,112,M,Black/African American,Not Span/Hispanic,19,Elective,Inpatient Rehabilitation Facility,2022,MUS037,Postprocedural or postoperative musculoskeletal system complication,GIS017,GASTROSTOMY,850,"PROCEDURE WITH DIAGNOSIS OF REHABILITATION, AFTERCARE OR OTHER CONTACT WITH HEALTH SERVICES",23,FACTORS INFLUENCING HEALTH STATUS AND OTHER CONTACTS WITH HEALTH SERVICES,3,Major,Major,Surgical,Medicaid,Medicaid,,,,N,552771.45,117420.56
Long Island,Nassau,2951001,000541,North Shore University Hospital,30 to 49,114,F,Other Race,Spanish/Hispanic,5,Elective,Home or Self Care,2022,MUS037,Postprocedural or postoperative musculoskeletal system complication,MST013,SPINE FUSION,850,"PROCEDURE WITH DIAGNOSIS OF REHABILITATION, AFTERCARE OR OTHER CONTACT WITH HEALTH SERVICES",23,FACTORS INFLUENCING HEALTH STATUS AND OTHER CONTACTS WITH HEALTH SERVICES,2,Moderate,Minor,Surgical,Medicaid,,,,,N,174428.54,37012.04
Long Island,Nassau,2951001,000541,North Shore University Hospital,30 to 49,119,F,White,Spanish/Hispanic,1,Elective,Home or Self Care,2022,MUS037,Postprocedural or postoperative musculoskeletal system complication,MST013,SPINE FUSION,850,"PROCEDURE WITH DIAGNOSIS OF REHABILITATION, AFTERCARE OR OTHER CONTACT WITH HEALTH SERVICES",23,FACTORS INFLUENCING HEALTH STATUS AND OTHER CONTACTS WITH HEALTH SERVICES,2,Moderate,Minor,Surgical,Private Health Insurance,,,,,N,70447.48,14675.85
Long Island,Nassau,2951001,000541,North Shore University Hospital,50 to 69,117,F,Other Race,Spanish/Hispanic,11,Elective,Inpatient Rehabilitation Facility,2022,MUS037,Postprocedural or postoperative musculoskeletal system complication,MST013,SPINE FUSION,850,"PROCEDURE WITH DIAGNOSIS OF REHABILITATION, AFTERCARE OR OTHER CONTACT WITH HEALTH SERVICES",23,FACTORS INFLUENCING HEALTH STATUS AND OTHER CONTACTS WITH HEALTH SERVICES,2,Moderate,Minor,Surgical,Private Health Insurance,,,,,N,346309.80,71050.93
New York City,Manhattan,7002001,001438,Bellevue Hospital Center,70 or Older,111,F,Other Race,Spanish/Hispanic,4,Emergency,Home or Self Care,2022,INJ037,"Complication of other surgical or medical care, injury, initial encounter",SKB004,BREAST RECONSTRUCTION,850,"PROCEDURE WITH DIAGNOSIS OF REHABILITATION, AFTERCARE OR OTHER CONTACT WITH HEALTH SERVICES",23,FACTORS INFLUENCING HEALTH STATUS AND OTHER CONTACTS WITH HEALTH SERVICES,1,Minor,Moderate,Surgical,Medicare,Medicaid,,,,Y,43399.01,24958.08
New York City,Manhattan,7002054,001464,New York-Presbyterian Hospital - Columbia Presbyterian Center,30 to 49,100,M,Other Race,Unknown,4,Elective,Home or Self Care,2022,MUS037,Postprocedural or postoperative musculoskeletal system complication,MST010,FEMUR FIXATION,850,"PROCEDURE WITH DIAGNOSIS OF REHABILITATION, AFTERCARE OR OTHER CONTACT WITH HEALTH SERVICES",23,FACTORS INFLUENCING HEALTH STATUS AND OTHER CONTACTS WITH HEALTH SERVICES,3,Major,Moderate,Surgical,Private Health Insurance,,,,,N,95466.19,28373.50
New York City,Manhattan,7002001,001438,Bellevue Hospital Center,50 to 69,113,F,Other Race,Spanish/Hispanic,2,Emergency,Home or Self Care,2022,FAC009,"Implant, device or graft related encounter",SKB004,BREAST RECONSTRUCTION,850,"PROCEDURE WITH DIAGNOSIS OF REHABILITATION, AFTERCARE OR OTHER CONTACT WITH HEALTH SERVICES",23,FACTORS INFLUENCING HEALTH STATUS AND OTHER CONTACTS WITH HEALTH SERVICES,1,Minor,Moderate,Surgical,Medicaid,,,,,Y,26710.88,15361.00
Finger Lakes,Monroe,2701005,000413,Strong Memorial Hospital,30 to 49,146,F,Black/African American,Not Span/Hispanic,33,Urgent,Home or Self Care,2022,NEO074,Conditions due to neoplasm or the treatment of neoplasm,CAR008,ANGIOPLASTY AND RELATED VESSEL PROCEDURES (ENDOVASCULAR; EXCLUDING CAROTID),850,"PROCEDURE WITH DIAGNOSIS OF REHABILITATION, AFTERCARE OR OTHER CONTACT WITH HEALTH SERVICES",23,FACTORS INFLUENCING HEALTH STATUS AND OTHER CONTACTS WITH HEALTH SERVICES,4,Extreme,Extreme,Surgical,Medicare,Medicaid,,,,Y,286363.78,103784.80
Capital/Adirond,Warren,5601000,001005,Glens Falls Hospital,70 or Older,120,M,White,Unknown,2,Elective,Home w/ Home Health Services,2022,NVS019,Nervous system pain and pain syndromes,MST028,"SUBCUTANEOUS TISSUE AND FASCIA PROCEDURES, NEC",850,"PROCEDURE WITH DIAGNOSIS OF REHABILITATION, AFTERCARE OR OTHER CONTACT WITH HEALTH SERVICES",23,FACTORS INFLUENCING HEALTH STATUS AND OTHER CONTACTS WITH HEALTH SERVICES,1,Minor,Moderate,Surgical,Medicare,Private Health Insurance,,,,N,81744.27,28200.78
New York City,Manhattan,7002054,001464,New York-Presbyterian Hospital - Columbia Presbyterian Center,30 to 49,100,M,Black/African American,Not Span/Hispanic,5,Elective,Home or Self Care,2022,INJ072,"Complication of other surgical or medical care, injury, subsequent encounter",SKB007,SKIN GRAFT,850,"PROCEDURE WITH DIAGNOSIS OF REHABILITATION, AFTERCARE OR OTHER CONTACT WITH HEALTH SERVICES",23,FACTORS INFLUENCING HEALTH STATUS AND OTHER CONTACTS WITH HEALTH SERVICES,2,Moderate,Major,Surgical,Medicaid,,,,,N,92736.62,22923.01
Finger Lakes,Monroe,2701005,000413,Strong Memorial Hospital,50 to 69,145,F,White,Not Span/Hispanic,6,Emergency,Home w/ Home Health Services,2022,INJ045,"Traumatic brain injury (TBI); concussion, subsequent encounter",CNS004,INTRACRANIAL EPIDURAL AND SUBDURAL SPACE DRAINAGE,850,"PROCEDURE WITH DIAGNOSIS OF REHABILITATION, AFTERCARE OR OTHER CONTACT WITH HEALTH SERVICES",23,FACTORS INFLUENCING HEALTH STATUS AND OTHER CONTACTS WITH HEALTH SERVICES,3,Major,Moderate,Surgical,Private Health Insurance,,,,,Y,53182.75,27080.67
Long Island,Nassau,2951001,000541,North Shore University Hospital,50 to 69,113,F,White,Not Span/Hispanic,2,Elective,Home or Self Care,2022,MUS037,Postprocedural or postoperative musculoskeletal system complication,MST013,SPINE FUSION,850,"PROCEDURE WITH DIAGNOSIS OF REHABILITATION, AFTERCARE OR OTHER CONTACT WITH HEALTH SERVICES",23,FACTORS INFLUENCING HEALTH STATUS AND OTHER CONTACTS WITH HEALTH SERVICES,2,Moderate,Minor,Surgical,Medicaid,Medicaid,,,,N,92860.30,19346.58
Long Island,Nassau,2951001,000541,North Shore University Hospital,50 to 69,114,F,Black/African American,Not Span/Hispanic,6,Elective,Home w/ Home Health Services,2022,MUS037,Postprocedural or postoperative musculoskeletal system complication,MST013,SPINE FUSION,850,"PROCEDURE WITH DIAGNOSIS OF REHABILITATION, AFTERCARE OR OTHER CONTACT WITH HEALTH SERVICES",23,FACTORS INFLUENCING HEALTH STATUS AND OTHER CONTACTS WITH HEALTH SERVICES,2,Moderate,Minor,Surgical,Private Health Insurance,Medicare,Medicare,,,N,364727.99,80680.78
Long Island,Nassau,2951001,000541,North Shore University Hospital,50 to 69,110,F,Black/African American,Not Span/Hispanic,12,Elective,Skilled Nursing Home,2022,MUS037,Postprocedural or postoperative musculoskeletal system complication,PNS001,LUMBOSACRAL NERVE DECOMPRESSION,850,"PROCEDURE WITH DIAGNOSIS OF REHABILITATION, AFTERCARE OR OTHER CONTACT WITH HEALTH SERVICES",23,FACTORS INFLUENCING HEALTH STATUS AND OTHER CONTACTS WITH HEALTH SERVICES,3,Major,Moderate,Surgical,Medicaid,Medicaid,,,,N,391567.24,78999.32
Hudson Valley,Dutchess,1302001,000181,Vassar Brothers Medical Center,70 or Older,125,F,White,Not Span/Hispanic,7,Emergency,Skilled Nursing Home,2022,FAC010,Other aftercare encounter,MST007,HIP ARTHROPLASTY,850,"PROCEDURE WITH DIAGNOSIS OF REHABILITATION, AFTERCARE OR OTHER CONTACT WITH HEALTH SERVICES",23,FACTORS INFLUENCING HEALTH STATUS AND OTHER CONTACTS WITH HEALTH SERVICES,2,Moderate,Minor,Surgical,Miscellaneous/Other,,,,,Y,50905.66,19415.43
Hudson Valley,Dutchess,1302001,000181,Vassar Brothers Medical Center,50 to 69,125,F,White,Not Span/Hispanic,5,Elective,Home or Self Care,2022,MUS037,Postprocedural or postoperative musculoskeletal system complication,MST013,SPINE FUSION,850,"PROCEDURE WITH DIAGNOSIS OF REHABILITATION, AFTERCARE OR OTHER CONTACT WITH HEALTH SERVICES",23,FACTORS INFLUENCING HEALTH STATUS AND OTHER CONTACTS WITH HEALTH SERVICES,2,Moderate,Minor,Surgical,Medicare,Medicaid,,,,N,93616.65,45924.24
Hudson Valley,Dutchess,1302001,000181,Vassar Brothers Medical Center,70 or Older,125,F,White,Not Span/Hispanic,3,Emergency,Skilled Nursing Home,2022,NVS019,Nervous system pain and pain syndromes,MST012,BONE FIXATION (EXCLUDING EXTREMITIES),850,"PROCEDURE WITH DIAGNOSIS OF REHABILITATION, AFTERCARE OR OTHER CONTACT WITH HEALTH SERVICES",23,FACTORS INFLUENCING HEALTH STATUS AND OTHER CONTACTS WITH HEALTH SERVICES,2,Moderate,Minor,Surgical,Medicare,,,,,Y,52497.48,15621.27
New York City,Manhattan,7002053,001463,NYU Langone Hospitals,70 or Older,112,M,Other Race,Not Span/Hispanic,7,Elective,Home or Self Care,2022,FAC014,Medical examination/evaluation,MAM005,MEASUREMENT DURING CARDIAC CATHETERIZATION,850,"PROCEDURE WITH DIAGNOSIS OF REHABILITATION, AFTERCARE OR OTHER CONTACT WITH HEALTH SERVICES",23,FACTORS INFLUENCING HEALTH STATUS AND OTHER CONTACTS WITH HEALTH SERVICES,3,Major,Moderate,Surgical,Medicare,Medicaid,,,,N,436983.61,79291.20
New York City,Manhattan,7002053,001463,NYU Langone Hospitals,30 to 49,112,M,Black/African American,Unknown,3,Elective,Home or Self Care,2022,MUS037,Postprocedural or postoperative musculoskeletal system complication,MST013,SPINE FUSION,850,"PROCEDURE WITH DIAGNOSIS OF REHABILITATION, AFTERCARE OR OTHER CONTACT WITH HEALTH SERVICES",23,FACTORS INFLUENCING HEALTH STATUS AND OTHER CONTACTS WITH HEALTH SERVICES,2,Moderate,Minor,Surgical,Medicaid,,,,,N,423002.46,67401.76