Hospital Service Area,Hospital County,Operating Certificate Number,Permanent Facility Id,Facility Name,Age Group,Zip Code - 3 digits,Gender,Race,Ethnicity,Length of Stay,Type of Admission,Patient Disposition,Discharge Year,CCS Diagnosis Code,CCS Diagnosis Description,CCS Procedure Code,CCS Procedure Description,APR DRG Code,APR DRG Description,APR MDC Code,APR MDC Description,APR Severity of Illness Code,APR Severity of Illness Description,APR Risk of Mortality,APR Medical Surgical Description,Payment Typology 1,Payment Typology 2,Payment Typology 3,Birth Weight,Abortion Edit Indicator,Emergency Department Indicator,Total Charges,Total Costs
New York City,Manhattan,7002054,001464,New York-Presbyterian Hospital - Columbia Presbyterian Center,50 to 69,,F,Other Race,Spanish/Hispanic,5,Emergency,Home or Self Care,2022,INF012,COVID-19,ADM021,"ADMINISTRATION OF THERAPEUTIC SUBSTANCES, NEC",892,HIV WITH MAJOR HIV RELATED CONDITION,24,HUMAN IMMUNODEFICIENCY VIRUS INFECTIONS,4,Extreme,Extreme,Medical,Medicaid,,,,,Y,94823.57,23569.07
New York City,Manhattan,7002054,001464,New York-Presbyterian Hospital - Columbia Presbyterian Center,70 or Older,,M,Other Race,Spanish/Hispanic,4,Emergency,Home or Self Care,2022,GEN002,Acute and unspecified renal failure,ADM015,ADMINISTRATION OF ANTIBIOTICS,892,HIV WITH MAJOR HIV RELATED CONDITION,24,HUMAN IMMUNODEFICIENCY VIRUS INFECTIONS,2,Moderate,Moderate,Medical,Medicare,Medicaid,,,,Y,62084.72,13535.62
New York City,Manhattan,7002054,001464,New York-Presbyterian Hospital - Columbia Presbyterian Center,50 to 69,,M,Black/African American,Not Span/Hispanic,5,Emergency,Home or Self Care,2022,INF012,COVID-19,OTR004,ISOLATION PROCEDURES,892,HIV WITH MAJOR HIV RELATED CONDITION,24,HUMAN IMMUNODEFICIENCY VIRUS INFECTIONS,3,Major,Major,Medical,Medicaid,,,,,Y,84314.49,18431.44
New York City,Manhattan,7002054,001464,New York-Presbyterian Hospital - Columbia Presbyterian Center,50 to 69,,M,Black/African American,Not Span/Hispanic,8,Emergency,Left Against Medical Advice,2022,GEN002,Acute and unspecified renal failure,ADM017,ADMINISTRATION OF NUTRITIONAL AND ELECTROLYTIC SUBSTANCES,892,HIV WITH MAJOR HIV RELATED CONDITION,24,HUMAN IMMUNODEFICIENCY VIRUS INFECTIONS,2,Moderate,Major,Medical,Medicaid,,,,,Y,128289.51,28415.35
New York City,Manhattan,7002001,001438,Bellevue Hospital Center,50 to 69,,F,Black/African American,Unknown,7,Emergency,Home or Self Care,2022,INF006,HIV infection,ADM015,ADMINISTRATION OF ANTIBIOTICS,892,HIV WITH MAJOR HIV RELATED CONDITION,24,HUMAN IMMUNODEFICIENCY VIRUS INFECTIONS,3,Major,Major,Medical,Medicaid,,,,,Y,61891.28,35592.68
New York City,Manhattan,7002054,001464,New York-Presbyterian Hospital - Columbia Presbyterian Center,50 to 69,,F,Black/African American,Not Span/Hispanic,14,Emergency,Skilled Nursing Home,2022,INF012,COVID-19,ADM001,TRANSFUSION OF BLOOD AND BLOOD PRODUCTS,892,HIV WITH MAJOR HIV RELATED CONDITION,24,HUMAN IMMUNODEFICIENCY VIRUS INFECTIONS,3,Major,Major,Medical,Medicaid,,,,,Y,219843.51,50746.85
New York City,Manhattan,7002054,001464,New York-Presbyterian Hospital - Columbia Presbyterian Center,50 to 69,,F,White,Spanish/Hispanic,4,Emergency,Home or Self Care,2022,INF012,COVID-19,ADM019,POTENTIAL COVID-19 THERAPIES,892,HIV WITH MAJOR HIV RELATED CONDITION,24,HUMAN IMMUNODEFICIENCY VIRUS INFECTIONS,3,Major,Major,Medical,Self-Pay,,,,,Y,87335.28,20714.06
New York City,Manhattan,7002001,001438,Bellevue Hospital Center,50 to 69,,M,Other Race,Unknown,4,Emergency,Home or Self Care,2022,DIG001,Intestinal infection,ADM021,"ADMINISTRATION OF THERAPEUTIC SUBSTANCES, NEC",892,HIV WITH MAJOR HIV RELATED CONDITION,24,HUMAN IMMUNODEFICIENCY VIRUS INFECTIONS,2,Moderate,Moderate,Medical,Medicare,Medicaid,,,,Y,36330.42,20893.04
New York City,Manhattan,7002054,001464,New York-Presbyterian Hospital - Columbia Presbyterian Center,50 to 69,,M,Black/African American,Not Span/Hispanic,7,Emergency,Home or Self Care,2022,DIG001,Intestinal infection,,,892,HIV WITH MAJOR HIV RELATED CONDITION,24,HUMAN IMMUNODEFICIENCY VIRUS INFECTIONS,3,Major,Extreme,Medical,Medicaid,,,,,Y,115540.50,25216.09
New York City,Manhattan,7002054,001464,New York-Presbyterian Hospital - Columbia Presbyterian Center,30 to 49,,M,Other Race,Spanish/Hispanic,4,Emergency,Home or Self Care,2022,END008,Malnutrition,ADM001,TRANSFUSION OF BLOOD AND BLOOD PRODUCTS,892,HIV WITH MAJOR HIV RELATED CONDITION,24,HUMAN IMMUNODEFICIENCY VIRUS INFECTIONS,3,Major,Moderate,Medical,Medicaid,,,,,Y,88661.48,19776.04
New York City,Manhattan,7002001,001438,Bellevue Hospital Center,30 to 49,,M,Other Race,Unknown,4,Emergency,Home or Self Care,2022,NVS009,Epilepsy; convulsions,CNS002,LUMBAR PUNCTURE,892,HIV WITH MAJOR HIV RELATED CONDITION,24,HUMAN IMMUNODEFICIENCY VIRUS INFECTIONS,3,Major,Major,Medical,Medicaid,,,,,Y,36683.18,21095.91
New York City,Manhattan,7002054,001464,New York-Presbyterian Hospital - Columbia Presbyterian Center,50 to 69,,M,Black/African American,Not Span/Hispanic,5,Emergency,Home or Self Care,2022,INF006,HIV infection,SKB001,SKIN BIOPSY AND DIAGNOSTIC DRAINAGE,892,HIV WITH MAJOR HIV RELATED CONDITION,24,HUMAN IMMUNODEFICIENCY VIRUS INFECTIONS,3,Major,Moderate,Medical,Medicare,Medicaid,,,,Y,98825.32,22234.54
New York City,Manhattan,7002054,001464,New York-Presbyterian Hospital - Columbia Presbyterian Center,50 to 69,,M,Black/African American,Not Span/Hispanic,5,Emergency,Home or Self Care,2022,GEN002,Acute and unspecified renal failure,ADM017,ADMINISTRATION OF NUTRITIONAL AND ELECTROLYTIC SUBSTANCES,892,HIV WITH MAJOR HIV RELATED CONDITION,24,HUMAN IMMUNODEFICIENCY VIRUS INFECTIONS,2,Moderate,Major,Medical,Medicare,Medicaid,,,,Y,80174.44,17278.62
New York City,Manhattan,7002054,001464,New York-Presbyterian Hospital - Columbia Presbyterian Center,30 to 49,,F,White,Not Span/Hispanic,12,Emergency,Home or Self Care,2022,RSP011,"Pleurisy, pleural effusion and pulmonary collapse",GIS027,"UPPER GI THERAPEUTIC PROCEDURES, NEC (ENDOSCOPIC)",892,HIV WITH MAJOR HIV RELATED CONDITION,24,HUMAN IMMUNODEFICIENCY VIRUS INFECTIONS,4,Extreme,Major,Medical,Self-Pay,,,,,Y,208244.29,52356.67
New York City,Manhattan,7002054,001464,New York-Presbyterian Hospital - Columbia Presbyterian Center,70 or Older,,M,White,Not Span/Hispanic,6,Emergency,Home w/ Home Health Services,2022,INF002,Septicemia,,,892,HIV WITH MAJOR HIV RELATED CONDITION,24,HUMAN IMMUNODEFICIENCY VIRUS INFECTIONS,4,Extreme,Major,Medical,Private Health Insurance,Medicare,,,,Y,109769.97,24423.78
New York City,Manhattan,7002054,001464,New York-Presbyterian Hospital - Columbia Presbyterian Center,50 to 69,,M,Black/African American,Not Span/Hispanic,9,Emergency,Left Against Medical Advice,2022,GEN002,Acute and unspecified renal failure,,,892,HIV WITH MAJOR HIV RELATED CONDITION,24,HUMAN IMMUNODEFICIENCY VIRUS INFECTIONS,3,Major,Moderate,Medical,Medicaid,,,,,Y,136088.36,28974.53
New York City,Manhattan,7002001,001438,Bellevue Hospital Center,30 to 49,,M,Other Race,Spanish/Hispanic,120 +,Urgent,Home or Self Care,2022,INF006,HIV infection,ADM021,"ADMINISTRATION OF THERAPEUTIC SUBSTANCES, NEC",892,HIV WITH MAJOR HIV RELATED CONDITION,24,HUMAN IMMUNODEFICIENCY VIRUS INFECTIONS,2,Moderate,Minor,Medical,Medicaid,,,,,N,1285276.09,739141.71
New York City,Manhattan,7002053,001463,NYU Langone Hospitals,30 to 49,,M,Other Race,Spanish/Hispanic,9,Emergency,Skilled Nursing Home,2022,INF006,HIV infection,,,892,HIV WITH MAJOR HIV RELATED CONDITION,24,HUMAN IMMUNODEFICIENCY VIRUS INFECTIONS,3,Major,Moderate,Medical,Medicaid,,,,,Y,144110.48,45080.13
New York City,Manhattan,7002001,001438,Bellevue Hospital Center,50 to 69,,F,Black/African American,Not Span/Hispanic,19,Emergency,Home or Self Care,2022,END011,Fluid and electrolyte disorders,IMG007,COMPUTERIZED TOMOGRAPHY (CT) WITHOUT CONTRAST,892,HIV WITH MAJOR HIV RELATED CONDITION,24,HUMAN IMMUNODEFICIENCY VIRUS INFECTIONS,3,Major,Moderate,Medical,Medicaid,,,,,Y,148769.04,85554.69
New York City,Manhattan,7002054,001464,New York-Presbyterian Hospital - Columbia Presbyterian Center,18 to 29,,M,Other Race,Unknown,5,Emergency,Home or Self Care,2022,INF006,HIV infection,ADM017,ADMINISTRATION OF NUTRITIONAL AND ELECTROLYTIC SUBSTANCES,892,HIV WITH MAJOR HIV RELATED CONDITION,24,HUMAN IMMUNODEFICIENCY VIRUS INFECTIONS,3,Major,Major,Medical,Medicaid,,,,,Y,79971.37,16888.52
New York City,Manhattan,7002053,001463,NYU Langone Hospitals,50 to 69,,M,Black/African American,Not Span/Hispanic,7,Emergency,Home or Self Care,2022,INF006,HIV infection,OTR004,ISOLATION PROCEDURES,892,HIV WITH MAJOR HIV RELATED CONDITION,24,HUMAN IMMUNODEFICIENCY VIRUS INFECTIONS,4,Extreme,Major,Medical,Medicaid,,,,,Y,130690.02,37722.87
New York City,Manhattan,7002054,001464,New York-Presbyterian Hospital - Columbia Presbyterian Center,50 to 69,,M,Other Race,Unknown,20,Emergency,Home or Self Care,2022,INF006,HIV infection,CNS002,LUMBAR PUNCTURE,892,HIV WITH MAJOR HIV RELATED CONDITION,24,HUMAN IMMUNODEFICIENCY VIRUS INFECTIONS,3,Major,Major,Medical,Medicaid,,,,,Y,288831.54,62697.10
Long Island,Nassau,2951001,000541,North Shore University Hospital,50 to 69,,M,Black/African American,Not Span/Hispanic,2,Emergency,Home w/ Home Health Services,2022,GEN002,Acute and unspecified renal failure,,,892,HIV WITH MAJOR HIV RELATED CONDITION,24,HUMAN IMMUNODEFICIENCY VIRUS INFECTIONS,3,Major,Major,Medical,Medicare,Medicare,Medicaid,,,Y,32997.31,5583.07
Long Island,Nassau,2951001,000541,North Shore University Hospital,30 to 49,,M,Black/African American,Not Span/Hispanic,10,Emergency,Home w/ Home Health Services,2022,INF006,HIV infection,ADM001,TRANSFUSION OF BLOOD AND BLOOD PRODUCTS,892,HIV WITH MAJOR HIV RELATED CONDITION,24,HUMAN IMMUNODEFICIENCY VIRUS INFECTIONS,3,Major,Major,Medical,Medicaid,Medicaid,,,,Y,163325.61,25545.72
Long Island,Nassau,2951001,000541,North Shore University Hospital,50 to 69,,F,Black/African American,Not Span/Hispanic,21,Emergency,Home or Self Care,2022,INF006,HIV infection,OTR004,ISOLATION PROCEDURES,892,HIV WITH MAJOR HIV RELATED CONDITION,24,HUMAN IMMUNODEFICIENCY VIRUS INFECTIONS,2,Moderate,Moderate,Medical,Blue Cross/Blue Shield,,,,,Y,278155.67,51722.85
Long Island,Nassau,2951001,000541,North Shore University Hospital,30 to 49,,M,Black/African American,Not Span/Hispanic,18,Emergency,Skilled Nursing Home,2022,INF006,HIV infection,CNS002,LUMBAR PUNCTURE,892,HIV WITH MAJOR HIV RELATED CONDITION,24,HUMAN IMMUNODEFICIENCY VIRUS INFECTIONS,4,Extreme,Extreme,Medical,Medicaid,Medicaid,,,,Y,264197.31,42683.31
Long Island,Nassau,2951001,000541,North Shore University Hospital,30 to 49,,F,Black/African American,Not Span/Hispanic,5,Emergency,Home or Self Care,2022,INF002,Septicemia,ADM019,POTENTIAL COVID-19 THERAPIES,892,HIV WITH MAJOR HIV RELATED CONDITION,24,HUMAN IMMUNODEFICIENCY VIRUS INFECTIONS,4,Extreme,Extreme,Medical,Medicaid,,,,,Y,105034.46,17844.61
Long Island,Nassau,2951001,000541,North Shore University Hospital,50 to 69,,M,White,Not Span/Hispanic,2,Emergency,Home or Self Care,2022,END011,Fluid and electrolyte disorders,,,892,HIV WITH MAJOR HIV RELATED CONDITION,24,HUMAN IMMUNODEFICIENCY VIRUS INFECTIONS,3,Major,Moderate,Medical,Blue Cross/Blue Shield,,,,,Y,42489.33,7450.51
New York City,Manhattan,7002053,001463,NYU Langone Hospitals,30 to 49,,M,White,Not Span/Hispanic,3,Emergency,Home w/ Home Health Services,2022,CIR020,Cerebral infarction,CNS002,LUMBAR PUNCTURE,892,HIV WITH MAJOR HIV RELATED CONDITION,24,HUMAN IMMUNODEFICIENCY VIRUS INFECTIONS,3,Major,Extreme,Medical,Medicaid,,,,,Y,153795.96,30091.16
New York City,Manhattan,7002054,001464,New York-Presbyterian Hospital - Columbia Presbyterian Center,50 to 69,,F,Black/African American,Not Span/Hispanic,9,Emergency,Skilled Nursing Home,2022,INF006,HIV infection,ADM015,ADMINISTRATION OF ANTIBIOTICS,892,HIV WITH MAJOR HIV RELATED CONDITION,24,HUMAN IMMUNODEFICIENCY VIRUS INFECTIONS,2,Moderate,Moderate,Medical,Medicare,Medicaid,,,,Y,130488.04,29474.90
New York City,Manhattan,7002054,001464,New York-Presbyterian Hospital - Columbia Presbyterian Center,70 or Older,,M,Black/African American,Not Span/Hispanic,2,Emergency,Home w/ Home Health Services,2022,GEN002,Acute and unspecified renal failure,,,892,HIV WITH MAJOR HIV RELATED CONDITION,24,HUMAN IMMUNODEFICIENCY VIRUS INFECTIONS,3,Major,Major,Medical,Medicare,Medicaid,,,,Y,45927.79,9874.80
New York City,Manhattan,7002001,001438,Bellevue Hospital Center,30 to 49,,M,Black/African American,Unknown,2,Emergency,Home or Self Care,2022,INF006,HIV infection,ADM015,ADMINISTRATION OF ANTIBIOTICS,892,HIV WITH MAJOR HIV RELATED CONDITION,24,HUMAN IMMUNODEFICIENCY VIRUS INFECTIONS,3,Major,Moderate,Medical,Medicare,Medicaid,,,,Y,24567.48,14128.36
Hudson Valley,Dutchess,1302001,000181,Vassar Brothers Medical Center,70 or Older,,M,White,Not Span/Hispanic,2,Emergency,Home or Self Care,2022,INF012,COVID-19,ADM019,POTENTIAL COVID-19 THERAPIES,892,HIV WITH MAJOR HIV RELATED CONDITION,24,HUMAN IMMUNODEFICIENCY VIRUS INFECTIONS,4,Extreme,Extreme,Medical,Medicare,Private Health Insurance,,,,Y,15907.48,4601.21
Hudson Valley,Dutchess,1302001,000181,Vassar Brothers Medical Center,70 or Older,,M,White,Not Span/Hispanic,4,Emergency,Home or Self Care,2022,INF012,COVID-19,ADM019,POTENTIAL COVID-19 THERAPIES,892,HIV WITH MAJOR HIV RELATED CONDITION,24,HUMAN IMMUNODEFICIENCY VIRUS INFECTIONS,4,Extreme,Extreme,Medical,Private Health Insurance,,,,,Y,26370.29,8299.33
Capital/Adirond,Warren,5601000,001005,Glens Falls Hospital,50 to 69,,M,White,Not Span/Hispanic,8,Emergency,Home or Self Care,2022,RSP012,Respiratory failure; insufficiency; arrest,,,892,HIV WITH MAJOR HIV RELATED CONDITION,24,HUMAN IMMUNODEFICIENCY VIRUS INFECTIONS,3,Major,Major,Medical,Medicare,Medicaid,,,,Y,49636.88,18699.31
New York City,Manhattan,7002053,001463,NYU Langone Hospitals,50 to 69,,M,Black/African American,Not Span/Hispanic,2,Emergency,Home or Self Care,2022,RSP002,Pneumonia (except that caused by tuberculosis),,,892,HIV WITH MAJOR HIV RELATED CONDITION,24,HUMAN IMMUNODEFICIENCY VIRUS INFECTIONS,2,Moderate,Minor,Medical,Private Health Insurance,,,,,Y,38520.40,13209.51
New York City,Manhattan,7002054,001464,New York-Presbyterian Hospital - Columbia Presbyterian Center,50 to 69,,F,Other Race,Unknown,6,Emergency,Home or Self Care,2022,INF006,HIV infection,,,892,HIV WITH MAJOR HIV RELATED CONDITION,24,HUMAN IMMUNODEFICIENCY VIRUS INFECTIONS,3,Major,Major,Medical,Medicare,Medicaid,,,,Y,106172.10,22658.17
New York City,Manhattan,7002001,001438,Bellevue Hospital Center,30 to 49,,M,Other Race,Spanish/Hispanic,1,Emergency,Home or Self Care,2022,DIG001,Intestinal infection,ADM021,"ADMINISTRATION OF THERAPEUTIC SUBSTANCES, NEC",892,HIV WITH MAJOR HIV RELATED CONDITION,24,HUMAN IMMUNODEFICIENCY VIRUS INFECTIONS,2,Moderate,Moderate,Medical,Medicaid,,,,,Y,12129.05,6975.22
New York City,Manhattan,7002001,001438,Bellevue Hospital Center,30 to 49,,M,Black/African American,Unknown,16,Emergency,Home or Self Care,2022,MBD001,Schizophrenia spectrum and other psychotic disorders,MHT001,PHARMACOTHERAPY FOR MENTAL HEALTH (EXCLUDING SUBSTANCE USE),892,HIV WITH MAJOR HIV RELATED CONDITION,24,HUMAN IMMUNODEFICIENCY VIRUS INFECTIONS,3,Major,Major,Medical,Medicaid,,,,,Y,74986.46,43123.51
New York City,Manhattan,7002001,001438,Bellevue Hospital Center,18 to 29,,M,Black/African American,Not Span/Hispanic,12,Emergency,Home or Self Care,2022,MBD001,Schizophrenia spectrum and other psychotic disorders,MHT002,PSYCHOTHERAPY FOR MENTAL HEALTH (EXCLUDING SUBSTANCE USE),892,HIV WITH MAJOR HIV RELATED CONDITION,24,HUMAN IMMUNODEFICIENCY VIRUS INFECTIONS,2,Moderate,Minor,Medical,Medicaid,,,,,Y,50282.40,28916.60
Finger Lakes,Monroe,2701005,000413,Strong Memorial Hospital,50 to 69,,F,Black/African American,Not Span/Hispanic,1,Emergency,Home or Self Care,2022,DIG001,Intestinal infection,,,892,HIV WITH MAJOR HIV RELATED CONDITION,24,HUMAN IMMUNODEFICIENCY VIRUS INFECTIONS,3,Major,Major,Medical,Medicaid,,,,,Y,7542.47,2703.31
New York City,Manhattan,7002001,001438,Bellevue Hospital Center,30 to 49,,F,Black/African American,Not Span/Hispanic,1,Emergency,Home or Self Care,2022,MBD001,Schizophrenia spectrum and other psychotic disorders,MHT001,PHARMACOTHERAPY FOR MENTAL HEALTH (EXCLUDING SUBSTANCE USE),892,HIV WITH MAJOR HIV RELATED CONDITION,24,HUMAN IMMUNODEFICIENCY VIRUS INFECTIONS,2,Moderate,Minor,Medical,Medicaid,,,,,Y,10445.49,6007.03
New York City,Manhattan,7002001,001438,Bellevue Hospital Center,50 to 69,,M,Black/African American,Unknown,6,Emergency,Home or Self Care,2022,GEN002,Acute and unspecified renal failure,ADM021,"ADMINISTRATION OF THERAPEUTIC SUBSTANCES, NEC",892,HIV WITH MAJOR HIV RELATED CONDITION,24,HUMAN IMMUNODEFICIENCY VIRUS INFECTIONS,3,Major,Major,Medical,Private Health Insurance,Medicaid,,,,Y,50829.21,29231.07
New York City,Manhattan,7002054,001464,New York-Presbyterian Hospital - Columbia Presbyterian Center,50 to 69,,F,Black/African American,Not Span/Hispanic,5,Emergency,Home w/ Home Health Services,2022,CIR020,Cerebral infarction,,,892,HIV WITH MAJOR HIV RELATED CONDITION,24,HUMAN IMMUNODEFICIENCY VIRUS INFECTIONS,3,Major,Major,Medical,Medicaid,,,,,Y,83049.64,18156.92
New York City,Manhattan,7002054,001464,New York-Presbyterian Hospital - Columbia Presbyterian Center,70 or Older,,M,Black/African American,Not Span/Hispanic,12,Emergency,Home or Self Care,2022,CIR020,Cerebral infarction,ADM017,ADMINISTRATION OF NUTRITIONAL AND ELECTROLYTIC SUBSTANCES,892,HIV WITH MAJOR HIV RELATED CONDITION,24,HUMAN IMMUNODEFICIENCY VIRUS INFECTIONS,3,Major,Extreme,Medical,Medicare,Medicaid,,,,Y,247246.67,74890.01
New York City,Manhattan,7002054,001464,New York-Presbyterian Hospital - Columbia Presbyterian Center,30 to 49,,M,Black/African American,Not Span/Hispanic,1,Emergency,Home or Self Care,2022,INF003,Bacterial infections,,,892,HIV WITH MAJOR HIV RELATED CONDITION,24,HUMAN IMMUNODEFICIENCY VIRUS INFECTIONS,1,Minor,Minor,Medical,Medicaid,,,,,Y,19793.99,4150.48
New York City,Manhattan,7002001,001438,Bellevue Hospital Center,50 to 69,,M,Black/African American,Unknown,12,Emergency,Skilled Nursing Home,2022,GEN002,Acute and unspecified renal failure,GIS002,COLONOSCOPY AND PROCTOSCOPY WITH BIOPSY,892,HIV WITH MAJOR HIV RELATED CONDITION,24,HUMAN IMMUNODEFICIENCY VIRUS INFECTIONS,3,Major,Major,Medical,Medicare,Medicaid,,,,Y,122167.29,70256.45
Finger Lakes,Monroe,2701005,000413,Strong Memorial Hospital,50 to 69,,M,White,Not Span/Hispanic,1,Emergency,Home or Self Care,2022,RSP002,Pneumonia (except that caused by tuberculosis),,,892,HIV WITH MAJOR HIV RELATED CONDITION,24,HUMAN IMMUNODEFICIENCY VIRUS INFECTIONS,2,Moderate,Minor,Medical,Medicare,,,,,Y,6695.03,2457.97
New York City,Manhattan,7002001,001438,Bellevue Hospital Center,30 to 49,,F,Black/African American,Not Span/Hispanic,18,Urgent,Psychiatric Hospital or Unit of Hosp,2022,INF001,Tuberculosis,ADM021,"ADMINISTRATION OF THERAPEUTIC SUBSTANCES, NEC",892,HIV WITH MAJOR HIV RELATED CONDITION,24,HUMAN IMMUNODEFICIENCY VIRUS INFECTIONS,2,Moderate,Minor,Medical,Medicaid,,,,,N,120870.05,69510.43
New York City,Manhattan,7002054,001464,New York-Presbyterian Hospital - Columbia Presbyterian Center,30 to 49,,M,Black/African American,Unknown,1,Emergency,Left Against Medical Advice,2022,INF006,HIV infection,ADM015,ADMINISTRATION OF ANTIBIOTICS,892,HIV WITH MAJOR HIV RELATED CONDITION,24,HUMAN IMMUNODEFICIENCY VIRUS INFECTIONS,3,Major,Moderate,Medical,Medicaid,,,,,Y,25822.84,5061.40
Long Island,Nassau,2951001,000541,North Shore University Hospital,30 to 49,,F,White,Spanish/Hispanic,2,Emergency,Home or Self Care,2022,DIG022,Noninfectious gastroenteritis,,,892,HIV WITH MAJOR HIV RELATED CONDITION,24,HUMAN IMMUNODEFICIENCY VIRUS INFECTIONS,2,Moderate,Major,Medical,Medicaid,Medicaid,,,,Y,43686.76,6874.29
Long Island,Nassau,2951001,000541,North Shore University Hospital,50 to 69,,F,Black/African American,Not Span/Hispanic,3,Emergency,Home or Self Care,2022,INF002,Septicemia,,,892,HIV WITH MAJOR HIV RELATED CONDITION,24,HUMAN IMMUNODEFICIENCY VIRUS INFECTIONS,3,Major,Moderate,Medical,Medicare,Private Health Insurance,,,,Y,44828.15,7098.04
Hudson Valley,Dutchess,1302001,000181,Vassar Brothers Medical Center,70 or Older,,M,Other Race,Not Span/Hispanic,11,Emergency,Skilled Nursing Home,2022,BLD001,Nutritional anemia,ESA003,MECHANICAL VENTILATION,892,HIV WITH MAJOR HIV RELATED CONDITION,24,HUMAN IMMUNODEFICIENCY VIRUS INFECTIONS,3,Major,Extreme,Medical,Medicare,Blue Cross/Blue Shield,Medicaid,,,Y,107048.39,30179.99
New York City,Manhattan,7002053,001463,NYU Langone Hospitals,50 to 69,,M,White,Not Span/Hispanic,11,Emergency,Home w/ Home Health Services,2022,INF006,HIV infection,CNS002,LUMBAR PUNCTURE,892,HIV WITH MAJOR HIV RELATED CONDITION,24,HUMAN IMMUNODEFICIENCY VIRUS INFECTIONS,3,Major,Major,Medical,Medicaid,,,,,Y,245586.18,62640.50
New York City,Manhattan,7002053,001463,NYU Langone Hospitals,70 or Older,,M,Other Race,Not Span/Hispanic,2,Emergency,Home w/ Home Health Services,2022,INF006,HIV infection,CNS002,LUMBAR PUNCTURE,892,HIV WITH MAJOR HIV RELATED CONDITION,24,HUMAN IMMUNODEFICIENCY VIRUS INFECTIONS,2,Moderate,Moderate,Medical,Medicare,Blue Cross/Blue Shield,,,,Y,67057.52,13623.07
New York City,Manhattan,7002053,001463,NYU Langone Hospitals,30 to 49,,M,White,Not Span/Hispanic,3,Emergency,Home or Self Care,2022,NVS020,Other nervous system disorders (neither hereditary nor degenerative),CNS002,LUMBAR PUNCTURE,892,HIV WITH MAJOR HIV RELATED CONDITION,24,HUMAN IMMUNODEFICIENCY VIRUS INFECTIONS,3,Major,Moderate,Medical,Blue Cross/Blue Shield,,,,,Y,101603.00,18535.51
New York City,Manhattan,7002053,001463,NYU Langone Hospitals,30 to 49,,M,Black/African American,Not Span/Hispanic,8,Emergency,Home or Self Care,2022,NVS017,Nerve and nerve root disorders,,,892,HIV WITH MAJOR HIV RELATED CONDITION,24,HUMAN IMMUNODEFICIENCY VIRUS INFECTIONS,3,Major,Moderate,Medical,Medicaid,,,,,Y,105064.85,38175.73
New York City,Manhattan,7002054,001464,New York-Presbyterian Hospital - Columbia Presbyterian Center,30 to 49,,F,Black/African American,Not Span/Hispanic,12,Emergency,Skilled Nursing Home,2022,RSP002,Pneumonia (except that caused by tuberculosis),,,892,HIV WITH MAJOR HIV RELATED CONDITION,24,HUMAN IMMUNODEFICIENCY VIRUS INFECTIONS,3,Major,Moderate,Medical,Medicaid,,,,,Y,165914.64,36549.97
New York City,Manhattan,7002054,001464,New York-Presbyterian Hospital - Columbia Presbyterian Center,30 to 49,,M,Black/African American,Not Span/Hispanic,2,Emergency,Home or Self Care,2022,INF012,COVID-19,ADM019,POTENTIAL COVID-19 THERAPIES,892,HIV WITH MAJOR HIV RELATED CONDITION,24,HUMAN IMMUNODEFICIENCY VIRUS INFECTIONS,3,Major,Major,Medical,Medicaid,,,,,Y,59313.05,13865.07
New York City,Manhattan,7002054,001464,New York-Presbyterian Hospital - Columbia Presbyterian Center,50 to 69,,M,Other Race,Unknown,1,Emergency,Home or Self Care,2022,RSP012,Respiratory failure; insufficiency; arrest,ESA004,NON-INVASIVE VENTILATION,892,HIV WITH MAJOR HIV RELATED CONDITION,24,HUMAN IMMUNODEFICIENCY VIRUS INFECTIONS,3,Major,Major,Medical,Medicare,Medicaid,,,,Y,36585.34,7525.24
New York City,Manhattan,7002053,001463,NYU Langone Hospitals,30 to 49,,F,Black/African American,Not Span/Hispanic,13,Emergency,Home w/ Home Health Services,2022,NEO058,Non-Hodgkin lymphoma,,,892,HIV WITH MAJOR HIV RELATED CONDITION,24,HUMAN IMMUNODEFICIENCY VIRUS INFECTIONS,3,Major,Major,Medical,Private Health Insurance,Medicaid,,,,Y,255460.20,74454.45
New York City,Manhattan,7002054,001464,New York-Presbyterian Hospital - Columbia Presbyterian Center,30 to 49,,M,Black/African American,Not Span/Hispanic,1,Emergency,Left Against Medical Advice,2022,CIR004,Endocarditis and endocardial disease,ADM015,ADMINISTRATION OF ANTIBIOTICS,892,HIV WITH MAJOR HIV RELATED CONDITION,24,HUMAN IMMUNODEFICIENCY VIRUS INFECTIONS,2,Moderate,Minor,Medical,Medicaid,,,,,Y,29233.83,6115.09