Hospital Service Area,Hospital County,Operating Certificate Number,Permanent Facility Id,Facility Name,Age Group,Zip Code - 3 digits,Gender,Race,Ethnicity,Length of Stay,Type of Admission,Patient Disposition,Discharge Year,CCS Diagnosis Code,CCS Diagnosis Description,CCS Procedure Code,CCS Procedure Description,APR DRG Code,APR DRG Description,APR MDC Code,APR MDC Description,APR Severity of Illness Code,APR Severity of Illness Description,APR Risk of Mortality,APR Medical Surgical Description,Payment Typology 1,Payment Typology 2,Payment Typology 3,Birth Weight,Abortion Edit Indicator,Emergency Department Indicator,Total Charges,Total Costs
New York City,Manhattan,7002054,001464,New York-Presbyterian Hospital - Columbia Presbyterian Center,70 or Older,,M,Black/African American,Not Span/Hispanic,2,Emergency,Left Against Medical Advice,2022,INF012,COVID-19,OTR004,ISOLATION PROCEDURES,894,HIV WITH ONE SIGNIFICANT HIV CONDITION OR WITHOUT SIGNIFICANT RELATED CONDITIONS,24,HUMAN IMMUNODEFICIENCY VIRUS INFECTIONS,3,Major,Moderate,Medical,Medicare,Medicaid,,,,Y,38805.72,9611.24
New York City,Manhattan,7002054,001464,New York-Presbyterian Hospital - Columbia Presbyterian Center,30 to 49,,M,Other Race,Spanish/Hispanic,1,Emergency,Home or Self Care,2022,INF012,COVID-19,OTR004,ISOLATION PROCEDURES,894,HIV WITH ONE SIGNIFICANT HIV CONDITION OR WITHOUT SIGNIFICANT RELATED CONDITIONS,24,HUMAN IMMUNODEFICIENCY VIRUS INFECTIONS,3,Major,Moderate,Medical,Medicaid,,,,,Y,26590.54,5566.10
New York City,Manhattan,7002054,001464,New York-Presbyterian Hospital - Columbia Presbyterian Center,50 to 69,,M,Black/African American,Not Span/Hispanic,7,Emergency,Home or Self Care,2022,INF012,COVID-19,OTR004,ISOLATION PROCEDURES,894,HIV WITH ONE SIGNIFICANT HIV CONDITION OR WITHOUT SIGNIFICANT RELATED CONDITIONS,24,HUMAN IMMUNODEFICIENCY VIRUS INFECTIONS,3,Major,Moderate,Medical,Medicaid,,,,,Y,110902.66,26019.46
New York City,Manhattan,7002054,001464,New York-Presbyterian Hospital - Columbia Presbyterian Center,30 to 49,,M,Other Race,Spanish/Hispanic,2,Emergency,Home or Self Care,2022,INF012,COVID-19,OTR004,ISOLATION PROCEDURES,894,HIV WITH ONE SIGNIFICANT HIV CONDITION OR WITHOUT SIGNIFICANT RELATED CONDITIONS,24,HUMAN IMMUNODEFICIENCY VIRUS INFECTIONS,3,Major,Major,Medical,Medicaid,,,,,Y,42329.45,10429.97
New York City,Manhattan,7002054,001464,New York-Presbyterian Hospital - Columbia Presbyterian Center,30 to 49,,F,Other Race,Spanish/Hispanic,1,Emergency,Home or Self Care,2022,BLD001,Nutritional anemia,ADM001,TRANSFUSION OF BLOOD AND BLOOD PRODUCTS,894,HIV WITH ONE SIGNIFICANT HIV CONDITION OR WITHOUT SIGNIFICANT RELATED CONDITIONS,24,HUMAN IMMUNODEFICIENCY VIRUS INFECTIONS,2,Moderate,Minor,Medical,Medicaid,,,,,Y,25238.82,
Finger Lakes,Monroe,2701005,000413,Strong Memorial Hospital,30 to 49,,M,Black/African American,Not Span/Hispanic,10,Emergency,Home w/ Home Health Services,2022,INF006,HIV infection,SKB001,SKIN BIOPSY AND DIAGNOSTIC DRAINAGE,894,HIV WITH ONE SIGNIFICANT HIV CONDITION OR WITHOUT SIGNIFICANT RELATED CONDITIONS,24,HUMAN IMMUNODEFICIENCY VIRUS INFECTIONS,2,Moderate,Moderate,Medical,Federal/State/Local/VA,,,,,Y,36481.55,16438.78
New York City,Manhattan,7002053,001463,NYU Langone Hospitals,50 to 69,,F,Other Race,Not Span/Hispanic,2,Emergency,Home or Self Care,2022,INF006,HIV infection,OTR004,ISOLATION PROCEDURES,894,HIV WITH ONE SIGNIFICANT HIV CONDITION OR WITHOUT SIGNIFICANT RELATED CONDITIONS,24,HUMAN IMMUNODEFICIENCY VIRUS INFECTIONS,3,Major,Minor,Medical,Medicaid,,,,,Y,28362.01,10305.65
New York City,Manhattan,7002001,001438,Bellevue Hospital Center,30 to 49,,M,Other Race,Spanish/Hispanic,2,Emergency,Home or Self Care,2022,RSP002,Pneumonia (except that caused by tuberculosis),ADM015,ADMINISTRATION OF ANTIBIOTICS,894,HIV WITH ONE SIGNIFICANT HIV CONDITION OR WITHOUT SIGNIFICANT RELATED CONDITIONS,24,HUMAN IMMUNODEFICIENCY VIRUS INFECTIONS,2,Moderate,Minor,Medical,Self-Pay,,,,,Y,20854.15,11992.89
New York City,Manhattan,7002054,001464,New York-Presbyterian Hospital - Columbia Presbyterian Center,30 to 49,,M,Black/African American,Spanish/Hispanic,1,Emergency,Home or Self Care,2022,SKN001,Skin and subcutaneous tissue infections,SKB002,INCISION AND DRAINAGE OF SKIN,894,HIV WITH ONE SIGNIFICANT HIV CONDITION OR WITHOUT SIGNIFICANT RELATED CONDITIONS,24,HUMAN IMMUNODEFICIENCY VIRUS INFECTIONS,1,Minor,Minor,Medical,Medicaid,,,,,Y,19768.33,4069.26
New York City,Manhattan,7002001,001438,Bellevue Hospital Center,50 to 69,,M,Black/African American,Not Span/Hispanic,11,Emergency,Court/Law Enforcement,2022,SKN001,Skin and subcutaneous tissue infections,ADM015,ADMINISTRATION OF ANTIBIOTICS,894,HIV WITH ONE SIGNIFICANT HIV CONDITION OR WITHOUT SIGNIFICANT RELATED CONDITIONS,24,HUMAN IMMUNODEFICIENCY VIRUS INFECTIONS,3,Major,Moderate,Medical,Medicaid,,,,,Y,97365.77,55993.50
New York City,Manhattan,7002053,001463,NYU Langone Hospitals,30 to 49,,M,Other Race,Not Span/Hispanic,6,Emergency,Home or Self Care,2022,INF010,Sexually transmitted infections (excluding HIV and hepatitis),CNS002,LUMBAR PUNCTURE,894,HIV WITH ONE SIGNIFICANT HIV CONDITION OR WITHOUT SIGNIFICANT RELATED CONDITIONS,24,HUMAN IMMUNODEFICIENCY VIRUS INFECTIONS,2,Moderate,Minor,Medical,Medicare,,,,,Y,104199.88,31741.06
New York City,Manhattan,7002054,001464,New York-Presbyterian Hospital - Columbia Presbyterian Center,30 to 49,,M,Multi-racial,Spanish/Hispanic,3,Emergency,Home or Self Care,2022,SKN001,Skin and subcutaneous tissue infections,,,894,HIV WITH ONE SIGNIFICANT HIV CONDITION OR WITHOUT SIGNIFICANT RELATED CONDITIONS,24,HUMAN IMMUNODEFICIENCY VIRUS INFECTIONS,2,Moderate,Moderate,Medical,Medicaid,,,,,Y,50402.28,11162.94
New York City,Manhattan,7002001,001438,Bellevue Hospital Center,50 to 69,,M,Black/African American,Not Span/Hispanic,2,Emergency,Home or Self Care,2022,SKN001,Skin and subcutaneous tissue infections,ADM015,ADMINISTRATION OF ANTIBIOTICS,894,HIV WITH ONE SIGNIFICANT HIV CONDITION OR WITHOUT SIGNIFICANT RELATED CONDITIONS,24,HUMAN IMMUNODEFICIENCY VIRUS INFECTIONS,2,Moderate,Minor,Medical,Medicaid,,,,,Y,18931.22,10887.04
Long Island,Nassau,2951001,000541,North Shore University Hospital,30 to 49,,M,White,Spanish/Hispanic,5,Emergency,Home or Self Care,2022,INF006,HIV infection,ADM010,VACCINATIONS,894,HIV WITH ONE SIGNIFICANT HIV CONDITION OR WITHOUT SIGNIFICANT RELATED CONDITIONS,24,HUMAN IMMUNODEFICIENCY VIRUS INFECTIONS,2,Moderate,Moderate,Medical,Medicaid,,,,,Y,92877.03,14118.13
New York City,Manhattan,7002001,001438,Bellevue Hospital Center,50 to 69,,F,Other Race,Not Span/Hispanic,7,Elective,Home or Self Care,2022,INF006,HIV infection,ADM021,"ADMINISTRATION OF THERAPEUTIC SUBSTANCES, NEC",894,HIV WITH ONE SIGNIFICANT HIV CONDITION OR WITHOUT SIGNIFICANT RELATED CONDITIONS,24,HUMAN IMMUNODEFICIENCY VIRUS INFECTIONS,2,Moderate,Minor,Medical,Medicaid,,,,,N,31329.61,18017.16
New York City,Manhattan,7002054,001464,New York-Presbyterian Hospital - Columbia Presbyterian Center,30 to 49,,M,Black/African American,Not Span/Hispanic,2,Emergency,Home or Self Care,2022,INF006,HIV infection,IMG008,ULTRASONOGRAPHY,894,HIV WITH ONE SIGNIFICANT HIV CONDITION OR WITHOUT SIGNIFICANT RELATED CONDITIONS,24,HUMAN IMMUNODEFICIENCY VIRUS INFECTIONS,2,Moderate,Moderate,Medical,Medicaid,,,,,Y,34488.55,7502.57
Hudson Valley,Dutchess,1302001,000181,Vassar Brothers Medical Center,30 to 49,,M,White,Not Span/Hispanic,3,Emergency,Home or Self Care,2022,BLD006,Coagulation and hemorrhagic disorders,,,894,HIV WITH ONE SIGNIFICANT HIV CONDITION OR WITHOUT SIGNIFICANT RELATED CONDITIONS,24,HUMAN IMMUNODEFICIENCY VIRUS INFECTIONS,2,Moderate,Moderate,Medical,"Managed Care, Unspecified",,,,,Y,69585.07,17779.66
New York City,Manhattan,7002001,001438,Bellevue Hospital Center,30 to 49,,M,Other Race,Not Span/Hispanic,1,Emergency,Left Against Medical Advice,2022,INF006,HIV infection,ADM001,TRANSFUSION OF BLOOD AND BLOOD PRODUCTS,894,HIV WITH ONE SIGNIFICANT HIV CONDITION OR WITHOUT SIGNIFICANT RELATED CONDITIONS,24,HUMAN IMMUNODEFICIENCY VIRUS INFECTIONS,2,Moderate,Minor,Medical,Medicaid,,,,,Y,16835.62,9681.90
New York City,Manhattan,7002053,001463,NYU Langone Hospitals,30 to 49,,M,Other Race,Spanish/Hispanic,1,Emergency,Left Against Medical Advice,2022,DIG001,Intestinal infection,OTR004,ISOLATION PROCEDURES,894,HIV WITH ONE SIGNIFICANT HIV CONDITION OR WITHOUT SIGNIFICANT RELATED CONDITIONS,24,HUMAN IMMUNODEFICIENCY VIRUS INFECTIONS,2,Moderate,Moderate,Medical,Medicaid,,,,,Y,56109.45,13846.36
New York City,Manhattan,7002054,001464,New York-Presbyterian Hospital - Columbia Presbyterian Center,30 to 49,,M,Black/African American,Not Span/Hispanic,3,Emergency,Home or Self Care,2022,SKN007,Other specified and unspecified skin disorders,,,894,HIV WITH ONE SIGNIFICANT HIV CONDITION OR WITHOUT SIGNIFICANT RELATED CONDITIONS,24,HUMAN IMMUNODEFICIENCY VIRUS INFECTIONS,2,Moderate,Minor,Medical,Medicare,Medicaid,,,,Y,50013.01,10795.10
New York City,Manhattan,7002054,001464,New York-Presbyterian Hospital - Columbia Presbyterian Center,30 to 49,,F,Black/African American,Spanish/Hispanic,4,Emergency,Home or Self Care,2022,INF012,COVID-19,,,894,HIV WITH ONE SIGNIFICANT HIV CONDITION OR WITHOUT SIGNIFICANT RELATED CONDITIONS,24,HUMAN IMMUNODEFICIENCY VIRUS INFECTIONS,3,Major,Moderate,Medical,Medicaid,,,,,Y,76680.50,16556.96
Finger Lakes,Monroe,2701005,000413,Strong Memorial Hospital,70 or Older,,M,Black/African American,Not Span/Hispanic,2,Emergency,Skilled Nursing Home,2022,NVS015,Polyneuropathies,,,894,HIV WITH ONE SIGNIFICANT HIV CONDITION OR WITHOUT SIGNIFICANT RELATED CONDITIONS,24,HUMAN IMMUNODEFICIENCY VIRUS INFECTIONS,3,Major,Moderate,Medical,Medicare,Blue Cross/Blue Shield,,,,Y,16983.77,6080.98
New York City,Manhattan,7002054,001464,New York-Presbyterian Hospital - Columbia Presbyterian Center,30 to 49,,F,White,Not Span/Hispanic,1,Emergency,Left Against Medical Advice,2022,INF006,HIV infection,,,894,HIV WITH ONE SIGNIFICANT HIV CONDITION OR WITHOUT SIGNIFICANT RELATED CONDITIONS,24,HUMAN IMMUNODEFICIENCY VIRUS INFECTIONS,1,Minor,Minor,Medical,Medicaid,,,,,Y,21631.52,
New York City,Manhattan,7002001,001438,Bellevue Hospital Center,30 to 49,,M,Black/African American,Unknown,1,Emergency,Home or Self Care,2022,NVS009,Epilepsy; convulsions,ADM021,"ADMINISTRATION OF THERAPEUTIC SUBSTANCES, NEC",894,HIV WITH ONE SIGNIFICANT HIV CONDITION OR WITHOUT SIGNIFICANT RELATED CONDITIONS,24,HUMAN IMMUNODEFICIENCY VIRUS INFECTIONS,2,Moderate,Minor,Medical,Medicare,Medicaid,,,,Y,10559.57,6072.64
New York City,Manhattan,7002001,001438,Bellevue Hospital Center,50 to 69,,M,Black/African American,Unknown,1,Emergency,Home or Self Care,2022,RSP002,Pneumonia (except that caused by tuberculosis),ADM021,"ADMINISTRATION OF THERAPEUTIC SUBSTANCES, NEC",894,HIV WITH ONE SIGNIFICANT HIV CONDITION OR WITHOUT SIGNIFICANT RELATED CONDITIONS,24,HUMAN IMMUNODEFICIENCY VIRUS INFECTIONS,2,Moderate,Moderate,Medical,Medicaid,,,,,Y,10085.51,5800.02
Finger Lakes,Monroe,2701005,000413,Strong Memorial Hospital,50 to 69,,F,White,Not Span/Hispanic,4,Emergency,Home or Self Care,2022,BLD002,Hemolytic anemia,,,894,HIV WITH ONE SIGNIFICANT HIV CONDITION OR WITHOUT SIGNIFICANT RELATED CONDITIONS,24,HUMAN IMMUNODEFICIENCY VIRUS INFECTIONS,4,Extreme,Major,Medical,Medicaid,,,,,Y,22554.12,8381.89
New York City,Manhattan,7002054,001464,New York-Presbyterian Hospital - Columbia Presbyterian Center,50 to 69,,M,Other Race,Spanish/Hispanic,2,Emergency,Home or Self Care,2022,INF006,HIV infection,,,894,HIV WITH ONE SIGNIFICANT HIV CONDITION OR WITHOUT SIGNIFICANT RELATED CONDITIONS,24,HUMAN IMMUNODEFICIENCY VIRUS INFECTIONS,2,Moderate,Minor,Medical,Medicaid,,,,,Y,32532.20,6796.43
New York City,Manhattan,7002054,001464,New York-Presbyterian Hospital - Columbia Presbyterian Center,30 to 49,,M,Multi-racial,Not Span/Hispanic,2,Emergency,Home or Self Care,2022,DIG004,Esophageal disorders,ADM015,ADMINISTRATION OF ANTIBIOTICS,894,HIV WITH ONE SIGNIFICANT HIV CONDITION OR WITHOUT SIGNIFICANT RELATED CONDITIONS,24,HUMAN IMMUNODEFICIENCY VIRUS INFECTIONS,2,Moderate,Minor,Medical,Medicaid,,,,,Y,29043.72,6288.87
New York City,Manhattan,7002054,001464,New York-Presbyterian Hospital - Columbia Presbyterian Center,50 to 69,,F,Black/African American,Not Span/Hispanic,3,Emergency,Home or Self Care,2022,INF012,COVID-19,ADM015,ADMINISTRATION OF ANTIBIOTICS,894,HIV WITH ONE SIGNIFICANT HIV CONDITION OR WITHOUT SIGNIFICANT RELATED CONDITIONS,24,HUMAN IMMUNODEFICIENCY VIRUS INFECTIONS,3,Major,Major,Medical,Medicare,Medicaid,,,,Y,68527.60,15128.98
New York City,Manhattan,7002054,001464,New York-Presbyterian Hospital - Columbia Presbyterian Center,50 to 69,,F,Other Race,Spanish/Hispanic,5,Emergency,Left Against Medical Advice,2022,INF006,HIV infection,ADM017,ADMINISTRATION OF NUTRITIONAL AND ELECTROLYTIC SUBSTANCES,894,HIV WITH ONE SIGNIFICANT HIV CONDITION OR WITHOUT SIGNIFICANT RELATED CONDITIONS,24,HUMAN IMMUNODEFICIENCY VIRUS INFECTIONS,2,Moderate,Moderate,Medical,Medicaid,,,,,Y,107693.84,22220.72
New York City,Manhattan,7002054,001464,New York-Presbyterian Hospital - Columbia Presbyterian Center,50 to 69,,M,Black/African American,Not Span/Hispanic,3,Emergency,Left Against Medical Advice,2022,INF012,COVID-19,ADM019,POTENTIAL COVID-19 THERAPIES,894,HIV WITH ONE SIGNIFICANT HIV CONDITION OR WITHOUT SIGNIFICANT RELATED CONDITIONS,24,HUMAN IMMUNODEFICIENCY VIRUS INFECTIONS,3,Major,Moderate,Medical,Medicaid,,,,,Y,58023.71,14932.68
New York City,Manhattan,7002054,001464,New York-Presbyterian Hospital - Columbia Presbyterian Center,30 to 49,,M,Black/African American,Not Span/Hispanic,2,Emergency,Home or Self Care,2022,INF006,HIV infection,,,894,HIV WITH ONE SIGNIFICANT HIV CONDITION OR WITHOUT SIGNIFICANT RELATED CONDITIONS,24,HUMAN IMMUNODEFICIENCY VIRUS INFECTIONS,2,Moderate,Moderate,Medical,Medicaid,,,,,Y,30956.21,6771.86
New York City,Manhattan,7002053,001463,NYU Langone Hospitals,50 to 69,,M,White,Not Span/Hispanic,2,Emergency,Home or Self Care,2022,SKN001,Skin and subcutaneous tissue infections,,,894,HIV WITH ONE SIGNIFICANT HIV CONDITION OR WITHOUT SIGNIFICANT RELATED CONDITIONS,24,HUMAN IMMUNODEFICIENCY VIRUS INFECTIONS,2,Moderate,Minor,Medical,Medicare,Private Health Insurance,,,,Y,48246.24,16563.30
Hudson Valley,Dutchess,1302001,000181,Vassar Brothers Medical Center,50 to 69,,M,White,Not Span/Hispanic,3,Emergency,Home or Self Care,2022,CIR020,Cerebral infarction,ADM005,ADMINISTRATION OF THROMBOLYTICS AND PLATELET INHIBITORS,894,HIV WITH ONE SIGNIFICANT HIV CONDITION OR WITHOUT SIGNIFICANT RELATED CONDITIONS,24,HUMAN IMMUNODEFICIENCY VIRUS INFECTIONS,3,Major,Major,Medical,Blue Cross/Blue Shield,,,,,Y,33169.18,9781.41
New York City,Manhattan,7002054,001464,New York-Presbyterian Hospital - Columbia Presbyterian Center,50 to 69,,M,Other Race,Spanish/Hispanic,2,Emergency,Left Against Medical Advice,2022,INF006,HIV infection,ADM021,"ADMINISTRATION OF THERAPEUTIC SUBSTANCES, NEC",894,HIV WITH ONE SIGNIFICANT HIV CONDITION OR WITHOUT SIGNIFICANT RELATED CONDITIONS,24,HUMAN IMMUNODEFICIENCY VIRUS INFECTIONS,2,Moderate,Moderate,Medical,Medicare,,,,,Y,37352.41,7587.42
Long Island,Nassau,2951001,000541,North Shore University Hospital,30 to 49,,M,White,Spanish/Hispanic,5,Emergency,Home or Self Care,2022,INF006,HIV infection,SKB001,SKIN BIOPSY AND DIAGNOSTIC DRAINAGE,894,HIV WITH ONE SIGNIFICANT HIV CONDITION OR WITHOUT SIGNIFICANT RELATED CONDITIONS,24,HUMAN IMMUNODEFICIENCY VIRUS INFECTIONS,3,Major,Moderate,Medical,Medicaid,,,,,Y,88123.17,13491.65
New York City,Manhattan,7002001,001438,Bellevue Hospital Center,18 to 29,,M,White,Unknown,1,Emergency,Left Against Medical Advice,2022,SKN001,Skin and subcutaneous tissue infections,ADM015,ADMINISTRATION OF ANTIBIOTICS,894,HIV WITH ONE SIGNIFICANT HIV CONDITION OR WITHOUT SIGNIFICANT RELATED CONDITIONS,24,HUMAN IMMUNODEFICIENCY VIRUS INFECTIONS,1,Minor,Minor,Medical,Medicaid,,,,,Y,9071.73,5217.01
New York City,Manhattan,7002001,001438,Bellevue Hospital Center,50 to 69,,M,Other Race,Unknown,3,Emergency,Home or Self Care,2022,INF012,COVID-19,ADM021,"ADMINISTRATION OF THERAPEUTIC SUBSTANCES, NEC",894,HIV WITH ONE SIGNIFICANT HIV CONDITION OR WITHOUT SIGNIFICANT RELATED CONDITIONS,24,HUMAN IMMUNODEFICIENCY VIRUS INFECTIONS,2,Moderate,Moderate,Medical,Medicaid,,,,,Y,22919.33,13180.54
New York City,Manhattan,7002054,001464,New York-Presbyterian Hospital - Columbia Presbyterian Center,30 to 49,,F,Other Race,Spanish/Hispanic,3,Emergency,Home or Self Care,2022,INF006,HIV infection,ADM001,TRANSFUSION OF BLOOD AND BLOOD PRODUCTS,894,HIV WITH ONE SIGNIFICANT HIV CONDITION OR WITHOUT SIGNIFICANT RELATED CONDITIONS,24,HUMAN IMMUNODEFICIENCY VIRUS INFECTIONS,1,Minor,Minor,Medical,Medicaid,,,,,Y,54245.71,11629.04
New York City,Manhattan,7002054,001464,New York-Presbyterian Hospital - Columbia Presbyterian Center,50 to 69,,M,Black/African American,Not Span/Hispanic,1,Emergency,Left Against Medical Advice,2022,INF006,HIV infection,ADM021,"ADMINISTRATION OF THERAPEUTIC SUBSTANCES, NEC",894,HIV WITH ONE SIGNIFICANT HIV CONDITION OR WITHOUT SIGNIFICANT RELATED CONDITIONS,24,HUMAN IMMUNODEFICIENCY VIRUS INFECTIONS,2,Moderate,Minor,Medical,Medicaid,,,,,Y,23289.31,4958.43
Finger Lakes,Monroe,2701005,000413,Strong Memorial Hospital,30 to 49,,M,Other Race,Spanish/Hispanic,2,Emergency,Home or Self Care,2022,SKN001,Skin and subcutaneous tissue infections,,,894,HIV WITH ONE SIGNIFICANT HIV CONDITION OR WITHOUT SIGNIFICANT RELATED CONDITIONS,24,HUMAN IMMUNODEFICIENCY VIRUS INFECTIONS,1,Minor,Minor,Medical,Medicare,Medicaid,,,,Y,35649.51,13226.53
Finger Lakes,Monroe,2701005,000413,Strong Memorial Hospital,30 to 49,,M,Black/African American,Not Span/Hispanic,2,Emergency,Home or Self Care,2022,SKN001,Skin and subcutaneous tissue infections,,,894,HIV WITH ONE SIGNIFICANT HIV CONDITION OR WITHOUT SIGNIFICANT RELATED CONDITIONS,24,HUMAN IMMUNODEFICIENCY VIRUS INFECTIONS,2,Moderate,Minor,Medical,Medicaid,,,,,Y,8480.83,3613.93
New York City,Manhattan,7002001,001438,Bellevue Hospital Center,50 to 69,,M,White,Not Span/Hispanic,1,Emergency,Home or Self Care,2022,RSP002,Pneumonia (except that caused by tuberculosis),ADM015,ADMINISTRATION OF ANTIBIOTICS,894,HIV WITH ONE SIGNIFICANT HIV CONDITION OR WITHOUT SIGNIFICANT RELATED CONDITIONS,24,HUMAN IMMUNODEFICIENCY VIRUS INFECTIONS,2,Moderate,Minor,Medical,Medicaid,,,,,Y,10173.81,5850.80
Finger Lakes,Monroe,2701005,000413,Strong Memorial Hospital,30 to 49,,M,White,Spanish/Hispanic,8,Emergency,Inpatient Rehabilitation Facility,2022,SKN001,Skin and subcutaneous tissue infections,,,894,HIV WITH ONE SIGNIFICANT HIV CONDITION OR WITHOUT SIGNIFICANT RELATED CONDITIONS,24,HUMAN IMMUNODEFICIENCY VIRUS INFECTIONS,2,Moderate,Minor,Medical,Medicaid,,,,,Y,27004.34,12726.58
New York City,Manhattan,7002054,001464,New York-Presbyterian Hospital - Columbia Presbyterian Center,50 to 69,,M,Black/African American,Not Span/Hispanic,3,Emergency,Home w/ Home Health Services,2022,INF006,HIV infection,ADM017,ADMINISTRATION OF NUTRITIONAL AND ELECTROLYTIC SUBSTANCES,894,HIV WITH ONE SIGNIFICANT HIV CONDITION OR WITHOUT SIGNIFICANT RELATED CONDITIONS,24,HUMAN IMMUNODEFICIENCY VIRUS INFECTIONS,2,Moderate,Moderate,Medical,Medicaid,,,,,Y,46549.99,10043.84
New York City,Manhattan,7002054,001464,New York-Presbyterian Hospital - Columbia Presbyterian Center,50 to 69,,M,Black/African American,Not Span/Hispanic,4,Emergency,Home or Self Care,2022,INF006,HIV infection,,,894,HIV WITH ONE SIGNIFICANT HIV CONDITION OR WITHOUT SIGNIFICANT RELATED CONDITIONS,24,HUMAN IMMUNODEFICIENCY VIRUS INFECTIONS,2,Moderate,Moderate,Medical,Medicaid,,,,,Y,58627.34,12912.90
New York City,Manhattan,7002001,001438,Bellevue Hospital Center,50 to 69,,M,Black/African American,Not Span/Hispanic,1,Emergency,Left Against Medical Advice,2022,INF012,COVID-19,ADM015,ADMINISTRATION OF ANTIBIOTICS,894,HIV WITH ONE SIGNIFICANT HIV CONDITION OR WITHOUT SIGNIFICANT RELATED CONDITIONS,24,HUMAN IMMUNODEFICIENCY VIRUS INFECTIONS,2,Moderate,Major,Medical,Medicaid,,,,,Y,10177.32,5852.81
New York City,Manhattan,7002054,001464,New York-Presbyterian Hospital - Columbia Presbyterian Center,30 to 49,,M,Black/African American,Not Span/Hispanic,3,Emergency,Home or Self Care,2022,INF006,HIV infection,,,894,HIV WITH ONE SIGNIFICANT HIV CONDITION OR WITHOUT SIGNIFICANT RELATED CONDITIONS,24,HUMAN IMMUNODEFICIENCY VIRUS INFECTIONS,2,Moderate,Minor,Medical,Medicaid,,,,,Y,38854.71,8682.88
Long Island,Nassau,2951001,000541,North Shore University Hospital,30 to 49,,M,White,Not Span/Hispanic,1,Emergency,Left Against Medical Advice,2022,END011,Fluid and electrolyte disorders,,,894,HIV WITH ONE SIGNIFICANT HIV CONDITION OR WITHOUT SIGNIFICANT RELATED CONDITIONS,24,HUMAN IMMUNODEFICIENCY VIRUS INFECTIONS,2,Moderate,Minor,Medical,Medicaid,,,,,Y,26516.53,4344.12
Long Island,Nassau,2951001,000541,North Shore University Hospital,30 to 49,,M,White,Spanish/Hispanic,6,Emergency,Home or Self Care,2022,INF006,HIV infection,,,894,HIV WITH ONE SIGNIFICANT HIV CONDITION OR WITHOUT SIGNIFICANT RELATED CONDITIONS,24,HUMAN IMMUNODEFICIENCY VIRUS INFECTIONS,2,Moderate,Minor,Medical,Blue Cross/Blue Shield,,,,,Y,75369.02,12622.39
New York City,Manhattan,7002054,001464,New York-Presbyterian Hospital - Columbia Presbyterian Center,30 to 49,,M,Black/African American,Not Span/Hispanic,2,Emergency,Home or Self Care,2022,INF006,HIV infection,ADM015,ADMINISTRATION OF ANTIBIOTICS,894,HIV WITH ONE SIGNIFICANT HIV CONDITION OR WITHOUT SIGNIFICANT RELATED CONDITIONS,24,HUMAN IMMUNODEFICIENCY VIRUS INFECTIONS,2,Moderate,Moderate,Medical,Medicaid,,,,,Y,43883.38,9332.47
New York City,Manhattan,7002054,001464,New York-Presbyterian Hospital - Columbia Presbyterian Center,30 to 49,,M,Black/African American,Spanish/Hispanic,1,Emergency,Left Against Medical Advice,2022,INF006,HIV infection,OTR004,ISOLATION PROCEDURES,894,HIV WITH ONE SIGNIFICANT HIV CONDITION OR WITHOUT SIGNIFICANT RELATED CONDITIONS,24,HUMAN IMMUNODEFICIENCY VIRUS INFECTIONS,3,Major,Major,Medical,Medicaid,,,,,Y,28119.89,5639.86
New York City,Manhattan,7002001,001438,Bellevue Hospital Center,70 or Older,,M,Black/African American,Unknown,10,Emergency,Home or Self Care,2022,INF012,COVID-19,ADM019,POTENTIAL COVID-19 THERAPIES,894,HIV WITH ONE SIGNIFICANT HIV CONDITION OR WITHOUT SIGNIFICANT RELATED CONDITIONS,24,HUMAN IMMUNODEFICIENCY VIRUS INFECTIONS,3,Major,Major,Medical,Medicare,Medicaid,,,,Y,77580.76,44615.45
New York City,Manhattan,7002001,001438,Bellevue Hospital Center,30 to 49,,M,White,Unknown,1,Emergency,Left Against Medical Advice,2022,END011,Fluid and electrolyte disorders,IMG009,PLAIN RADIOGRAPHY,894,HIV WITH ONE SIGNIFICANT HIV CONDITION OR WITHOUT SIGNIFICANT RELATED CONDITIONS,24,HUMAN IMMUNODEFICIENCY VIRUS INFECTIONS,2,Moderate,Minor,Medical,Medicaid,,,,,Y,11682.10,6718.19
New York City,Manhattan,7002054,001464,New York-Presbyterian Hospital - Columbia Presbyterian Center,30 to 49,,M,Black/African American,Not Span/Hispanic,1,Emergency,Left Against Medical Advice,2022,INF008,Viral infection,,,894,HIV WITH ONE SIGNIFICANT HIV CONDITION OR WITHOUT SIGNIFICANT RELATED CONDITIONS,24,HUMAN IMMUNODEFICIENCY VIRUS INFECTIONS,1,Minor,Minor,Medical,Self-Pay,,,,,Y,40444.81,8106.67
New York City,Manhattan,7002054,001464,New York-Presbyterian Hospital - Columbia Presbyterian Center,30 to 49,,M,Black/African American,Not Span/Hispanic,5,Emergency,Left Against Medical Advice,2022,SKN001,Skin and subcutaneous tissue infections,MST003,"SUBCUTANEOUS TISSUE, FASCIA, AND MUSCLE BIOPSY",894,HIV WITH ONE SIGNIFICANT HIV CONDITION OR WITHOUT SIGNIFICANT RELATED CONDITIONS,24,HUMAN IMMUNODEFICIENCY VIRUS INFECTIONS,1,Minor,Minor,Medical,Medicaid,,,,,Y,75374.75,17119.85