Hospital Service Area,Hospital County,Operating Certificate Number,Permanent Facility Id,Facility Name,Age Group,Zip Code - 3 digits,Gender,Race,Ethnicity,Length of Stay,Type of Admission,Patient Disposition,Discharge Year,CCS Diagnosis Code,CCS Diagnosis Description,CCS Procedure Code,CCS Procedure Description,APR DRG Code,APR DRG Description,APR MDC Code,APR MDC Description,APR Severity of Illness Code,APR Severity of Illness Description,APR Risk of Mortality,APR Medical Surgical Description,Payment Typology 1,Payment Typology 2,Payment Typology 3,Birth Weight,Abortion Edit Indicator,Emergency Department Indicator,Total Charges,Total Costs
New York City,Manhattan,7002054,001464,New York-Presbyterian Hospital - Columbia Presbyterian Center,0 to 17,104,M,White,Not Span/Hispanic,11,Urgent,Home or Self Care,2022,INJ010,"Internal organ injury, initial encounter",CAR011,ANEURYSM REPAIR PROCEDURES,911,EXTENSIVE ABDOMINAL OR THORACIC PROCEDURES FOR MULTIPLE SIGNIFICANT TRAUMA,25,MULTIPLE SIGNIFICANT TRAUMA,4,Extreme,Major,Surgical,Medicaid,,,,,N,515174.31,194459.58
Finger Lakes,Monroe,2701005,000413,Strong Memorial Hospital,0 to 17,146,F,Black/African American,Not Span/Hispanic,8,Emergency,Home w/ Home Health Services,2022,INJ016,"Injury to blood vessels, initial encounter",RES005,CHEST TUBE PLACEMENT AND THERAPEUTIC THORACENTESIS,911,EXTENSIVE ABDOMINAL OR THORACIC PROCEDURES FOR MULTIPLE SIGNIFICANT TRAUMA,25,MULTIPLE SIGNIFICANT TRAUMA,4,Extreme,Major,Surgical,Medicaid,,,,,Y,125861.92,50825.01
Finger Lakes,Monroe,2701005,000413,Strong Memorial Hospital,18 to 29,146,F,White,Not Span/Hispanic,4,Emergency,Home or Self Care,2022,INJ010,"Internal organ injury, initial encounter",CAR010,LIGATION AND EMBOLIZATION OF VESSELS,911,EXTENSIVE ABDOMINAL OR THORACIC PROCEDURES FOR MULTIPLE SIGNIFICANT TRAUMA,25,MULTIPLE SIGNIFICANT TRAUMA,3,Major,Major,Surgical,Miscellaneous/Other,Medicaid,,,,Y,89422.84,31950.26
Finger Lakes,Monroe,2701005,000413,Strong Memorial Hospital,30 to 49,148,M,White,Unknown,6,Emergency,Home or Self Care,2022,INJ016,"Injury to blood vessels, initial encounter",GIS009,COLECTOMY,911,EXTENSIVE ABDOMINAL OR THORACIC PROCEDURES FOR MULTIPLE SIGNIFICANT TRAUMA,25,MULTIPLE SIGNIFICANT TRAUMA,4,Extreme,Major,Surgical,Miscellaneous/Other,,,,,Y,53754.71,22213.65
Finger Lakes,Monroe,2701005,000413,Strong Memorial Hospital,30 to 49,146,M,Multi-racial,Not Span/Hispanic,14,Emergency,Home or Self Care,2022,INJ010,"Internal organ injury, initial encounter",CAR010,LIGATION AND EMBOLIZATION OF VESSELS,911,EXTENSIVE ABDOMINAL OR THORACIC PROCEDURES FOR MULTIPLE SIGNIFICANT TRAUMA,25,MULTIPLE SIGNIFICANT TRAUMA,4,Extreme,Extreme,Surgical,Medicaid,,,,,Y,119249.53,47437.83
Finger Lakes,Monroe,2701005,000413,Strong Memorial Hospital,18 to 29,145,M,Multi-racial,Not Span/Hispanic,7,Emergency,Home or Self Care,2022,INJ010,"Internal organ injury, initial encounter",GIS011,SMALL BOWEL RESECTION,911,EXTENSIVE ABDOMINAL OR THORACIC PROCEDURES FOR MULTIPLE SIGNIFICANT TRAUMA,25,MULTIPLE SIGNIFICANT TRAUMA,4,Extreme,Major,Surgical,Medicaid,,,,,Y,121836.85,46846.96
Finger Lakes,Monroe,2701005,000413,Strong Memorial Hospital,70 or Older,145,F,Multi-racial,Unknown,1,Emergency,Expired,2022,INJ008,"Traumatic brain injury (TBI); concussion, initial encounter",RES005,CHEST TUBE PLACEMENT AND THERAPEUTIC THORACENTESIS,911,EXTENSIVE ABDOMINAL OR THORACIC PROCEDURES FOR MULTIPLE SIGNIFICANT TRAUMA,25,MULTIPLE SIGNIFICANT TRAUMA,4,Extreme,Extreme,Surgical,Miscellaneous/Other,Medicare,Private Health Insurance,,,Y,191654.73,60143.62
Finger Lakes,Monroe,2701005,000413,Strong Memorial Hospital,30 to 49,145,M,White,Spanish/Hispanic,39,Emergency,Inpatient Rehabilitation Facility,2022,INJ026,Other specified injury,LYM005,SPLENECTOMY,911,EXTENSIVE ABDOMINAL OR THORACIC PROCEDURES FOR MULTIPLE SIGNIFICANT TRAUMA,25,MULTIPLE SIGNIFICANT TRAUMA,4,Extreme,Extreme,Surgical,Miscellaneous/Other,Medicaid,,,,Y,354387.63,134292.00
Finger Lakes,Monroe,2701005,000413,Strong Memorial Hospital,18 to 29,146,M,Black/African American,Not Span/Hispanic,9,Emergency,Home w/ Home Health Services,2022,INJ010,"Internal organ injury, initial encounter",GIS011,SMALL BOWEL RESECTION,911,EXTENSIVE ABDOMINAL OR THORACIC PROCEDURES FOR MULTIPLE SIGNIFICANT TRAUMA,25,MULTIPLE SIGNIFICANT TRAUMA,4,Extreme,Extreme,Surgical,Medicaid,,,,,Y,174577.60,75046.61
New York City,Manhattan,7002001,001438,Bellevue Hospital Center,50 to 69,100,M,White,Unknown,23,Emergency,Inpatient Rehabilitation Facility,2022,INJ014,"Amputation of a limb, initial encounter",MST024,BELOW KNEE AMPUTATION,911,EXTENSIVE ABDOMINAL OR THORACIC PROCEDURES FOR MULTIPLE SIGNIFICANT TRAUMA,25,MULTIPLE SIGNIFICANT TRAUMA,4,Extreme,Extreme,Surgical,Medicaid,,,,,Y,524799.40,301803.74
Long Island,Nassau,2951001,000541,North Shore University Hospital,70 or Older,113,M,Other Race,Not Span/Hispanic,9,Emergency,Expired,2022,INJ010,"Internal organ injury, initial encounter",ESA003,MECHANICAL VENTILATION,911,EXTENSIVE ABDOMINAL OR THORACIC PROCEDURES FOR MULTIPLE SIGNIFICANT TRAUMA,25,MULTIPLE SIGNIFICANT TRAUMA,4,Extreme,Extreme,Surgical,Miscellaneous/Other,Medicare,Blue Cross/Blue Shield,,,Y,622188.78,112547.36
Long Island,Nassau,2951001,000541,North Shore University Hospital,70 or Older,110,F,White,Not Span/Hispanic,14,Emergency,Skilled Nursing Home,2022,INJ010,"Internal organ injury, initial encounter",MST012,BONE FIXATION (EXCLUDING EXTREMITIES),911,EXTENSIVE ABDOMINAL OR THORACIC PROCEDURES FOR MULTIPLE SIGNIFICANT TRAUMA,25,MULTIPLE SIGNIFICANT TRAUMA,4,Extreme,Moderate,Surgical,Miscellaneous/Other,Medicare,Private Health Insurance,,,Y,363743.53,75593.18
Long Island,Nassau,2951001,000541,North Shore University Hospital,50 to 69,110,M,Other Race,Spanish/Hispanic,6,Emergency,Home or Self Care,2022,INJ010,"Internal organ injury, initial encounter",GIS009,COLECTOMY,911,EXTENSIVE ABDOMINAL OR THORACIC PROCEDURES FOR MULTIPLE SIGNIFICANT TRAUMA,25,MULTIPLE SIGNIFICANT TRAUMA,3,Major,Moderate,Surgical,Medicaid,Medicaid,,,,Y,155180.19,25451.70
Finger Lakes,Monroe,2701005,000413,Strong Memorial Hospital,18 to 29,146,M,Black/African American,Not Span/Hispanic,5,Emergency,Court/Law Enforcement,2022,INJ010,"Internal organ injury, initial encounter",GNR009,"RETROPERITONEAL PROCEDURES, NEC",911,EXTENSIVE ABDOMINAL OR THORACIC PROCEDURES FOR MULTIPLE SIGNIFICANT TRAUMA,25,MULTIPLE SIGNIFICANT TRAUMA,3,Major,Major,Surgical,Medicaid,,,,,Y,50441.34,22038.60
New York City,Manhattan,7002001,001438,Bellevue Hospital Center,18 to 29,104,M,Other Race,Unknown,15,Emergency,Psychiatric Hospital or Unit of Hosp,2022,INJ005,"Fracture of the lower limb (except hip), initial encounter",MST010,FEMUR FIXATION,911,EXTENSIVE ABDOMINAL OR THORACIC PROCEDURES FOR MULTIPLE SIGNIFICANT TRAUMA,25,MULTIPLE SIGNIFICANT TRAUMA,4,Extreme,Major,Surgical,Medicaid,,,,,Y,194369.90,111779.02
New York City,Manhattan,7002001,001438,Bellevue Hospital Center,30 to 49,100,M,Other Race,Spanish/Hispanic,9,Emergency,Home or Self Care,2022,INJ010,"Internal organ injury, initial encounter",LYM005,SPLENECTOMY,911,EXTENSIVE ABDOMINAL OR THORACIC PROCEDURES FOR MULTIPLE SIGNIFICANT TRAUMA,25,MULTIPLE SIGNIFICANT TRAUMA,4,Extreme,Extreme,Surgical,Medicaid,,,,,Y,126069.62,72500.62
Finger Lakes,Monroe,2701005,000413,Strong Memorial Hospital,0 to 17,146,M,Black/African American,Unknown,9,Emergency,Home w/ Home Health Services,2022,INJ012,"Open wounds to limbs, initial encounter",GIS004,GI SYSTEM ENDOSCOPY WITHOUT BIOPSY (DIAGNOSTIC),911,EXTENSIVE ABDOMINAL OR THORACIC PROCEDURES FOR MULTIPLE SIGNIFICANT TRAUMA,25,MULTIPLE SIGNIFICANT TRAUMA,3,Major,Minor,Surgical,Medicaid,,,,,Y,83883.68,36913.92
Finger Lakes,Monroe,2701005,000413,Strong Memorial Hospital,30 to 49,146,M,Black/African American,Not Span/Hispanic,10,Emergency,Home w/ Home Health Services,2022,INJ010,"Internal organ injury, initial encounter",HEP013,"HEPATOBILIARY AND PANCREATIC PROCEDURES, NEC",911,EXTENSIVE ABDOMINAL OR THORACIC PROCEDURES FOR MULTIPLE SIGNIFICANT TRAUMA,25,MULTIPLE SIGNIFICANT TRAUMA,4,Extreme,Extreme,Surgical,Medicaid,,,,,Y,81141.54,32752.64
Finger Lakes,Monroe,2701005,000413,Strong Memorial Hospital,30 to 49,146,M,Black/African American,Not Span/Hispanic,10,Emergency,Home w/ Home Health Services,2022,INJ010,"Internal organ injury, initial encounter",URN008,NEPHRECTOMY AND URETERECTOMY,911,EXTENSIVE ABDOMINAL OR THORACIC PROCEDURES FOR MULTIPLE SIGNIFICANT TRAUMA,25,MULTIPLE SIGNIFICANT TRAUMA,4,Extreme,Major,Surgical,Medicaid,,,,,Y,136554.57,57204.14
New York City,Manhattan,7002001,001438,Bellevue Hospital Center,50 to 69,100,F,Other Race,Not Span/Hispanic,28,Emergency,Skilled Nursing Home,2022,INJ003,"Fracture of torso, initial encounter",MST012,BONE FIXATION (EXCLUDING EXTREMITIES),911,EXTENSIVE ABDOMINAL OR THORACIC PROCEDURES FOR MULTIPLE SIGNIFICANT TRAUMA,25,MULTIPLE SIGNIFICANT TRAUMA,4,Extreme,Extreme,Surgical,Miscellaneous/Other,Medicare,,,,Y,384409.41,221067.70
New York City,Manhattan,7002001,001438,Bellevue Hospital Center,18 to 29,100,M,White,Not Span/Hispanic,1,Emergency,Expired,2022,INJ008,"Traumatic brain injury (TBI); concussion, initial encounter",ESA003,MECHANICAL VENTILATION,911,EXTENSIVE ABDOMINAL OR THORACIC PROCEDURES FOR MULTIPLE SIGNIFICANT TRAUMA,25,MULTIPLE SIGNIFICANT TRAUMA,4,Extreme,Extreme,Surgical,Miscellaneous/Other,,,,,Y,49251.39,28323.69
New York City,Manhattan,7002001,001438,Bellevue Hospital Center,30 to 49,111,M,White,Unknown,5,Emergency,Home or Self Care,2022,INJ010,"Internal organ injury, initial encounter",CAR010,LIGATION AND EMBOLIZATION OF VESSELS,911,EXTENSIVE ABDOMINAL OR THORACIC PROCEDURES FOR MULTIPLE SIGNIFICANT TRAUMA,25,MULTIPLE SIGNIFICANT TRAUMA,2,Moderate,Minor,Surgical,Medicaid,,,,,Y,86411.79,49694.04
New York City,Manhattan,7002001,001438,Bellevue Hospital Center,50 to 69,113,M,Other Race,Not Span/Hispanic,9,Emergency,Home or Self Care,2022,INJ010,"Internal organ injury, initial encounter",CAR010,LIGATION AND EMBOLIZATION OF VESSELS,911,EXTENSIVE ABDOMINAL OR THORACIC PROCEDURES FOR MULTIPLE SIGNIFICANT TRAUMA,25,MULTIPLE SIGNIFICANT TRAUMA,4,Extreme,Major,Surgical,Miscellaneous/Other,,,,,Y,94159.94,54149.87
Finger Lakes,Monroe,2701005,000413,Strong Memorial Hospital,18 to 29,146,M,Black/African American,Not Span/Hispanic,17,Emergency,Home or Self Care,2022,INJ012,"Open wounds to limbs, initial encounter",SKB008,SKIN EXCISION AND DEBRIDEMENT,911,EXTENSIVE ABDOMINAL OR THORACIC PROCEDURES FOR MULTIPLE SIGNIFICANT TRAUMA,25,MULTIPLE SIGNIFICANT TRAUMA,4,Extreme,Extreme,Surgical,Medicaid,,,,,Y,207702.73,93772.45
Finger Lakes,Monroe,2701005,000413,Strong Memorial Hospital,30 to 49,146,M,Black/African American,Not Span/Hispanic,5,Emergency,Home or Self Care,2022,INJ010,"Internal organ injury, initial encounter",HEP013,"HEPATOBILIARY AND PANCREATIC PROCEDURES, NEC",911,EXTENSIVE ABDOMINAL OR THORACIC PROCEDURES FOR MULTIPLE SIGNIFICANT TRAUMA,25,MULTIPLE SIGNIFICANT TRAUMA,3,Major,Major,Surgical,Medicaid,,,,,Y,50729.94,21152.85
Finger Lakes,Monroe,2701005,000413,Strong Memorial Hospital,30 to 49,146,M,Multi-racial,Spanish/Hispanic,6,Emergency,Home or Self Care,2022,INJ010,"Internal organ injury, initial encounter",RES011,DIAPHRAGMATIC HERNIA REPAIR,911,EXTENSIVE ABDOMINAL OR THORACIC PROCEDURES FOR MULTIPLE SIGNIFICANT TRAUMA,25,MULTIPLE SIGNIFICANT TRAUMA,4,Extreme,Major,Surgical,Medicaid,,,,,Y,100638.74,36014.82
Long Island,Nassau,2951001,000541,North Shore University Hospital,30 to 49,113,M,Other Race,Not Span/Hispanic,17,Emergency,Inpatient Rehabilitation Facility,2022,INJ026,Other specified injury,ESA003,MECHANICAL VENTILATION,911,EXTENSIVE ABDOMINAL OR THORACIC PROCEDURES FOR MULTIPLE SIGNIFICANT TRAUMA,25,MULTIPLE SIGNIFICANT TRAUMA,4,Extreme,Extreme,Surgical,Miscellaneous/Other,Blue Cross/Blue Shield,,,,Y,644576.19,120478.36
Long Island,Nassau,2951001,000541,North Shore University Hospital,30 to 49,114,M,Black/African American,Not Span/Hispanic,7,Emergency,Home or Self Care,2022,INJ010,"Internal organ injury, initial encounter",GIS009,COLECTOMY,911,EXTENSIVE ABDOMINAL OR THORACIC PROCEDURES FOR MULTIPLE SIGNIFICANT TRAUMA,25,MULTIPLE SIGNIFICANT TRAUMA,3,Major,Moderate,Surgical,Medicaid,Medicaid,,,,Y,210945.04,37567.21
Finger Lakes,Monroe,2701005,000413,Strong Memorial Hospital,18 to 29,144,M,Other Race,Unknown,7,Emergency,Home or Self Care,2022,INJ010,"Internal organ injury, initial encounter",LYM005,SPLENECTOMY,911,EXTENSIVE ABDOMINAL OR THORACIC PROCEDURES FOR MULTIPLE SIGNIFICANT TRAUMA,25,MULTIPLE SIGNIFICANT TRAUMA,3,Major,Moderate,Surgical,Medicaid,,,,,Y,43822.58,19494.54
Finger Lakes,Monroe,2701005,000413,Strong Memorial Hospital,30 to 49,146,M,Multi-racial,Not Span/Hispanic,5,Emergency,Expired,2022,INJ010,"Internal organ injury, initial encounter",ADM021,"ADMINISTRATION OF THERAPEUTIC SUBSTANCES, NEC",911,EXTENSIVE ABDOMINAL OR THORACIC PROCEDURES FOR MULTIPLE SIGNIFICANT TRAUMA,25,MULTIPLE SIGNIFICANT TRAUMA,4,Extreme,Extreme,Surgical,Blue Cross/Blue Shield,,,,,Y,314746.22,99754.96
New York City,Manhattan,7002001,001438,Bellevue Hospital Center,30 to 49,OOS,M,Black/African American,Unknown,23,Emergency,Home w/ Home Health Services,2022,INJ003,"Fracture of torso, initial encounter",GIS005,EXPLORATION OF PERITONEAL CAVITY,911,EXTENSIVE ABDOMINAL OR THORACIC PROCEDURES FOR MULTIPLE SIGNIFICANT TRAUMA,25,MULTIPLE SIGNIFICANT TRAUMA,4,Extreme,Extreme,Surgical,Medicaid,,,,,Y,305648.99,175773.84
Finger Lakes,Monroe,2701005,000413,Strong Memorial Hospital,18 to 29,144,F,Multi-racial,Not Span/Hispanic,40,Emergency,Inpatient Rehabilitation Facility,2022,INJ010,"Internal organ injury, initial encounter",GIS011,SMALL BOWEL RESECTION,911,EXTENSIVE ABDOMINAL OR THORACIC PROCEDURES FOR MULTIPLE SIGNIFICANT TRAUMA,25,MULTIPLE SIGNIFICANT TRAUMA,4,Extreme,Extreme,Surgical,Miscellaneous/Other,Medicaid,,,,Y,345479.41,143190.98
Finger Lakes,Monroe,2701005,000413,Strong Memorial Hospital,50 to 69,146,F,White,Not Span/Hispanic,5,Emergency,Home or Self Care,2022,INJ010,"Internal organ injury, initial encounter",GIS011,SMALL BOWEL RESECTION,911,EXTENSIVE ABDOMINAL OR THORACIC PROCEDURES FOR MULTIPLE SIGNIFICANT TRAUMA,25,MULTIPLE SIGNIFICANT TRAUMA,3,Major,Moderate,Surgical,Blue Cross/Blue Shield,,,,,Y,63693.82,25880.53
Finger Lakes,Monroe,2701005,000413,Strong Memorial Hospital,30 to 49,146,M,White,Not Span/Hispanic,14,Emergency,Home or Self Care,2022,INJ001,"Fracture of head and neck, initial encounter",MST012,BONE FIXATION (EXCLUDING EXTREMITIES),911,EXTENSIVE ABDOMINAL OR THORACIC PROCEDURES FOR MULTIPLE SIGNIFICANT TRAUMA,25,MULTIPLE SIGNIFICANT TRAUMA,4,Extreme,Extreme,Surgical,Miscellaneous/Other,Medicaid,,,,Y,142029.34,62718.25
New York City,Manhattan,7002001,001438,Bellevue Hospital Center,30 to 49,100,M,Other Race,Unknown,15,Emergency,Home or Self Care,2022,INJ004,"Fracture of the upper limb, initial encounter",MST009,FIXATION OF UPPER EXTREMITY BONES,911,EXTENSIVE ABDOMINAL OR THORACIC PROCEDURES FOR MULTIPLE SIGNIFICANT TRAUMA,25,MULTIPLE SIGNIFICANT TRAUMA,4,Extreme,Major,Surgical,Miscellaneous/Other,,,,,Y,175271.57,100795.88
Long Island,Nassau,2951001,000541,North Shore University Hospital,50 to 69,117,M,White,Not Span/Hispanic,8,Emergency,Home or Self Care,2022,INJ010,"Internal organ injury, initial encounter",LYM005,SPLENECTOMY,911,EXTENSIVE ABDOMINAL OR THORACIC PROCEDURES FOR MULTIPLE SIGNIFICANT TRAUMA,25,MULTIPLE SIGNIFICANT TRAUMA,4,Extreme,Major,Surgical,Miscellaneous/Other,Blue Cross/Blue Shield,,,,Y,310915.86,56430.64
New York City,Manhattan,7002001,001438,Bellevue Hospital Center,30 to 49,112,M,White,Unknown,13,Emergency,Inpatient Rehabilitation Facility,2022,INJ010,"Internal organ injury, initial encounter",CAR010,LIGATION AND EMBOLIZATION OF VESSELS,911,EXTENSIVE ABDOMINAL OR THORACIC PROCEDURES FOR MULTIPLE SIGNIFICANT TRAUMA,25,MULTIPLE SIGNIFICANT TRAUMA,4,Extreme,Major,Surgical,Miscellaneous/Other,Medicaid,,,,Y,124630.33,71672.91
New York City,Manhattan,7002001,001438,Bellevue Hospital Center,50 to 69,100,M,Other Race,Unknown,10,Emergency,Inpatient Rehabilitation Facility,2022,INJ010,"Internal organ injury, initial encounter",HEP013,"HEPATOBILIARY AND PANCREATIC PROCEDURES, NEC",911,EXTENSIVE ABDOMINAL OR THORACIC PROCEDURES FOR MULTIPLE SIGNIFICANT TRAUMA,25,MULTIPLE SIGNIFICANT TRAUMA,4,Extreme,Extreme,Surgical,Medicaid,,,,,Y,178740.33,102790.70
Finger Lakes,Monroe,2701005,000413,Strong Memorial Hospital,50 to 69,144,F,White,Unknown,10,Emergency,Inpatient Rehabilitation Facility,2022,INJ008,"Traumatic brain injury (TBI); concussion, initial encounter",HEP001,LIVER BIOPSY,911,EXTENSIVE ABDOMINAL OR THORACIC PROCEDURES FOR MULTIPLE SIGNIFICANT TRAUMA,25,MULTIPLE SIGNIFICANT TRAUMA,4,Extreme,Extreme,Surgical,Miscellaneous/Other,Medicare,,,,Y,120104.30,48945.84
Finger Lakes,Monroe,2701005,000413,Strong Memorial Hospital,30 to 49,146,M,Multi-racial,Not Span/Hispanic,4,Emergency,Home or Self Care,2022,INJ010,"Internal organ injury, initial encounter",GIS005,EXPLORATION OF PERITONEAL CAVITY,911,EXTENSIVE ABDOMINAL OR THORACIC PROCEDURES FOR MULTIPLE SIGNIFICANT TRAUMA,25,MULTIPLE SIGNIFICANT TRAUMA,3,Major,Minor,Surgical,Medicaid,,,,,Y,51146.66,19394.42
Finger Lakes,Monroe,2701005,000413,Strong Memorial Hospital,70 or Older,144,M,Multi-racial,Unknown,27,Emergency,Skilled Nursing Home,2022,INJ016,"Injury to blood vessels, initial encounter",CAR010,LIGATION AND EMBOLIZATION OF VESSELS,911,EXTENSIVE ABDOMINAL OR THORACIC PROCEDURES FOR MULTIPLE SIGNIFICANT TRAUMA,25,MULTIPLE SIGNIFICANT TRAUMA,4,Extreme,Extreme,Surgical,Medicare,,,,,Y,558257.90,193088.63
Finger Lakes,Monroe,2701005,000413,Strong Memorial Hospital,70 or Older,146,F,White,Not Span/Hispanic,12,Emergency,Home w/ Home Health Services,2022,INJ010,"Internal organ injury, initial encounter",CAR010,LIGATION AND EMBOLIZATION OF VESSELS,911,EXTENSIVE ABDOMINAL OR THORACIC PROCEDURES FOR MULTIPLE SIGNIFICANT TRAUMA,25,MULTIPLE SIGNIFICANT TRAUMA,2,Moderate,Major,Surgical,Medicare,,,,,Y,143925.23,58228.05
New York City,Manhattan,7002054,001464,New York-Presbyterian Hospital - Columbia Presbyterian Center,0 to 17,OOS,F,Other Race,Not Span/Hispanic,46,Urgent,Cancer Center or Children's Hospital,2022,INJ006,"Fracture of the neck of the femur (hip), initial encounter",MST010,FEMUR FIXATION,911,EXTENSIVE ABDOMINAL OR THORACIC PROCEDURES FOR MULTIPLE SIGNIFICANT TRAUMA,25,MULTIPLE SIGNIFICANT TRAUMA,4,Extreme,Extreme,Surgical,Private Health Insurance,,,,,N,1776798.18,721019.49
Finger Lakes,Monroe,2701005,000413,Strong Memorial Hospital,18 to 29,145,M,Multi-racial,Not Span/Hispanic,9,Emergency,Home or Self Care,2022,INJ010,"Internal organ injury, initial encounter",CAR010,LIGATION AND EMBOLIZATION OF VESSELS,911,EXTENSIVE ABDOMINAL OR THORACIC PROCEDURES FOR MULTIPLE SIGNIFICANT TRAUMA,25,MULTIPLE SIGNIFICANT TRAUMA,4,Extreme,Major,Surgical,Private Health Insurance,,,,,Y,144835.52,60399.83
Finger Lakes,Monroe,2701005,000413,Strong Memorial Hospital,50 to 69,144,M,White,Not Span/Hispanic,1,Emergency,Expired,2022,INJ013,"Open wounds of trunk, initial encounter",RES005,CHEST TUBE PLACEMENT AND THERAPEUTIC THORACENTESIS,911,EXTENSIVE ABDOMINAL OR THORACIC PROCEDURES FOR MULTIPLE SIGNIFICANT TRAUMA,25,MULTIPLE SIGNIFICANT TRAUMA,4,Extreme,Extreme,Surgical,Miscellaneous/Other,Private Health Insurance,,,,Y,56826.51,17185.10
Finger Lakes,Monroe,2701005,000413,Strong Memorial Hospital,30 to 49,146,M,Other Race,Unknown,19,Emergency,Inpatient Rehabilitation Facility,2022,INJ002,"Fracture of the spine and back, initial encounter",RES002,"LUNG, PLEURA, OR DIAPHRAGM BIOPSY (NON-ENDOSCOPIC)",911,EXTENSIVE ABDOMINAL OR THORACIC PROCEDURES FOR MULTIPLE SIGNIFICANT TRAUMA,25,MULTIPLE SIGNIFICANT TRAUMA,4,Extreme,Major,Surgical,Medicaid,,,,,Y,122273.71,57075.32
Long Island,Nassau,2951001,000541,North Shore University Hospital,30 to 49,116,M,Black/African American,Not Span/Hispanic,8,Emergency,Home or Self Care,2022,INJ010,"Internal organ injury, initial encounter",LYM005,SPLENECTOMY,911,EXTENSIVE ABDOMINAL OR THORACIC PROCEDURES FOR MULTIPLE SIGNIFICANT TRAUMA,25,MULTIPLE SIGNIFICANT TRAUMA,4,Extreme,Extreme,Surgical,Private Health Insurance,,,,,Y,250274.55,45957.12
Finger Lakes,Monroe,2701005,000413,Strong Memorial Hospital,0 to 17,OOS,M,White,Not Span/Hispanic,6,Emergency,Home or Self Care,2022,INJ010,"Internal organ injury, initial encounter",LYM005,SPLENECTOMY,911,EXTENSIVE ABDOMINAL OR THORACIC PROCEDURES FOR MULTIPLE SIGNIFICANT TRAUMA,25,MULTIPLE SIGNIFICANT TRAUMA,2,Moderate,Moderate,Surgical,Private Health Insurance,,,,,Y,52075.91,23226.36
Finger Lakes,Monroe,2701005,000413,Strong Memorial Hospital,18 to 29,144,F,White,Not Span/Hispanic,6,Emergency,Home or Self Care,2022,INJ005,"Fracture of the lower limb (except hip), initial encounter",MST011,FIXATION OF LEG AND FOOT BONES,911,EXTENSIVE ABDOMINAL OR THORACIC PROCEDURES FOR MULTIPLE SIGNIFICANT TRAUMA,25,MULTIPLE SIGNIFICANT TRAUMA,4,Extreme,Major,Surgical,Miscellaneous/Other,Medicaid,,,,Y,129244.06,49370.13
Finger Lakes,Monroe,2701005,000413,Strong Memorial Hospital,30 to 49,146,M,Multi-racial,Not Span/Hispanic,20,Emergency,Home or Self Care,2022,INJ010,"Internal organ injury, initial encounter",GIS009,COLECTOMY,911,EXTENSIVE ABDOMINAL OR THORACIC PROCEDURES FOR MULTIPLE SIGNIFICANT TRAUMA,25,MULTIPLE SIGNIFICANT TRAUMA,4,Extreme,Moderate,Surgical,Medicaid,,,,,Y,151917.67,70875.77
Finger Lakes,Monroe,2701005,000413,Strong Memorial Hospital,30 to 49,146,M,Multi-racial,Not Span/Hispanic,5,Emergency,Home w/ Home Health Services,2022,INJ010,"Internal organ injury, initial encounter",GIS009,COLECTOMY,911,EXTENSIVE ABDOMINAL OR THORACIC PROCEDURES FOR MULTIPLE SIGNIFICANT TRAUMA,25,MULTIPLE SIGNIFICANT TRAUMA,2,Moderate,Minor,Surgical,Medicaid,,,,,Y,37023.48,16373.46
Finger Lakes,Monroe,2701005,000413,Strong Memorial Hospital,30 to 49,144,F,Multi-racial,Not Span/Hispanic,8,Emergency,Home or Self Care,2022,INJ010,"Internal organ injury, initial encounter",MST015,CLOSED REDUCTION OF BONES AND JOINTS,911,EXTENSIVE ABDOMINAL OR THORACIC PROCEDURES FOR MULTIPLE SIGNIFICANT TRAUMA,25,MULTIPLE SIGNIFICANT TRAUMA,4,Extreme,Major,Surgical,Miscellaneous/Other,Medicaid,,,,Y,140547.26,53610.02
Finger Lakes,Monroe,2701005,000413,Strong Memorial Hospital,18 to 29,145,F,White,Not Span/Hispanic,16,Emergency,Home or Self Care,2022,INJ010,"Internal organ injury, initial encounter",GIS009,COLECTOMY,911,EXTENSIVE ABDOMINAL OR THORACIC PROCEDURES FOR MULTIPLE SIGNIFICANT TRAUMA,25,MULTIPLE SIGNIFICANT TRAUMA,4,Extreme,Major,Surgical,Miscellaneous/Other,Medicaid,,,,Y,164944.12,68523.53
Finger Lakes,Monroe,2701005,000413,Strong Memorial Hospital,70 or Older,145,M,White,Not Span/Hispanic,6,Emergency,Home or Self Care,2022,INJ010,"Internal organ injury, initial encounter",LYM005,SPLENECTOMY,911,EXTENSIVE ABDOMINAL OR THORACIC PROCEDURES FOR MULTIPLE SIGNIFICANT TRAUMA,25,MULTIPLE SIGNIFICANT TRAUMA,4,Extreme,Extreme,Surgical,Medicare,,,,,Y,73443.00,25616.47
Finger Lakes,Monroe,2701005,000413,Strong Memorial Hospital,50 to 69,140,M,White,Unknown,4,Emergency,Home or Self Care,2022,INJ010,"Internal organ injury, initial encounter",CAR010,LIGATION AND EMBOLIZATION OF VESSELS,911,EXTENSIVE ABDOMINAL OR THORACIC PROCEDURES FOR MULTIPLE SIGNIFICANT TRAUMA,25,MULTIPLE SIGNIFICANT TRAUMA,2,Moderate,Moderate,Surgical,Medicaid,,,,,N,95960.97,36549.14
Long Island,Nassau,2951001,000541,North Shore University Hospital,30 to 49,114,M,Black/African American,Not Span/Hispanic,22,Urgent,Home or Self Care,2022,INJ010,"Internal organ injury, initial encounter",GIS009,COLECTOMY,911,EXTENSIVE ABDOMINAL OR THORACIC PROCEDURES FOR MULTIPLE SIGNIFICANT TRAUMA,25,MULTIPLE SIGNIFICANT TRAUMA,4,Extreme,Extreme,Surgical,Medicaid,Medicaid,,,,N,418033.70,69915.22