Hospital Service Area,Hospital County,Operating Certificate Number,Permanent Facility Id,Facility Name,Age Group,Zip Code - 3 digits,Gender,Race,Ethnicity,Length of Stay,Type of Admission,Patient Disposition,Discharge Year,CCS Diagnosis Code,CCS Diagnosis Description,CCS Procedure Code,CCS Procedure Description,APR DRG Code,APR DRG Description,APR MDC Code,APR MDC Description,APR Severity of Illness Code,APR Severity of Illness Description,APR Risk of Mortality,APR Medical Surgical Description,Payment Typology 1,Payment Typology 2,Payment Typology 3,Birth Weight,Abortion Edit Indicator,Emergency Department Indicator,Total Charges,Total Costs
New York City,Manhattan,7002001,001438,Bellevue Hospital Center,30 to 49,113,F,Other Race,Spanish/Hispanic,3,Emergency,Home or Self Care,2022,PRG020,Hypertension and hypertensive-related conditions complicating pregnancy; childbirth; and the puerperium,FRS008,CERVICAL DILATION,955,PRINCIPAL DIAGNOSIS INVALID AS DISCHARGE DIAGNOSIS,14,"PREGNANCY, CHILDBIRTH AND THE PUERPERIUM",0,,,Not Applicable,Medicaid,,,,,N,36654.00,21079.13
New York City,Manhattan,7002054,001464,New York-Presbyterian Hospital - Columbia Presbyterian Center,30 to 49,112,F,Other Race,Not Span/Hispanic,1,Emergency,Home or Self Care,2022,PRG023,Complications specified during childbirth,PGN001,FETAL HEART RATE MONITORING,955,PRINCIPAL DIAGNOSIS INVALID AS DISCHARGE DIAGNOSIS,14,"PREGNANCY, CHILDBIRTH AND THE PUERPERIUM",0,,,Not Applicable,Private Health Insurance,,,,,Y,15980.04,
Finger Lakes,Monroe,2701005,000413,Strong Memorial Hospital,30 to 49,145,F,White,Not Span/Hispanic,2,Urgent,Home or Self Care,2022,PRG019,Diabetes or abnormal glucose tolerance complicating pregnancy; childbirth; or the puerperium,PGN005,EPISIOTOMY,955,PRINCIPAL DIAGNOSIS INVALID AS DISCHARGE DIAGNOSIS,14,"PREGNANCY, CHILDBIRTH AND THE PUERPERIUM",0,,,Not Applicable,Blue Cross/Blue Shield,,,,,N,11099.60,5790.34
Finger Lakes,Monroe,2701005,000413,Strong Memorial Hospital,30 to 49,145,F,White,Not Span/Hispanic,3,Urgent,Home or Self Care,2022,PRG019,Diabetes or abnormal glucose tolerance complicating pregnancy; childbirth; or the puerperium,PGN002,SPONTANEOUS VAGINAL DELIVERY,955,PRINCIPAL DIAGNOSIS INVALID AS DISCHARGE DIAGNOSIS,14,"PREGNANCY, CHILDBIRTH AND THE PUERPERIUM",0,,,Not Applicable,Private Health Insurance,,,,,N,11932.09,6563.01
New York City,Manhattan,7002054,001464,New York-Presbyterian Hospital - Columbia Presbyterian Center,30 to 49,104,F,Multi-racial,Spanish/Hispanic,1,Emergency,Home or Self Care,2022,PRG020,Hypertension and hypertensive-related conditions complicating pregnancy; childbirth; and the puerperium,IMG005,MAGNETIC RESONANCE IMAGING (MRI),955,PRINCIPAL DIAGNOSIS INVALID AS DISCHARGE DIAGNOSIS,14,"PREGNANCY, CHILDBIRTH AND THE PUERPERIUM",0,,,Not Applicable,Medicaid,,,,,Y,32366.48,7209.12
Long Island,Nassau,2951001,000541,North Shore University Hospital,30 to 49,OOS,F,Black/African American,Not Span/Hispanic,2,Elective,Home or Self Care,2022,PRG023,Complications specified during childbirth,,,955,PRINCIPAL DIAGNOSIS INVALID AS DISCHARGE DIAGNOSIS,14,"PREGNANCY, CHILDBIRTH AND THE PUERPERIUM",0,,,Not Applicable,Medicaid,Medicaid,,,,N,35334.33,6981.82
Finger Lakes,Monroe,2701005,000413,Strong Memorial Hospital,18 to 29,145,F,Other Race,Unknown,1,Elective,Home or Self Care,2022,PRG024,"Malposition, disproportion or other labor complications",,,955,PRINCIPAL DIAGNOSIS INVALID AS DISCHARGE DIAGNOSIS,14,"PREGNANCY, CHILDBIRTH AND THE PUERPERIUM",0,,,Not Applicable,Blue Cross/Blue Shield,Private Health Insurance,,,,N,1861.46,1231.05
New York City,Manhattan,7002054,001464,New York-Presbyterian Hospital - Columbia Presbyterian Center,18 to 29,100,F,Other Race,Spanish/Hispanic,2,Emergency,Home or Self Care,2022,PRG023,Complications specified during childbirth,PGN002,SPONTANEOUS VAGINAL DELIVERY,955,PRINCIPAL DIAGNOSIS INVALID AS DISCHARGE DIAGNOSIS,14,"PREGNANCY, CHILDBIRTH AND THE PUERPERIUM",0,,,Not Applicable,Medicaid,,,,,N,33197.78,10985.62
New York City,Manhattan,7002054,001464,New York-Presbyterian Hospital - Columbia Presbyterian Center,30 to 49,,F,White,Not Span/Hispanic,5,Emergency,Home or Self Care,2022,PRG020,Hypertension and hypertensive-related conditions complicating pregnancy; childbirth; and the puerperium,PGN006,REMOVAL OF PLACENTA AND OTHER RETAINED PRODUCTS OF CONCEPTION,955,PRINCIPAL DIAGNOSIS INVALID AS DISCHARGE DIAGNOSIS,14,"PREGNANCY, CHILDBIRTH AND THE PUERPERIUM",0,,,Not Applicable,Blue Cross/Blue Shield,,,,,N,91998.39,27597.31
Finger Lakes,Monroe,2701005,000413,Strong Memorial Hospital,30 to 49,146,F,Black/African American,Not Span/Hispanic,5,Urgent,Home or Self Care,2022,PRG023,Complications specified during childbirth,,,955,PRINCIPAL DIAGNOSIS INVALID AS DISCHARGE DIAGNOSIS,14,"PREGNANCY, CHILDBIRTH AND THE PUERPERIUM",0,,,Not Applicable,Private Health Insurance,,,,,N,14575.52,7474.21
Finger Lakes,Monroe,2701005,000413,Strong Memorial Hospital,18 to 29,146,F,Other Race,Spanish/Hispanic,2,Urgent,Home or Self Care,2022,PRG023,Complications specified during childbirth,SKB005,PERINEAL SKIN REPAIR (1ST DEGREE OBSTETRICAL AND OTHER),955,PRINCIPAL DIAGNOSIS INVALID AS DISCHARGE DIAGNOSIS,14,"PREGNANCY, CHILDBIRTH AND THE PUERPERIUM",0,,,Not Applicable,Medicaid,,,,,N,10277.80,5537.12
Finger Lakes,Monroe,2701005,000413,Strong Memorial Hospital,18 to 29,144,F,White,Not Span/Hispanic,3,Elective,Home or Self Care,2022,PRG020,Hypertension and hypertensive-related conditions complicating pregnancy; childbirth; and the puerperium,FRS006,VULVAR LACERATION REPAIR,955,PRINCIPAL DIAGNOSIS INVALID AS DISCHARGE DIAGNOSIS,14,"PREGNANCY, CHILDBIRTH AND THE PUERPERIUM",0,,,Not Applicable,Medicaid,,,,,N,14030.93,7095.49
Long Island,Nassau,2951001,000541,North Shore University Hospital,30 to 49,110,F,Other Race,Not Span/Hispanic,2,Elective,Home or Self Care,2022,PRG023,Complications specified during childbirth,PGN002,SPONTANEOUS VAGINAL DELIVERY,955,PRINCIPAL DIAGNOSIS INVALID AS DISCHARGE DIAGNOSIS,14,"PREGNANCY, CHILDBIRTH AND THE PUERPERIUM",0,,,Not Applicable,Medicaid,Medicaid,,,,N,31739.81,7901.59
New York City,Manhattan,7002053,001463,NYU Langone Hospitals,18 to 29,112,F,White,Not Span/Hispanic,2,Elective,Home or Self Care,2022,PRG011,Early or threatened labor,PGN002,SPONTANEOUS VAGINAL DELIVERY,955,PRINCIPAL DIAGNOSIS INVALID AS DISCHARGE DIAGNOSIS,14,"PREGNANCY, CHILDBIRTH AND THE PUERPERIUM",0,,,Not Applicable,Medicaid,,,,,N,36723.43,9228.82
New York City,Manhattan,7002001,001438,Bellevue Hospital Center,30 to 49,112,F,Black/African American,Not Span/Hispanic,4,Emergency,Home or Self Care,2022,PRG019,Diabetes or abnormal glucose tolerance complicating pregnancy; childbirth; or the puerperium,PGN001,FETAL HEART RATE MONITORING,955,PRINCIPAL DIAGNOSIS INVALID AS DISCHARGE DIAGNOSIS,14,"PREGNANCY, CHILDBIRTH AND THE PUERPERIUM",0,,,Not Applicable,Private Health Insurance,Medicaid,,,,N,27163.07,15621.05
New York City,Manhattan,7002054,001464,New York-Presbyterian Hospital - Columbia Presbyterian Center,30 to 49,OOS,F,Black/African American,Unknown,2,Emergency,Home or Self Care,2022,PRG023,Complications specified during childbirth,,,955,PRINCIPAL DIAGNOSIS INVALID AS DISCHARGE DIAGNOSIS,14,"PREGNANCY, CHILDBIRTH AND THE PUERPERIUM",0,,,Not Applicable,Medicaid,,,,,N,22693.73,6962.02
Finger Lakes,Monroe,2701005,000413,Strong Memorial Hospital,18 to 29,145,F,Other Race,Unknown,1,Urgent,Home or Self Care,2022,PRG023,Complications specified during childbirth,PGN002,SPONTANEOUS VAGINAL DELIVERY,955,PRINCIPAL DIAGNOSIS INVALID AS DISCHARGE DIAGNOSIS,14,"PREGNANCY, CHILDBIRTH AND THE PUERPERIUM",0,,,Not Applicable,Blue Cross/Blue Shield,,,,,N,7704.81,3941.91
New York City,Manhattan,7002054,001464,New York-Presbyterian Hospital - Columbia Presbyterian Center,30 to 49,OOS,F,Multi-racial,Spanish/Hispanic,5,Emergency,Home or Self Care,2022,PRG020,Hypertension and hypertensive-related conditions complicating pregnancy; childbirth; and the puerperium,,,955,PRINCIPAL DIAGNOSIS INVALID AS DISCHARGE DIAGNOSIS,14,"PREGNANCY, CHILDBIRTH AND THE PUERPERIUM",0,,,Not Applicable,Private Health Insurance,,,,,Y,68224.66,19757.39
Hudson Valley,Dutchess,1302001,000181,Vassar Brothers Medical Center,18 to 29,126,F,Other Race,Not Span/Hispanic,4,Urgent,Home or Self Care,2022,PRG023,Complications specified during childbirth,,,955,PRINCIPAL DIAGNOSIS INVALID AS DISCHARGE DIAGNOSIS,14,"PREGNANCY, CHILDBIRTH AND THE PUERPERIUM",0,,,Not Applicable,Medicaid,,,,,N,26602.44,11678.87
Hudson Valley,Dutchess,1302001,000181,Vassar Brothers Medical Center,30 to 49,126,F,Other Race,Unknown,2,Urgent,Home or Self Care,2022,PRG023,Complications specified during childbirth,PGN002,SPONTANEOUS VAGINAL DELIVERY,955,PRINCIPAL DIAGNOSIS INVALID AS DISCHARGE DIAGNOSIS,14,"PREGNANCY, CHILDBIRTH AND THE PUERPERIUM",0,,,Not Applicable,Medicaid,,,,,N,12636.73,5703.91
New York City,Manhattan,7002054,001464,New York-Presbyterian Hospital - Columbia Presbyterian Center,30 to 49,109,F,Black/African American,Not Span/Hispanic,5,Emergency,Home or Self Care,2022,PRG023,Complications specified during childbirth,PGN001,FETAL HEART RATE MONITORING,955,PRINCIPAL DIAGNOSIS INVALID AS DISCHARGE DIAGNOSIS,14,"PREGNANCY, CHILDBIRTH AND THE PUERPERIUM",0,,,Not Applicable,Medicaid,,,,,Y,65399.73,19340.12
Finger Lakes,Monroe,2701005,000413,Strong Memorial Hospital,18 to 29,146,F,Black/African American,Not Span/Hispanic,1,Urgent,Home or Self Care,2022,PRG023,Complications specified during childbirth,PGN002,SPONTANEOUS VAGINAL DELIVERY,955,PRINCIPAL DIAGNOSIS INVALID AS DISCHARGE DIAGNOSIS,14,"PREGNANCY, CHILDBIRTH AND THE PUERPERIUM",0,,,Not Applicable,Medicaid,,,,,N,4437.36,1717.75
Capital/Adirond,Warren,5601000,001005,Glens Falls Hospital,30 to 49,128,F,White,Not Span/Hispanic,1,Elective,Short-term Hospital,2022,PRG020,Hypertension and hypertensive-related conditions complicating pregnancy; childbirth; and the puerperium,,,955,PRINCIPAL DIAGNOSIS INVALID AS DISCHARGE DIAGNOSIS,14,"PREGNANCY, CHILDBIRTH AND THE PUERPERIUM",0,,,Not Applicable,Blue Cross/Blue Shield,,,,,N,4796.42,3269.52
Capital/Adirond,Warren,5601000,001005,Glens Falls Hospital,30 to 49,128,F,Other Race,Not Span/Hispanic,1,Elective,Short-term Hospital,2022,PRG020,Hypertension and hypertensive-related conditions complicating pregnancy; childbirth; and the puerperium,,,955,PRINCIPAL DIAGNOSIS INVALID AS DISCHARGE DIAGNOSIS,14,"PREGNANCY, CHILDBIRTH AND THE PUERPERIUM",0,,,Not Applicable,Blue Cross/Blue Shield,,,,,N,4546.90,2796.30
Finger Lakes,Monroe,2701005,000413,Strong Memorial Hospital,30 to 49,146,F,Other Race,Spanish/Hispanic,2,Urgent,Home or Self Care,2022,PRG024,"Malposition, disproportion or other labor complications",PGN002,SPONTANEOUS VAGINAL DELIVERY,955,PRINCIPAL DIAGNOSIS INVALID AS DISCHARGE DIAGNOSIS,14,"PREGNANCY, CHILDBIRTH AND THE PUERPERIUM",0,,,Not Applicable,Medicaid,,,,,N,9761.10,5249.55
New York City,Manhattan,7002053,001463,NYU Langone Hospitals,30 to 49,100,F,White,Not Span/Hispanic,9,Emergency,Home or Self Care,2022,PRG023,Complications specified during childbirth,PGN002,SPONTANEOUS VAGINAL DELIVERY,955,PRINCIPAL DIAGNOSIS INVALID AS DISCHARGE DIAGNOSIS,14,"PREGNANCY, CHILDBIRTH AND THE PUERPERIUM",0,,,Not Applicable,Medicaid,,,,,Y,264706.05,81874.53
Finger Lakes,Monroe,2701005,000413,Strong Memorial Hospital,30 to 49,146,F,Black/African American,Not Span/Hispanic,2,Emergency,Home w/ Home Health Services,2022,PRG023,Complications specified during childbirth,PGN002,SPONTANEOUS VAGINAL DELIVERY,955,PRINCIPAL DIAGNOSIS INVALID AS DISCHARGE DIAGNOSIS,14,"PREGNANCY, CHILDBIRTH AND THE PUERPERIUM",0,,,Not Applicable,Medicaid,,,,,N,11860.19,5973.66
New York City,Manhattan,7002054,001464,New York-Presbyterian Hospital - Columbia Presbyterian Center,30 to 49,109,F,White,Not Span/Hispanic,2,Emergency,Home or Self Care,2022,PRG029,"Uncomplicated pregnancy, delivery or puerperium",,,955,PRINCIPAL DIAGNOSIS INVALID AS DISCHARGE DIAGNOSIS,14,"PREGNANCY, CHILDBIRTH AND THE PUERPERIUM",0,,,Not Applicable,Medicaid,,,,,Y,35932.43,8419.14
New York City,Manhattan,7002054,001464,New York-Presbyterian Hospital - Columbia Presbyterian Center,18 to 29,104,F,Other Race,Spanish/Hispanic,1,Emergency,Home or Self Care,2022,PRG023,Complications specified during childbirth,,,955,PRINCIPAL DIAGNOSIS INVALID AS DISCHARGE DIAGNOSIS,14,"PREGNANCY, CHILDBIRTH AND THE PUERPERIUM",0,,,Not Applicable,Medicaid,,,,,N,14834.54,
Finger Lakes,Monroe,2701005,000413,Strong Memorial Hospital,18 to 29,146,F,White,Spanish/Hispanic,2,Urgent,Home or Self Care,2022,PRG023,Complications specified during childbirth,SKB005,PERINEAL SKIN REPAIR (1ST DEGREE OBSTETRICAL AND OTHER),955,PRINCIPAL DIAGNOSIS INVALID AS DISCHARGE DIAGNOSIS,14,"PREGNANCY, CHILDBIRTH AND THE PUERPERIUM",0,,,Not Applicable,Medicaid,,,,,N,11052.33,5779.53
Finger Lakes,Monroe,2701005,000413,Strong Memorial Hospital,30 to 49,146,F,Black/African American,Not Span/Hispanic,3,Urgent,Home or Self Care,2022,PRG024,"Malposition, disproportion or other labor complications",,,955,PRINCIPAL DIAGNOSIS INVALID AS DISCHARGE DIAGNOSIS,14,"PREGNANCY, CHILDBIRTH AND THE PUERPERIUM",0,,,Not Applicable,Medicaid,,,,,N,12415.90,6152.98
Finger Lakes,Monroe,2701005,000413,Strong Memorial Hospital,18 to 29,144,F,White,Not Span/Hispanic,2,Urgent,Home or Self Care,2022,PRG024,"Malposition, disproportion or other labor complications",MST021,PERINEAL MUSCLE LACERATION REPAIR (2ND DEGREE OBSTETRICAL AND OTHER),955,PRINCIPAL DIAGNOSIS INVALID AS DISCHARGE DIAGNOSIS,14,"PREGNANCY, CHILDBIRTH AND THE PUERPERIUM",0,,,Not Applicable,Private Health Insurance,,,,,N,9889.69,5255.72
Finger Lakes,Monroe,2701005,000413,Strong Memorial Hospital,18 to 29,146,F,Black/African American,Not Span/Hispanic,1,Elective,Home w/ Home Health Services,2022,PRG023,Complications specified during childbirth,MST021,PERINEAL MUSCLE LACERATION REPAIR (2ND DEGREE OBSTETRICAL AND OTHER),955,PRINCIPAL DIAGNOSIS INVALID AS DISCHARGE DIAGNOSIS,14,"PREGNANCY, CHILDBIRTH AND THE PUERPERIUM",0,,,Not Applicable,Medicaid,,,,,Y,10428.43,4916.77
New York City,Manhattan,7002054,001464,New York-Presbyterian Hospital - Columbia Presbyterian Center,30 to 49,104,F,Other Race,Spanish/Hispanic,1,Emergency,Home or Self Care,2022,PRG023,Complications specified during childbirth,ADM021,"ADMINISTRATION OF THERAPEUTIC SUBSTANCES, NEC",955,PRINCIPAL DIAGNOSIS INVALID AS DISCHARGE DIAGNOSIS,14,"PREGNANCY, CHILDBIRTH AND THE PUERPERIUM",0,,,Not Applicable,Medicaid,,,,,N,17513.40,4792.95
Capital/Adirond,Warren,5601000,001005,Glens Falls Hospital,18 to 29,128,F,White,Not Span/Hispanic,1,Elective,Home or Self Care,2022,PRG023,Complications specified during childbirth,,,955,PRINCIPAL DIAGNOSIS INVALID AS DISCHARGE DIAGNOSIS,14,"PREGNANCY, CHILDBIRTH AND THE PUERPERIUM",0,,,Not Applicable,Medicaid,,,,,N,4177.89,2875.33
Finger Lakes,Monroe,2701005,000413,Strong Memorial Hospital,18 to 29,146,F,Black/African American,Not Span/Hispanic,2,Urgent,Home or Self Care,2022,PRG023,Complications specified during childbirth,MST021,PERINEAL MUSCLE LACERATION REPAIR (2ND DEGREE OBSTETRICAL AND OTHER),955,PRINCIPAL DIAGNOSIS INVALID AS DISCHARGE DIAGNOSIS,14,"PREGNANCY, CHILDBIRTH AND THE PUERPERIUM",0,,,Not Applicable,Medicaid,,,,,N,10502.01,5545.45
Finger Lakes,Monroe,2701005,000413,Strong Memorial Hospital,30 to 49,144,F,White,Not Span/Hispanic,2,Urgent,Home or Self Care,2022,PRG023,Complications specified during childbirth,SKB005,PERINEAL SKIN REPAIR (1ST DEGREE OBSTETRICAL AND OTHER),955,PRINCIPAL DIAGNOSIS INVALID AS DISCHARGE DIAGNOSIS,14,"PREGNANCY, CHILDBIRTH AND THE PUERPERIUM",0,,,Not Applicable,Blue Cross/Blue Shield,,,,,N,10493.89,5476.82
Finger Lakes,Monroe,2701005,000413,Strong Memorial Hospital,18 to 29,145,F,Multi-racial,Not Span/Hispanic,1,Elective,Home or Self Care,2022,PRG024,"Malposition, disproportion or other labor complications",GIS020,ANORECTAL REPAIR (3RD AND 4TH DEGREE OBSTETRICAL REPAIRS AND OTHER),955,PRINCIPAL DIAGNOSIS INVALID AS DISCHARGE DIAGNOSIS,14,"PREGNANCY, CHILDBIRTH AND THE PUERPERIUM",0,,,Not Applicable,Blue Cross/Blue Shield,Medicaid,,,,N,7671.41,3927.16
Finger Lakes,Monroe,2701005,000413,Strong Memorial Hospital,18 to 29,146,F,Black/African American,Not Span/Hispanic,2,Urgent,Home w/ Home Health Services,2022,PRG023,Complications specified during childbirth,FRS006,VULVAR LACERATION REPAIR,955,PRINCIPAL DIAGNOSIS INVALID AS DISCHARGE DIAGNOSIS,14,"PREGNANCY, CHILDBIRTH AND THE PUERPERIUM",0,,,Not Applicable,Medicaid,,,,,Y,12757.77,6189.46
Finger Lakes,Monroe,2701005,000413,Strong Memorial Hospital,18 to 29,144,F,White,Not Span/Hispanic,4,Elective,Home or Self Care,2022,PRG023,Complications specified during childbirth,MST021,PERINEAL MUSCLE LACERATION REPAIR (2ND DEGREE OBSTETRICAL AND OTHER),955,PRINCIPAL DIAGNOSIS INVALID AS DISCHARGE DIAGNOSIS,14,"PREGNANCY, CHILDBIRTH AND THE PUERPERIUM",0,,,Not Applicable,Blue Cross/Blue Shield,,,,,N,17595.56,8638.69
Finger Lakes,Monroe,2701005,000413,Strong Memorial Hospital,30 to 49,144,F,White,Not Span/Hispanic,4,Elective,Home or Self Care,2022,PRG023,Complications specified during childbirth,MST021,PERINEAL MUSCLE LACERATION REPAIR (2ND DEGREE OBSTETRICAL AND OTHER),955,PRINCIPAL DIAGNOSIS INVALID AS DISCHARGE DIAGNOSIS,14,"PREGNANCY, CHILDBIRTH AND THE PUERPERIUM",0,,,Not Applicable,Blue Cross/Blue Shield,,,,,N,14721.16,8015.39
Finger Lakes,Monroe,2701005,000413,Strong Memorial Hospital,30 to 49,145,F,White,Not Span/Hispanic,15,Urgent,Home w/ Home Health Services,2022,PRG020,Hypertension and hypertensive-related conditions complicating pregnancy; childbirth; and the puerperium,FRS007,FEMALE GENITAL TRACT REPAIR (EXCLUDING VULVA),955,PRINCIPAL DIAGNOSIS INVALID AS DISCHARGE DIAGNOSIS,14,"PREGNANCY, CHILDBIRTH AND THE PUERPERIUM",0,,,Not Applicable,Private Health Insurance,,,,,N,49914.13,27603.78
New York City,Manhattan,7002001,001438,Bellevue Hospital Center,18 to 29,112,F,Other Race,Spanish/Hispanic,1,Urgent,Home or Self Care,2022,PRG023,Complications specified during childbirth,,,955,PRINCIPAL DIAGNOSIS INVALID AS DISCHARGE DIAGNOSIS,14,"PREGNANCY, CHILDBIRTH AND THE PUERPERIUM",0,,,Not Applicable,Medicaid,,,,,N,5073.00,2917.40
Long Island,Nassau,2951001,000541,North Shore University Hospital,30 to 49,110,F,Other Race,Spanish/Hispanic,4,Elective,Home or Self Care,2022,PRG023,Complications specified during childbirth,PGN001,FETAL HEART RATE MONITORING,955,PRINCIPAL DIAGNOSIS INVALID AS DISCHARGE DIAGNOSIS,14,"PREGNANCY, CHILDBIRTH AND THE PUERPERIUM",0,,,Not Applicable,Medicaid,Medicaid,,,,N,63424.50,13199.86
Long Island,Nassau,2951001,000541,North Shore University Hospital,30 to 49,110,F,Other Race,Spanish/Hispanic,6,Not Available,Home or Self Care,2022,PRG024,"Malposition, disproportion or other labor complications",,,955,PRINCIPAL DIAGNOSIS INVALID AS DISCHARGE DIAGNOSIS,14,"PREGNANCY, CHILDBIRTH AND THE PUERPERIUM",0,,,Not Applicable,Medicaid,Medicaid,,,,N,76216.20,13985.17
New York City,Manhattan,7002053,001463,NYU Langone Hospitals,0 to 17,100,M,White,Not Span/Hispanic,1,Emergency,Home or Self Care,2022,PNL013,Other specified and unspecified perinatal conditions,,,955,PRINCIPAL DIAGNOSIS INVALID AS DISCHARGE DIAGNOSIS,15,NEWBORNS AND OTHER NEONATES WITH CONDITIONS ORIGINATING IN THE PERINATAL PERIOD,0,,,Not Applicable,Private Health Insurance,,,,,Y,19844.98,4473.67
Finger Lakes,Monroe,2701005,000413,Strong Memorial Hospital,30 to 49,144,F,White,Not Span/Hispanic,1,Urgent,Home or Self Care,2022,PRG023,Complications specified during childbirth,FRS006,VULVAR LACERATION REPAIR,955,PRINCIPAL DIAGNOSIS INVALID AS DISCHARGE DIAGNOSIS,14,"PREGNANCY, CHILDBIRTH AND THE PUERPERIUM",0,,,Not Applicable,Medicaid,,,,,N,8267.60,4126.54
New York City,Manhattan,7002001,001438,Bellevue Hospital Center,30 to 49,100,F,Black/African American,Unknown,1,Emergency,Home or Self Care,2022,PRG023,Complications specified during childbirth,PGN001,FETAL HEART RATE MONITORING,955,PRINCIPAL DIAGNOSIS INVALID AS DISCHARGE DIAGNOSIS,14,"PREGNANCY, CHILDBIRTH AND THE PUERPERIUM",0,,,Not Applicable,Medicaid,,,,,N,5769.16,3317.75
Finger Lakes,Monroe,2701005,000413,Strong Memorial Hospital,30 to 49,146,F,White,Not Span/Hispanic,1,Urgent,Home or Self Care,2022,PRG023,Complications specified during childbirth,MST021,PERINEAL MUSCLE LACERATION REPAIR (2ND DEGREE OBSTETRICAL AND OTHER),955,PRINCIPAL DIAGNOSIS INVALID AS DISCHARGE DIAGNOSIS,14,"PREGNANCY, CHILDBIRTH AND THE PUERPERIUM",0,,,Not Applicable,Private Health Insurance,,,,,N,8139.44,4069.93
Finger Lakes,Monroe,2701005,000413,Strong Memorial Hospital,30 to 49,145,F,Black/African American,Spanish/Hispanic,4,Urgent,Home w/ Home Health Services,2022,PRG011,Early or threatened labor,SKB005,PERINEAL SKIN REPAIR (1ST DEGREE OBSTETRICAL AND OTHER),955,PRINCIPAL DIAGNOSIS INVALID AS DISCHARGE DIAGNOSIS,14,"PREGNANCY, CHILDBIRTH AND THE PUERPERIUM",0,,,Not Applicable,Medicaid,,,,,N,19132.71,9921.23
Finger Lakes,Monroe,2701005,000413,Strong Memorial Hospital,30 to 49,145,F,White,Not Span/Hispanic,1,Urgent,Home or Self Care,2022,PRG024,"Malposition, disproportion or other labor complications",SKB005,PERINEAL SKIN REPAIR (1ST DEGREE OBSTETRICAL AND OTHER),955,PRINCIPAL DIAGNOSIS INVALID AS DISCHARGE DIAGNOSIS,14,"PREGNANCY, CHILDBIRTH AND THE PUERPERIUM",0,,,Not Applicable,Blue Cross/Blue Shield,,,,,N,8134.32,4065.74
Finger Lakes,Monroe,2701005,000413,Strong Memorial Hospital,18 to 29,146,F,Black/African American,Not Span/Hispanic,7,Emergency,Home w/ Home Health Services,2022,PRG023,Complications specified during childbirth,ADM008,CERVICAL RIPENING,955,PRINCIPAL DIAGNOSIS INVALID AS DISCHARGE DIAGNOSIS,14,"PREGNANCY, CHILDBIRTH AND THE PUERPERIUM",0,,,Not Applicable,Medicaid,,,,,Y,56252.19,25364.47
New York City,Manhattan,7002053,001463,NYU Langone Hospitals,30 to 49,100,F,Black/African American,Not Span/Hispanic,2,Emergency,Home or Self Care,2022,PRG023,Complications specified during childbirth,MAM011,ELECTROENCEPHALOGRAM (EEG),955,PRINCIPAL DIAGNOSIS INVALID AS DISCHARGE DIAGNOSIS,14,"PREGNANCY, CHILDBIRTH AND THE PUERPERIUM",0,,,Not Applicable,Medicaid,,,,,Y,112263.74,21339.47
Capital/Adirond,Warren,5601000,001005,Glens Falls Hospital,18 to 29,128,F,White,Not Span/Hispanic,1,Elective,Home or Self Care,2022,PRG011,Early or threatened labor,,,955,PRINCIPAL DIAGNOSIS INVALID AS DISCHARGE DIAGNOSIS,14,"PREGNANCY, CHILDBIRTH AND THE PUERPERIUM",0,,,Not Applicable,Medicaid,,,,,N,7626.91,3788.43
Western NY,Cattaraugus,0401001,000066,Olean General Hospital,18 to 29,147,F,White,Not Span/Hispanic,2,Elective,Home or Self Care,2022,PRG029,"Uncomplicated pregnancy, delivery or puerperium",PGN004,ASSISTED VAGINAL DELIVERY,955,PRINCIPAL DIAGNOSIS INVALID AS DISCHARGE DIAGNOSIS,14,"PREGNANCY, CHILDBIRTH AND THE PUERPERIUM",0,,,Not Applicable,Medicaid,,,,,N,4581.08,2715.87
