Hospital Service Area,Hospital County,Operating Certificate Number,Permanent Facility Id,Facility Name,Age Group,Zip Code - 3 digits,Gender,Race,Ethnicity,Length of Stay,Type of Admission,Patient Disposition,Discharge Year,CCS Diagnosis Code,CCS Diagnosis Description,CCS Procedure Code,CCS Procedure Description,APR DRG Code,APR DRG Description,APR MDC Code,APR MDC Description,APR Severity of Illness Code,APR Severity of Illness Description,APR Risk of Mortality,APR Medical Surgical Description,Payment Typology 1,Payment Typology 2,Payment Typology 3,Birth Weight,Abortion Edit Indicator,Emergency Department Indicator,Total Charges,Total Costs
New York City,Kings,7002053,001304,NYU Langone Hospital-Brooklyn,50 to 69,112,M,White,Not Span/Hispanic,28,Emergency,Home or Self Care,2019,NEO002,HEAD AND NECK CANCERS - LIP AND ORAL CAVITY,ENT003,ENT DIAGNOSTIC PROCEDURES (NON-ENDOSCOPIC),110,"EAR, NOSE, MOUTH, THROAT, CRANIAL/FACIAL MALIGNANCIES",03,"DISEASES AND DISORDERS OF THE EAR, NOSE, MOUTH AND THROAT",3,Major,Moderate,Medical,Medicare,Medicaid,,,,true,244240.21,96010.38
Long Island,Suffolk,5151001,000245,Stony Brook University Hospital,50 to 69,117,M,White,Not Span/Hispanic,4,Emergency,Home w/ Home Health Services,2019,NEO003,HEAD AND NECK CANCERS - THROAT,MST003,"SUBCUTANEOUS TISSUE, FASCIA, AND MUSCLE BIOPSY",110,"EAR, NOSE, MOUTH, THROAT, CRANIAL/FACIAL MALIGNANCIES",03,"DISEASES AND DISORDERS OF THE EAR, NOSE, MOUTH AND THROAT",3,Major,Moderate,Medical,Medicare,,,,,true,61048.89,17530.23
New York City,Manhattan,7002054,001458,New York-Presbyterian Hospital - New York Weill Cornell Center,50 to 69,104,M,Multi-racial,Not Span/Hispanic,7,Emergency,Home or Self Care,2019,NEO003,HEAD AND NECK CANCERS - THROAT,ADM017,ADMINISTRATION OF NUTRITIONAL AND ELECTROLYTIC SUBSTANCES,110,"EAR, NOSE, MOUTH, THROAT, CRANIAL/FACIAL MALIGNANCIES",03,"DISEASES AND DISORDERS OF THE EAR, NOSE, MOUTH AND THROAT",3,Major,Major,Medical,"Managed Care, Unspecified",Medicaid,Self-Pay,,,true,98102.72,22191.71
New York City,Bronx,7000006,001169,Montefiore Medical Center - Henry & Lucy Moses Div,30 to 49,104,M,Black/African American,Not Span/Hispanic,7,Emergency,Home or Self Care,2019,NEO004,HEAD AND NECK CANCERS - SALIVARY GLAND,ADM001,TRANSFUSION OF BLOOD AND BLOOD PRODUCTS,110,"EAR, NOSE, MOUTH, THROAT, CRANIAL/FACIAL MALIGNANCIES",03,"DISEASES AND DISORDERS OF THE EAR, NOSE, MOUTH AND THROAT",3,Major,Moderate,Medical,Medicaid,,,,,true,168273.59,30229.24
Hudson Valley,Orange,3529000,000704,St Anthony Community Hospital,50 to 69,109,F,White,Not Span/Hispanic,7,Emergency,Skilled Nursing Home,2019,NEO008,HEAD AND NECK CANCERS - LARYNGEAL,RES010,TRACHEOSTOMY,110,"EAR, NOSE, MOUTH, THROAT, CRANIAL/FACIAL MALIGNANCIES",03,"DISEASES AND DISORDERS OF THE EAR, NOSE, MOUTH AND THROAT",4,Extreme,Moderate,Medical,Medicare,,,,,true,177687.13,32249.29
Western NY,Erie,1401005,000210,Erie County Medical Center,50 to 69,142,F,Other Race,Not Span/Hispanic,32,Elective,Home w/ Home Health Services,2019,NEO010,HEAD AND NECK CANCERS - ALL OTHER TYPES,ADM012,CHEMOTHERAPY,110,"EAR, NOSE, MOUTH, THROAT, CRANIAL/FACIAL MALIGNANCIES",03,"DISEASES AND DISORDERS OF THE EAR, NOSE, MOUTH AND THROAT",4,Extreme,Extreme,Medical,Medicaid,,,,,false,79089.44,55144.17
New York City,Queens,7003004,001630,Long Island Jewish Medical Center,70 or Older,115,F,White,Not Span/Hispanic,1,Urgent,Home or Self Care,2019,NEO002,HEAD AND NECK CANCERS - LIP AND ORAL CAVITY,GIS017,GASTROSTOMY,110,"EAR, NOSE, MOUTH, THROAT, CRANIAL/FACIAL MALIGNANCIES",03,"DISEASES AND DISORDERS OF THE EAR, NOSE, MOUTH AND THROAT",3,Major,Major,Medical,Medicare,Medicare,Medicaid,,,false,15110.02,3098.19
Capital/Adirond,Schenectady,4601001,000829,Ellis Hospital,50 to 69,123,M,White,Not Span/Hispanic,11,Emergency,Hospice - Home,2019,NEO008,HEAD AND NECK CANCERS - LARYNGEAL,,,110,"EAR, NOSE, MOUTH, THROAT, CRANIAL/FACIAL MALIGNANCIES",03,"DISEASES AND DISORDERS OF THE EAR, NOSE, MOUTH AND THROAT",4,Extreme,Major,Medical,Miscellaneous/Other,Medicaid,,,,false,34593.25,12617.14
Capital/Adirond,Albany,0101004,000005,St. Peter's Hospital,50 to 69,120,M,Other Race,Not Span/Hispanic,2,Emergency,Short-term Hospital,2019,NEO008,HEAD AND NECK CANCERS - LARYNGEAL,CAR025,PLACEMENT OF TUNNELED OR IMPLANTABLE PORTION OF A VASCULAR ACCESS DEVICE,110,"EAR, NOSE, MOUTH, THROAT, CRANIAL/FACIAL MALIGNANCIES",03,"DISEASES AND DISORDERS OF THE EAR, NOSE, MOUTH AND THROAT",3,Major,Major,Medical,Medicare,Medicaid,,,,true,21849.55,7675.33
Central NY,Onondaga,3301007,000635,University Hospital SUNY Health Science Center,70 or Older,130,M,White,Not Span/Hispanic,1,Emergency,Home or Self Care,2019,NEO006,HEAD AND NECK CANCERS - HYPOPHARYNGEAL,ADM017,ADMINISTRATION OF NUTRITIONAL AND ELECTROLYTIC SUBSTANCES,110,"EAR, NOSE, MOUTH, THROAT, CRANIAL/FACIAL MALIGNANCIES",03,"DISEASES AND DISORDERS OF THE EAR, NOSE, MOUTH AND THROAT",3,Major,Major,Medical,Medicare,Federal/State/Local/VA,,,,false,5215.6,1472.5
New York City,Kings,7001020,001305,Maimonides Medical Center,50 to 69,112,M,Other Race,Not Span/Hispanic,5,Elective,Home or Self Care,2019,NEO002,HEAD AND NECK CANCERS - LIP AND ORAL CAVITY,ENT009,TONGUE EXCISION,110,"EAR, NOSE, MOUTH, THROAT, CRANIAL/FACIAL MALIGNANCIES",03,"DISEASES AND DISORDERS OF THE EAR, NOSE, MOUTH AND THROAT",2,Moderate,Minor,Medical,Medicaid,Medicaid,Self-Pay,,,false,46904.08,14143.55
New York City,Kings,7002002,001324,Mount Sinai Brooklyn,70 or Older,112,M,White,Not Span/Hispanic,4,Emergency,Home or Self Care,2019,NEO002,HEAD AND NECK CANCERS - LIP AND ORAL CAVITY,ENT003,ENT DIAGNOSTIC PROCEDURES (NON-ENDOSCOPIC),110,"EAR, NOSE, MOUTH, THROAT, CRANIAL/FACIAL MALIGNANCIES",03,"DISEASES AND DISORDERS OF THE EAR, NOSE, MOUTH AND THROAT",2,Moderate,Minor,Medical,Private Health Insurance,Medicare,Self-Pay,,,true,49482.28,8316.25
New York City,Bronx,7000008,001172,Lincoln Medical & Mental Health Center,30 to 49,104,M,Black/African American,Not Span/Hispanic,3,Emergency,Left Against Medical Advice,2019,NEO004,HEAD AND NECK CANCERS - SALIVARY GLAND,ADM001,TRANSFUSION OF BLOOD AND BLOOD PRODUCTS,110,"EAR, NOSE, MOUTH, THROAT, CRANIAL/FACIAL MALIGNANCIES",03,"DISEASES AND DISORDERS OF THE EAR, NOSE, MOUTH AND THROAT",2,Moderate,Minor,Medical,Medicaid,Medicaid,,,,true,17172.53,10141.36
New York City,Manhattan,7002054,001458,New York-Presbyterian Hospital - New York Weill Cornell Center,30 to 49,111,F,Other Race,Not Span/Hispanic,3,Emergency,Expired,2019,NEO003,HEAD AND NECK CANCERS - THROAT,ADM001,TRANSFUSION OF BLOOD AND BLOOD PRODUCTS,110,"EAR, NOSE, MOUTH, THROAT, CRANIAL/FACIAL MALIGNANCIES",03,"DISEASES AND DISORDERS OF THE EAR, NOSE, MOUTH AND THROAT",4,Extreme,Extreme,Medical,"Managed Care, Unspecified",Medicaid,Self-Pay,,,true,62689.73,26214.03
Southern Tier,Broome,0303001,000058,United Health Services Hospitals Inc. - Wilson Medical Center,50 to 69,137,F,Black/African American,Not Span/Hispanic,1,Emergency,Hospice - Home,2019,NEO008,HEAD AND NECK CANCERS - LARYNGEAL,,,110,"EAR, NOSE, MOUTH, THROAT, CRANIAL/FACIAL MALIGNANCIES",03,"DISEASES AND DISORDERS OF THE EAR, NOSE, MOUTH AND THROAT",3,Major,Moderate,Medical,Medicaid,Medicaid,,,,true,5660.1,2592.43
Western NY,Erie,1404000,000267,Kenmore Mercy Hospital,30 to 49,141,M,White,Not Span/Hispanic,3,Urgent,Short-term Hospital,2019,NEO008,HEAD AND NECK CANCERS - LARYNGEAL,ENT001,LARYNGOSCOPY (DIAGNOSTIC),110,"EAR, NOSE, MOUTH, THROAT, CRANIAL/FACIAL MALIGNANCIES",03,"DISEASES AND DISORDERS OF THE EAR, NOSE, MOUTH AND THROAT",4,Extreme,Major,Medical,Private Health Insurance,,,,,false,25929.03,6733.85
New York City,Manhattan,7002054,001458,New York-Presbyterian Hospital - New York Weill Cornell Center,70 or Older,100,F,Multi-racial,Not Span/Hispanic,3,Emergency,Expired,2019,NEO024,SARCOMA,RES007,AIRWAY INTUBATION,110,"EAR, NOSE, MOUTH, THROAT, CRANIAL/FACIAL MALIGNANCIES",03,"DISEASES AND DISORDERS OF THE EAR, NOSE, MOUTH AND THROAT",4,Extreme,Major,Medical,Medicare,Private Health Insurance,Self-Pay,,,true,70458.74,32388.89
New York City,Manhattan,7002054,001464,New York-Presbyterian Hospital - Columbia Presbyterian Center,50 to 69,117,F,Other Race,Not Span/Hispanic,5,Emergency,Home or Self Care,2019,NEO023,BONE CANCER,,,110,"EAR, NOSE, MOUTH, THROAT, CRANIAL/FACIAL MALIGNANCIES",03,"DISEASES AND DISORDERS OF THE EAR, NOSE, MOUTH AND THROAT",3,Major,Major,Medical,Medicaid,Medicaid,Self-Pay,,,true,65501.08,14582.46
New York City,Queens,7003010,001637,New York - Presbyterian/Queens,70 or Older,114,F,Multi-racial,Not Span/Hispanic,7,Emergency,Skilled Nursing Home,2019,NEO002,HEAD AND NECK CANCERS - LIP AND ORAL CAVITY,MST003,"SUBCUTANEOUS TISSUE, FASCIA, AND MUSCLE BIOPSY",110,"EAR, NOSE, MOUTH, THROAT, CRANIAL/FACIAL MALIGNANCIES",03,"DISEASES AND DISORDERS OF THE EAR, NOSE, MOUTH AND THROAT",4,Extreme,Extreme,Medical,Medicare,Self-Pay,,,,true,102604.13,23442.38
Central NY,Onondaga,3301007,000635,University Hospital SUNY Health Science Center,50 to 69,131,M,White,Not Span/Hispanic,5,Emergency,Home or Self Care,2019,NEO002,HEAD AND NECK CANCERS - LIP AND ORAL CAVITY,RES010,TRACHEOSTOMY,110,"EAR, NOSE, MOUTH, THROAT, CRANIAL/FACIAL MALIGNANCIES",03,"DISEASES AND DISORDERS OF THE EAR, NOSE, MOUTH AND THROAT",4,Extreme,Minor,Medical,Medicaid,,,,,true,47054.72,13967.85
New York City,Manhattan,7002054,001464,New York-Presbyterian Hospital - Columbia Presbyterian Center,50 to 69,100,F,Other Race,Not Span/Hispanic,22,Emergency,Expired,2019,NEO002,HEAD AND NECK CANCERS - LIP AND ORAL CAVITY,ADM001,TRANSFUSION OF BLOOD AND BLOOD PRODUCTS,110,"EAR, NOSE, MOUTH, THROAT, CRANIAL/FACIAL MALIGNANCIES",03,"DISEASES AND DISORDERS OF THE EAR, NOSE, MOUTH AND THROAT",4,Extreme,Major,Medical,Medicaid,Medicaid,Self-Pay,,,true,288830.93,77020.55
New York City,Kings,7001035,001318,Wyckoff Heights Medical Center,50 to 69,112,F,Other Race,Not Span/Hispanic,2,Emergency,Left Against Medical Advice,2019,NEO010,HEAD AND NECK CANCERS - ALL OTHER TYPES,,,110,"EAR, NOSE, MOUTH, THROAT, CRANIAL/FACIAL MALIGNANCIES",03,"DISEASES AND DISORDERS OF THE EAR, NOSE, MOUTH AND THROAT",1,Minor,Minor,Medical,Medicaid,Miscellaneous/Other,,,,true,14484.46,5259.32
New York City,Manhattan,7002032,001466,Mount Sinai West,50 to 69,113,F,Other Race,Spanish/Hispanic,1,Elective,Home or Self Care,2019,NEO002,HEAD AND NECK CANCERS - LIP AND ORAL CAVITY,ENT012,"ENT EXCISION (EXCLUDING NASAL PASSAGE, SINUSES, TONGUE, SALIVARY GLANDS, LARYNX)",110,"EAR, NOSE, MOUTH, THROAT, CRANIAL/FACIAL MALIGNANCIES",03,"DISEASES AND DISORDERS OF THE EAR, NOSE, MOUTH AND THROAT",1,Minor,Minor,Medical,Medicaid,Medicaid,Self-Pay,,,false,49897.85,16254.53
Southern Tier,Chenango,0824000,000128,Chenango Memorial Hospital Inc,70 or Older,138,M,White,Not Span/Hispanic,6,Emergency,Expired,2019,NEO007,HEAD AND NECK CANCERS - PHARYNGEAL,,,110,"EAR, NOSE, MOUTH, THROAT, CRANIAL/FACIAL MALIGNANCIES",03,"DISEASES AND DISORDERS OF THE EAR, NOSE, MOUTH AND THROAT",3,Major,Major,Medical,Miscellaneous/Other,Medicare,,,,true,26843,9924.47
New York City,Manhattan,7002054,001458,New York-Presbyterian Hospital - New York Weill Cornell Center,50 to 69,105,M,White,Not Span/Hispanic,6,Elective,Home w/ Home Health Services,2019,NEO002,HEAD AND NECK CANCERS - LIP AND ORAL CAVITY,ENT009,TONGUE EXCISION,110,"EAR, NOSE, MOUTH, THROAT, CRANIAL/FACIAL MALIGNANCIES",03,"DISEASES AND DISORDERS OF THE EAR, NOSE, MOUTH AND THROAT",4,Extreme,Major,Medical,Medicare,Blue Cross/Blue Shield,Self-Pay,,,false,256316.78,97723.72
New York City,Manhattan,7002017,001450,Lenox Hill Hospital,50 to 69,113,M,White,Not Span/Hispanic,5,Emergency,Home or Self Care,2019,NEO010,HEAD AND NECK CANCERS - ALL OTHER TYPES,CAR025,PLACEMENT OF TUNNELED OR IMPLANTABLE PORTION OF A VASCULAR ACCESS DEVICE,110,"EAR, NOSE, MOUTH, THROAT, CRANIAL/FACIAL MALIGNANCIES",03,"DISEASES AND DISORDERS OF THE EAR, NOSE, MOUTH AND THROAT",2,Moderate,Minor,Medical,Medicaid,Medicaid,,,,true,63627.44,10302.16
New York City,Manhattan,7002017,001450,Lenox Hill Hospital,50 to 69,OOS,M,Other Race,Not Span/Hispanic,4,Elective,Home w/ Home Health Services,2019,NEO007,HEAD AND NECK CANCERS - PHARYNGEAL,ENT002,ENT DIAGNOSTIC ENDOSCOPY (EXCLUDING LARYNGOSCOPY),110,"EAR, NOSE, MOUTH, THROAT, CRANIAL/FACIAL MALIGNANCIES",03,"DISEASES AND DISORDERS OF THE EAR, NOSE, MOUTH AND THROAT",2,Moderate,Major,Medical,Medicare,,,,,false,75119.43,14949.94
Western NY,Erie,1401010,000216,Roswell Park Cancer Institute,30 to 49,141,F,White,Not Span/Hispanic,1,Elective,Home or Self Care,2019,NEO010,HEAD AND NECK CANCERS - ALL OTHER TYPES,ENT008,NASAL AND SINUS EXCISION,110,"EAR, NOSE, MOUTH, THROAT, CRANIAL/FACIAL MALIGNANCIES",03,"DISEASES AND DISORDERS OF THE EAR, NOSE, MOUTH AND THROAT",2,Moderate,Minor,Medical,Blue Cross/Blue Shield,Private Health Insurance,,,,false,31122.05,12276.36
New York City,Bronx,7000011,001175,Calvary Hospital Inc,50 to 69,107,M,White,Not Span/Hispanic,20,Elective,Expired,2019,NEO010,HEAD AND NECK CANCERS - ALL OTHER TYPES,ADM021,"ADMINISTRATION OF THERAPEUTIC SUBSTANCES, NEC",110,"EAR, NOSE, MOUTH, THROAT, CRANIAL/FACIAL MALIGNANCIES",03,"DISEASES AND DISORDERS OF THE EAR, NOSE, MOUTH AND THROAT",4,Extreme,Major,Medical,Blue Cross/Blue Shield,,,,,false,42414.92,21833.94
New York City,Bronx,7000011,001175,Calvary Hospital Inc,50 to 69,106,M,Black/African American,Not Span/Hispanic,19,Elective,Expired,2019,NEO004,HEAD AND NECK CANCERS - SALIVARY GLAND,ADM021,"ADMINISTRATION OF THERAPEUTIC SUBSTANCES, NEC",110,"EAR, NOSE, MOUTH, THROAT, CRANIAL/FACIAL MALIGNANCIES",03,"DISEASES AND DISORDERS OF THE EAR, NOSE, MOUTH AND THROAT",4,Extreme,Major,Medical,Medicare,Private Health Insurance,,,,false,40603.01,20970.77
New York City,Bronx,7000011,001175,Calvary Hospital Inc,50 to 69,100,M,White,Not Span/Hispanic,20,Elective,Short-term Hospital,2019,NEO008,HEAD AND NECK CANCERS - LARYNGEAL,,,110,"EAR, NOSE, MOUTH, THROAT, CRANIAL/FACIAL MALIGNANCIES",03,"DISEASES AND DISORDERS OF THE EAR, NOSE, MOUTH AND THROAT",3,Major,Moderate,Medical,Medicare,,,,,false,44663.41,24640.09
Long Island,Suffolk,5151001,000245,Stony Brook University Hospital,70 or Older,117,M,White,Not Span/Hispanic,6,Emergency,Home w/ Home Health Services,2019,NEO002,HEAD AND NECK CANCERS - LIP AND ORAL CAVITY,MAM011,ELECTROENCEPHALOGRAM (EEG),110,"EAR, NOSE, MOUTH, THROAT, CRANIAL/FACIAL MALIGNANCIES",03,"DISEASES AND DISORDERS OF THE EAR, NOSE, MOUTH AND THROAT",3,Major,Moderate,Medical,Medicare,Federal/State/Local/VA,,,,true,80468.63,20135.26
New York City,Bronx,7000011,001175,Calvary Hospital Inc,50 to 69,104,F,White,Not Span/Hispanic,11,Elective,Expired,2019,NEO002,HEAD AND NECK CANCERS - LIP AND ORAL CAVITY,ADM017,ADMINISTRATION OF NUTRITIONAL AND ELECTROLYTIC SUBSTANCES,110,"EAR, NOSE, MOUTH, THROAT, CRANIAL/FACIAL MALIGNANCIES",03,"DISEASES AND DISORDERS OF THE EAR, NOSE, MOUTH AND THROAT",3,Major,Major,Medical,Medicare,Medicaid,,,,false,23981.63,12329.3
New York City,Bronx,7000011,001175,Calvary Hospital Inc,70 or Older,105,F,White,Not Span/Hispanic,5,Elective,Expired,2019,NEO007,HEAD AND NECK CANCERS - PHARYNGEAL,ADM021,"ADMINISTRATION OF THERAPEUTIC SUBSTANCES, NEC",110,"EAR, NOSE, MOUTH, THROAT, CRANIAL/FACIAL MALIGNANCIES",03,"DISEASES AND DISORDERS OF THE EAR, NOSE, MOUTH AND THROAT",3,Major,Major,Medical,Medicare,Private Health Insurance,,,,false,10869.92,5654.17
New York City,Manhattan,7002024,001456,Mount Sinai Hospital,70 or Older,OOS,M,White,Not Span/Hispanic,4,Urgent,Home or Self Care,2019,NEO003,HEAD AND NECK CANCERS - THROAT,GIS017,GASTROSTOMY,110,"EAR, NOSE, MOUTH, THROAT, CRANIAL/FACIAL MALIGNANCIES",03,"DISEASES AND DISORDERS OF THE EAR, NOSE, MOUTH AND THROAT",3,Major,Moderate,Medical,Medicare,Blue Cross/Blue Shield,Self-Pay,,,false,46639.44,15349.73
Finger Lakes,Monroe,2701005,000413,Strong Memorial Hospital,50 to 69,145,F,White,Not Span/Hispanic,9,Emergency,Expired,2019,NEO005,HEAD AND NECK CANCERS - NASOPHARYNGEAL,RES007,AIRWAY INTUBATION,110,"EAR, NOSE, MOUTH, THROAT, CRANIAL/FACIAL MALIGNANCIES",03,"DISEASES AND DISORDERS OF THE EAR, NOSE, MOUTH AND THROAT",3,Major,Major,Medical,Medicaid,,,,,true,65596.02,26273.13
New York City,Kings,7001021,001306,New York - Presbyterian Brooklyn Methodist Hospital,70 or Older,112,F,White,Not Span/Hispanic,2,Emergency,Hospice - Medical Facility,2019,NEO003,HEAD AND NECK CANCERS - THROAT,ENT001,LARYNGOSCOPY (DIAGNOSTIC),110,"EAR, NOSE, MOUTH, THROAT, CRANIAL/FACIAL MALIGNANCIES",03,"DISEASES AND DISORDERS OF THE EAR, NOSE, MOUTH AND THROAT",4,Extreme,Extreme,Medical,Medicare,Medicaid,Self-Pay,,,true,13248.25,3459.76
Western NY,Erie,1401010,000216,Roswell Park Cancer Institute,50 to 69,147,F,White,Not Span/Hispanic,3,Urgent,Left Against Medical Advice,2019,NEO008,HEAD AND NECK CANCERS - LARYNGEAL,ENT002,ENT DIAGNOSTIC ENDOSCOPY (EXCLUDING LARYNGOSCOPY),110,"EAR, NOSE, MOUTH, THROAT, CRANIAL/FACIAL MALIGNANCIES",03,"DISEASES AND DISORDERS OF THE EAR, NOSE, MOUTH AND THROAT",3,Major,Moderate,Medical,Medicare,Medicaid,,,,false,23950.42,9424.28
Long Island,Nassau,2908000,000511,NYU Langone Hospital-Long Island,70 or Older,117,M,White,Not Span/Hispanic,15,Emergency,Hospice - Medical Facility,2019,NEO005,HEAD AND NECK CANCERS - NASOPHARYNGEAL,RES007,AIRWAY INTUBATION,110,"EAR, NOSE, MOUTH, THROAT, CRANIAL/FACIAL MALIGNANCIES",03,"DISEASES AND DISORDERS OF THE EAR, NOSE, MOUTH AND THROAT",4,Extreme,Extreme,Medical,Medicare,Medicare,,,,true,318284.32,46082.67
New York City,Manhattan,7002054,001464,New York-Presbyterian Hospital - Columbia Presbyterian Center,50 to 69,OOS,F,White,Not Span/Hispanic,2,Elective,Home or Self Care,2019,NEO005,HEAD AND NECK CANCERS - NASOPHARYNGEAL,ENT002,ENT DIAGNOSTIC ENDOSCOPY (EXCLUDING LARYNGOSCOPY),110,"EAR, NOSE, MOUTH, THROAT, CRANIAL/FACIAL MALIGNANCIES",03,"DISEASES AND DISORDERS OF THE EAR, NOSE, MOUTH AND THROAT",3,Major,Moderate,Medical,Medicare,Self-Pay,,,,false,63804.29,16395.85
New York City,Manhattan,7002054,001464,New York-Presbyterian Hospital - Columbia Presbyterian Center,50 to 69,107,F,Black/African American,Not Span/Hispanic,13,Emergency,Inpatient Rehabilitation Facility,2019,NEO008,HEAD AND NECK CANCERS - LARYNGEAL,RES010,TRACHEOSTOMY,110,"EAR, NOSE, MOUTH, THROAT, CRANIAL/FACIAL MALIGNANCIES",03,"DISEASES AND DISORDERS OF THE EAR, NOSE, MOUTH AND THROAT",3,Major,Moderate,Medical,Private Health Insurance,Self-Pay,,,,true,196528.22,43348.86
Capital/Adirond,Albany,0101004,000005,St. Peter's Hospital,50 to 69,120,M,Other Race,Not Span/Hispanic,2,Emergency,Home or Self Care,2019,NEO008,HEAD AND NECK CANCERS - LARYNGEAL,ENT002,ENT DIAGNOSTIC ENDOSCOPY (EXCLUDING LARYNGOSCOPY),110,"EAR, NOSE, MOUTH, THROAT, CRANIAL/FACIAL MALIGNANCIES",03,"DISEASES AND DISORDERS OF THE EAR, NOSE, MOUTH AND THROAT",3,Major,Major,Medical,Medicare,Medicaid,,,,true,18095.2,4881.22
New York City,Bronx,7000011,001175,Calvary Hospital Inc,70 or Older,OOS,M,White,Not Span/Hispanic,12,Elective,Expired,2019,NEO002,HEAD AND NECK CANCERS - LIP AND ORAL CAVITY,ADM021,"ADMINISTRATION OF THERAPEUTIC SUBSTANCES, NEC",110,"EAR, NOSE, MOUTH, THROAT, CRANIAL/FACIAL MALIGNANCIES",03,"DISEASES AND DISORDERS OF THE EAR, NOSE, MOUTH AND THROAT",3,Major,Major,Medical,Medicare,,,,,false,27591.66,14765.84
New York City,Bronx,7000011,001175,Calvary Hospital Inc,70 or Older,104,F,Black/African American,Not Span/Hispanic,45,Elective,Expired,2019,NEO005,HEAD AND NECK CANCERS - NASOPHARYNGEAL,ADM021,"ADMINISTRATION OF THERAPEUTIC SUBSTANCES, NEC",110,"EAR, NOSE, MOUTH, THROAT, CRANIAL/FACIAL MALIGNANCIES",03,"DISEASES AND DISORDERS OF THE EAR, NOSE, MOUTH AND THROAT",4,Extreme,Extreme,Medical,Medicare,Private Health Insurance,Private Health Insurance,,,false,98334.82,50860.78
New York City,Bronx,7000011,001175,Calvary Hospital Inc,50 to 69,104,M,White,Not Span/Hispanic,30,Elective,Expired,2019,NEO010,HEAD AND NECK CANCERS - ALL OTHER TYPES,,,110,"EAR, NOSE, MOUTH, THROAT, CRANIAL/FACIAL MALIGNANCIES",03,"DISEASES AND DISORDERS OF THE EAR, NOSE, MOUTH AND THROAT",3,Major,Major,Medical,Medicare,Private Health Insurance,,,,false,40132,20813.5
New York City,Bronx,7000011,001175,Calvary Hospital Inc,50 to 69,105,M,White,Not Span/Hispanic,13,Elective,Expired,2019,NEO010,HEAD AND NECK CANCERS - ALL OTHER TYPES,,,110,"EAR, NOSE, MOUTH, THROAT, CRANIAL/FACIAL MALIGNANCIES",03,"DISEASES AND DISORDERS OF THE EAR, NOSE, MOUTH AND THROAT",2,Moderate,Moderate,Medical,Private Health Insurance,Medicare,,,,false,27757.01,14301.84
New York City,Bronx,7000011,001175,Calvary Hospital Inc,70 or Older,100,F,White,Not Span/Hispanic,7,Elective,Expired,2019,NEO024,SARCOMA,,,110,"EAR, NOSE, MOUTH, THROAT, CRANIAL/FACIAL MALIGNANCIES",03,"DISEASES AND DISORDERS OF THE EAR, NOSE, MOUTH AND THROAT",3,Major,Major,Medical,Medicare,Blue Cross/Blue Shield,,,,false,14443.83,7381.32
Capital/Adirond,Albany,0101000,000001,Albany Medical Center Hospital,50 to 69,120,M,White,Not Span/Hispanic,10,Emergency,Home w/ Home Health Services,2019,NEO002,HEAD AND NECK CANCERS - LIP AND ORAL CAVITY,ENT002,ENT DIAGNOSTIC ENDOSCOPY (EXCLUDING LARYNGOSCOPY),110,"EAR, NOSE, MOUTH, THROAT, CRANIAL/FACIAL MALIGNANCIES",03,"DISEASES AND DISORDERS OF THE EAR, NOSE, MOUTH AND THROAT",3,Major,Extreme,Medical,Medicare,,,,,true,83667.78,27075.51
New York City,Bronx,7000008,001172,Lincoln Medical & Mental Health Center,30 to 49,104,M,Black/African American,Not Span/Hispanic,1,Emergency,Left Against Medical Advice,2019,NEO004,HEAD AND NECK CANCERS - SALIVARY GLAND,,,110,"EAR, NOSE, MOUTH, THROAT, CRANIAL/FACIAL MALIGNANCIES",03,"DISEASES AND DISORDERS OF THE EAR, NOSE, MOUTH AND THROAT",1,Minor,Minor,Medical,Medicaid,Medicaid,,,,true,9312.91,5499.8
Long Island,Suffolk,5154000,000924,South Shore University Hospital,30 to 49,117,M,Black/African American,Not Span/Hispanic,4,Emergency,Home or Self Care,2019,NEO023,BONE CANCER,,,110,"EAR, NOSE, MOUTH, THROAT, CRANIAL/FACIAL MALIGNANCIES",03,"DISEASES AND DISORDERS OF THE EAR, NOSE, MOUTH AND THROAT",3,Major,Moderate,Medical,Medicaid,Medicaid,,,,true,35690.33,7620.09
Hudson Valley,Westchester,5957001,001139,Westchester Medical Center,50 to 69,126,F,White,Not Span/Hispanic,17,Elective,Skilled Nursing Home,2019,NEO002,HEAD AND NECK CANCERS - LIP AND ORAL CAVITY,CAR025,PLACEMENT OF TUNNELED OR IMPLANTABLE PORTION OF A VASCULAR ACCESS DEVICE,110,"EAR, NOSE, MOUTH, THROAT, CRANIAL/FACIAL MALIGNANCIES",03,"DISEASES AND DISORDERS OF THE EAR, NOSE, MOUTH AND THROAT",3,Major,Moderate,Medical,Medicare,Medicaid,,,,false,281109.42,52346.47
New York City,Manhattan,7002024,001456,Mount Sinai Hospital,50 to 69,100,M,Other Race,Not Span/Hispanic,4,Emergency,Home or Self Care,2019,NEO002,HEAD AND NECK CANCERS - LIP AND ORAL CAVITY,ENT003,ENT DIAGNOSTIC PROCEDURES (NON-ENDOSCOPIC),110,"EAR, NOSE, MOUTH, THROAT, CRANIAL/FACIAL MALIGNANCIES",03,"DISEASES AND DISORDERS OF THE EAR, NOSE, MOUTH AND THROAT",2,Moderate,Minor,Medical,Medicaid,Self-Pay,,,,true,54925.22,15547.42
New York City,Manhattan,7002024,001456,Mount Sinai Hospital,50 to 69,OOS,M,Other Race,Unknown,1,Urgent,Home or Self Care,2019,NEO005,HEAD AND NECK CANCERS - NASOPHARYNGEAL,,,110,"EAR, NOSE, MOUTH, THROAT, CRANIAL/FACIAL MALIGNANCIES",03,"DISEASES AND DISORDERS OF THE EAR, NOSE, MOUTH AND THROAT",2,Moderate,Moderate,Medical,Self-Pay,Self-Pay,,,,false,10629.12,3566.84
New York City,Manhattan,7002054,001458,New York-Presbyterian Hospital - New York Weill Cornell Center,70 or Older,100,M,White,Not Span/Hispanic,1,Emergency,Home w/ Home Health Services,2019,NEO007,HEAD AND NECK CANCERS - PHARYNGEAL,GIS017,GASTROSTOMY,110,"EAR, NOSE, MOUTH, THROAT, CRANIAL/FACIAL MALIGNANCIES",03,"DISEASES AND DISORDERS OF THE EAR, NOSE, MOUTH AND THROAT",3,Major,Moderate,Medical,Medicare,Private Health Insurance,Self-Pay,,,false,25044.46,7304.82