Hospital Service Area,Hospital County,Operating Certificate Number,Permanent Facility Id,Facility Name,Age Group,Zip Code - 3 digits,Gender,Race,Ethnicity,Length of Stay,Type of Admission,Patient Disposition,Discharge Year,CCS Diagnosis Code,CCS Diagnosis Description,CCS Procedure Code,CCS Procedure Description,APR DRG Code,APR DRG Description,APR MDC Code,APR MDC Description,APR Severity of Illness Code,APR Severity of Illness Description,APR Risk of Mortality,APR Medical Surgical Description,Payment Typology 1,Payment Typology 2,Payment Typology 3,Birth Weight,Abortion Edit Indicator,Emergency Department Indicator,Total Charges,Total Costs
Long Island,Nassau,2908000,000511,NYU Winthrop Hospital,70 or Older,115,F,Black/African American,Not Span/Hispanic,9,Emergency,Home or Self Care,2017,093,Conditions associated with dizziness or vertigo,025,DX PRCS ON EAR,111,Vertigo & other labyrinth disorders,03,"Ear, Nose, Mouth, Throat and Craniofacial Diseases and Disorders",3,Major,Moderate,Medical,Medicare,Medicare,,,N,Y,71214.71,13327.49
Long Island,Nassau,2908000,000511,NYU Winthrop Hospital,50 to 69,115,F,Black/African American,Spanish/Hispanic,1,Emergency,Home or Self Care,2017,093,Conditions associated with dizziness or vertigo,000,NO PROC,111,Vertigo & other labyrinth disorders,03,"Ear, Nose, Mouth, Throat and Craniofacial Diseases and Disorders",1,Minor,Minor,Medical,Private Health Insurance,,,,N,Y,25878.66,2877.93
Long Island,Nassau,2908000,000511,NYU Winthrop Hospital,30 to 49,OOS,M,White,Spanish/Hispanic,7,Emergency,Home or Self Care,2017,093,Conditions associated with dizziness or vertigo,047,DX CARDIAC CATHETERIZTN,111,Vertigo & other labyrinth disorders,03,"Ear, Nose, Mouth, Throat and Craniofacial Diseases and Disorders",1,Minor,Minor,Medical,Medicaid,,,,N,Y,126543.02,28076.46
Long Island,Nassau,2908000,000511,NYU Winthrop Hospital,50 to 69,112,M,White,Not Span/Hispanic,3,Emergency,Home w/ Home Health Services,2017,093,Conditions associated with dizziness or vertigo,031,DX PRCS ON NOSE & MOUTH,111,Vertigo & other labyrinth disorders,03,"Ear, Nose, Mouth, Throat and Craniofacial Diseases and Disorders",3,Major,Major,Medical,Private Health Insurance,Medicare,,,N,Y,56487.85,12310.02
Long Island,Nassau,2908000,000511,NYU Winthrop Hospital,50 to 69,115,F,White,Not Span/Hispanic,2,Emergency,Home or Self Care,2017,093,Conditions associated with dizziness or vertigo,000,NO PROC,111,Vertigo & other labyrinth disorders,03,"Ear, Nose, Mouth, Throat and Craniofacial Diseases and Disorders",1,Minor,Minor,Medical,Medicare,Medicare,Blue Cross/Blue Shield,,N,Y,78409.81,12694.69
Long Island,Nassau,2908000,000511,NYU Winthrop Hospital,70 or Older,115,F,White,Not Span/Hispanic,2,Emergency,Home w/ Home Health Services,2017,093,Conditions associated with dizziness or vertigo,227,"OT DX PRC (INTERVW,EVAL",111,Vertigo & other labyrinth disorders,03,"Ear, Nose, Mouth, Throat and Craniofacial Diseases and Disorders",2,Moderate,Moderate,Medical,Medicare,Medicare,Blue Cross/Blue Shield,,N,Y,26054.30,4877.68
Long Island,Nassau,2908000,000511,NYU Winthrop Hospital,70 or Older,110,M,White,Not Span/Hispanic,2,Emergency,Home or Self Care,2017,093,Conditions associated with dizziness or vertigo,000,NO PROC,111,Vertigo & other labyrinth disorders,03,"Ear, Nose, Mouth, Throat and Craniofacial Diseases and Disorders",3,Major,Moderate,Medical,Medicare,Medicare,Private Health Insurance,,N,Y,66260.90,10998.81
Long Island,Nassau,2908000,000511,NYU Winthrop Hospital,50 to 69,115,F,Black/African American,Not Span/Hispanic,1,Emergency,Home or Self Care,2017,093,Conditions associated with dizziness or vertigo,000,NO PROC,111,Vertigo & other labyrinth disorders,03,"Ear, Nose, Mouth, Throat and Craniofacial Diseases and Disorders",2,Moderate,Moderate,Medical,Self-Pay,,,,N,Y,48252.83,6098.99
Long Island,Nassau,2908000,000511,NYU Winthrop Hospital,50 to 69,113,F,Other Race,Not Span/Hispanic,1,Emergency,Home or Self Care,2017,093,Conditions associated with dizziness or vertigo,000,NO PROC,111,Vertigo & other labyrinth disorders,03,"Ear, Nose, Mouth, Throat and Craniofacial Diseases and Disorders",1,Minor,Minor,Medical,Medicaid,,,,N,Y,36038.99,3755.41
Long Island,Nassau,2908000,000511,NYU Winthrop Hospital,30 to 49,115,F,Black/African American,Not Span/Hispanic,1,Emergency,Home or Self Care,2017,093,Conditions associated with dizziness or vertigo,000,NO PROC,111,Vertigo & other labyrinth disorders,03,"Ear, Nose, Mouth, Throat and Craniofacial Diseases and Disorders",1,Minor,Minor,Medical,Medicaid,Medicaid,,,N,Y,25809.59,4855.80
Long Island,Nassau,2908000,000511,NYU Winthrop Hospital,50 to 69,113,M,White,Not Span/Hispanic,2,Emergency,Home or Self Care,2017,093,Conditions associated with dizziness or vertigo,000,NO PROC,111,Vertigo & other labyrinth disorders,03,"Ear, Nose, Mouth, Throat and Craniofacial Diseases and Disorders",2,Moderate,Minor,Medical,Blue Cross/Blue Shield,,,,N,Y,53947.74,8763.77
Long Island,Nassau,2908000,000511,NYU Winthrop Hospital,70 or Older,110,F,Other Race,Not Span/Hispanic,2,Emergency,Home w/ Home Health Services,2017,093,Conditions associated with dizziness or vertigo,227,"OT DX PRC (INTERVW,EVAL",111,Vertigo & other labyrinth disorders,03,"Ear, Nose, Mouth, Throat and Craniofacial Diseases and Disorders",2,Moderate,Minor,Medical,Medicare,Medicare,Medicaid,,N,Y,73300.98,11607.48
Long Island,Nassau,2908000,000511,NYU Winthrop Hospital,70 or Older,117,M,White,Not Span/Hispanic,2,Emergency,Home w/ Home Health Services,2017,093,Conditions associated with dizziness or vertigo,000,NO PROC,111,Vertigo & other labyrinth disorders,03,"Ear, Nose, Mouth, Throat and Craniofacial Diseases and Disorders",2,Moderate,Moderate,Medical,Medicare,Medicare,,,N,Y,50580.87,8503.58
Long Island,Nassau,2908000,000511,NYU Winthrop Hospital,18 to 29,115,F,White,Spanish/Hispanic,1,Emergency,Home or Self Care,2017,093,Conditions associated with dizziness or vertigo,000,NO PROC,111,Vertigo & other labyrinth disorders,03,"Ear, Nose, Mouth, Throat and Craniofacial Diseases and Disorders",1,Minor,Minor,Medical,Federal/State/Local/VA,,,,N,Y,30713.89,4584.11
Long Island,Nassau,2908000,000511,NYU Winthrop Hospital,70 or Older,115,F,White,Not Span/Hispanic,1,Emergency,Home w/ Home Health Services,2017,093,Conditions associated with dizziness or vertigo,000,NO PROC,111,Vertigo & other labyrinth disorders,03,"Ear, Nose, Mouth, Throat and Craniofacial Diseases and Disorders",2,Moderate,Moderate,Medical,Medicare,Medicare,Blue Cross/Blue Shield,,N,Y,30585.10,5195.48
Long Island,Nassau,2908000,000511,NYU Winthrop Hospital,70 or Older,115,F,Black/African American,Not Span/Hispanic,3,Emergency,Skilled Nursing Home,2017,093,Conditions associated with dizziness or vertigo,000,NO PROC,111,Vertigo & other labyrinth disorders,03,"Ear, Nose, Mouth, Throat and Craniofacial Diseases and Disorders",2,Moderate,Minor,Medical,Medicare,Medicare,Private Health Insurance,,N,Y,67527.23,14698.96
Long Island,Nassau,2908000,000511,NYU Winthrop Hospital,50 to 69,115,F,Black/African American,Not Span/Hispanic,5,Emergency,Home w/ Home Health Services,2017,093,Conditions associated with dizziness or vertigo,004,DIAGNOSTIC SPINAL TAP,111,Vertigo & other labyrinth disorders,03,"Ear, Nose, Mouth, Throat and Craniofacial Diseases and Disorders",2,Moderate,Moderate,Medical,Medicare,Medicare,Medicaid,,N,Y,144984.59,24943.21
Long Island,Nassau,2908000,000511,NYU Winthrop Hospital,50 to 69,115,F,Black/African American,Spanish/Hispanic,3,Emergency,Home or Self Care,2017,093,Conditions associated with dizziness or vertigo,000,NO PROC,111,Vertigo & other labyrinth disorders,03,"Ear, Nose, Mouth, Throat and Craniofacial Diseases and Disorders",1,Minor,Minor,Medical,Medicaid,Medicaid,,,N,Y,59991.12,12955.35
Long Island,Nassau,2908000,000511,NYU Winthrop Hospital,70 or Older,117,F,Other Race,Not Span/Hispanic,2,Emergency,Home w/ Home Health Services,2017,093,Conditions associated with dizziness or vertigo,193,DX ULTRASOUND HEART,111,Vertigo & other labyrinth disorders,03,"Ear, Nose, Mouth, Throat and Craniofacial Diseases and Disorders",2,Moderate,Moderate,Medical,Medicare,Medicare,Medicaid,,N,Y,53337.01,7589.61
Long Island,Nassau,2908000,000511,NYU Winthrop Hospital,50 to 69,115,M,White,Not Span/Hispanic,2,Emergency,Home or Self Care,2017,093,Conditions associated with dizziness or vertigo,000,NO PROC,111,Vertigo & other labyrinth disorders,03,"Ear, Nose, Mouth, Throat and Craniofacial Diseases and Disorders",1,Minor,Minor,Medical,Private Health Insurance,,,,N,Y,38683.51,8388.52
Long Island,Nassau,2908000,000511,NYU Winthrop Hospital,70 or Older,115,F,White,Not Span/Hispanic,3,Emergency,Skilled Nursing Home,2017,093,Conditions associated with dizziness or vertigo,000,NO PROC,111,Vertigo & other labyrinth disorders,03,"Ear, Nose, Mouth, Throat and Craniofacial Diseases and Disorders",2,Moderate,Minor,Medical,Medicare,Medicare,,,N,Y,45339.56,7329.13
Long Island,Nassau,2908000,000511,NYU Winthrop Hospital,70 or Older,115,M,White,Not Span/Hispanic,2,Emergency,Skilled Nursing Home,2017,093,Conditions associated with dizziness or vertigo,058,HEMODIALYSIS,111,Vertigo & other labyrinth disorders,03,"Ear, Nose, Mouth, Throat and Craniofacial Diseases and Disorders",2,Moderate,Moderate,Medical,Medicare,Medicare,Blue Cross/Blue Shield,,N,Y,58197.97,7348.09
Long Island,Nassau,2908000,000511,NYU Winthrop Hospital,50 to 69,115,M,White,Not Span/Hispanic,2,Emergency,Home or Self Care,2017,093,Conditions associated with dizziness or vertigo,198,MAG RESONANCE IMAGING,111,Vertigo & other labyrinth disorders,03,"Ear, Nose, Mouth, Throat and Craniofacial Diseases and Disorders",1,Minor,Minor,Medical,Medicare,Medicare,Blue Cross/Blue Shield,,N,Y,42102.30,5360.68
Long Island,Nassau,2908000,000511,NYU Winthrop Hospital,50 to 69,115,M,White,Not Span/Hispanic,1,Emergency,Home or Self Care,2017,093,Conditions associated with dizziness or vertigo,000,NO PROC,111,Vertigo & other labyrinth disorders,03,"Ear, Nose, Mouth, Throat and Craniofacial Diseases and Disorders",1,Minor,Minor,Medical,Blue Cross/Blue Shield,,,,N,N,9615.00,2924.36
Long Island,Nassau,2908000,000511,NYU Winthrop Hospital,30 to 49,115,M,White,Not Span/Hispanic,3,Emergency,Home or Self Care,2017,093,Conditions associated with dizziness or vertigo,201,CARDIAC STRESS TESTS,111,Vertigo & other labyrinth disorders,03,"Ear, Nose, Mouth, Throat and Craniofacial Diseases and Disorders",1,Minor,Minor,Medical,Miscellaneous/Other,Medicare,,,N,Y,75809.71,13614.39
Long Island,Nassau,2908000,000511,NYU Winthrop Hospital,50 to 69,115,M,White,Not Span/Hispanic,5,Emergency,Home or Self Care,2017,093,Conditions associated with dizziness or vertigo,201,CARDIAC STRESS TESTS,111,Vertigo & other labyrinth disorders,03,"Ear, Nose, Mouth, Throat and Craniofacial Diseases and Disorders",2,Moderate,Moderate,Medical,Medicare,Medicare,Private Health Insurance,,N,Y,86158.04,20697.62
Long Island,Nassau,2908000,000511,NYU Winthrop Hospital,50 to 69,115,M,White,Not Span/Hispanic,2,Emergency,Home or Self Care,2017,093,Conditions associated with dizziness or vertigo,000,NO PROC,111,Vertigo & other labyrinth disorders,03,"Ear, Nose, Mouth, Throat and Craniofacial Diseases and Disorders",1,Minor,Minor,Medical,Blue Cross/Blue Shield,,,,N,Y,46910.04,6804.10
Long Island,Nassau,2908000,000511,NYU Winthrop Hospital,50 to 69,115,F,Black/African American,Not Span/Hispanic,1,Emergency,Home or Self Care,2017,093,Conditions associated with dizziness or vertigo,000,NO PROC,111,Vertigo & other labyrinth disorders,03,"Ear, Nose, Mouth, Throat and Craniofacial Diseases and Disorders",2,Moderate,Minor,Medical,Private Health Insurance,,,,N,Y,37152.83,3797.76
Long Island,Nassau,2908000,000511,NYU Winthrop Hospital,50 to 69,115,F,White,Not Span/Hispanic,3,Emergency,Home or Self Care,2017,093,Conditions associated with dizziness or vertigo,203,ELECTROGR CARDIAC MONIT,111,Vertigo & other labyrinth disorders,03,"Ear, Nose, Mouth, Throat and Craniofacial Diseases and Disorders",3,Major,Major,Medical,Medicaid,,,,N,Y,53226.61,7695.21
Long Island,Nassau,2908000,000511,NYU Winthrop Hospital,70 or Older,115,F,Other Race,Not Span/Hispanic,3,Emergency,Home w/ Home Health Services,2017,093,Conditions associated with dizziness or vertigo,000,NO PROC,111,Vertigo & other labyrinth disorders,03,"Ear, Nose, Mouth, Throat and Craniofacial Diseases and Disorders",1,Minor,Minor,Medical,Medicare,Medicare,,,N,Y,38005.85,6101.00
Long Island,Nassau,2908000,000511,NYU Winthrop Hospital,70 or Older,118,M,White,Not Span/Hispanic,3,Emergency,Home w/ Home Health Services,2017,093,Conditions associated with dizziness or vertigo,210,OTHER RADIOISOTOPE SCAN,111,Vertigo & other labyrinth disorders,03,"Ear, Nose, Mouth, Throat and Craniofacial Diseases and Disorders",2,Moderate,Moderate,Medical,Medicare,Medicare,Private Health Insurance,,N,Y,74882.76,14792.58
Long Island,Nassau,2908000,000511,NYU Winthrop Hospital,50 to 69,115,F,White,Not Span/Hispanic,1,Emergency,Home or Self Care,2017,093,Conditions associated with dizziness or vertigo,000,NO PROC,111,Vertigo & other labyrinth disorders,03,"Ear, Nose, Mouth, Throat and Craniofacial Diseases and Disorders",1,Minor,Minor,Medical,Private Health Insurance,Medicare,,,N,Y,43403.00,4553.75
Long Island,Nassau,2908000,000511,NYU Winthrop Hospital,70 or Older,115,M,White,Not Span/Hispanic,2,Emergency,Home or Self Care,2017,093,Conditions associated with dizziness or vertigo,203,ELECTROGR CARDIAC MONIT,111,Vertigo & other labyrinth disorders,03,"Ear, Nose, Mouth, Throat and Craniofacial Diseases and Disorders",1,Minor,Minor,Medical,Medicare,Medicare,Medicaid,,N,Y,40492.85,5013.62
Long Island,Nassau,2908000,000511,NYU Winthrop Hospital,50 to 69,115,M,White,Not Span/Hispanic,1,Emergency,Left Against Medical Advice,2017,093,Conditions associated with dizziness or vertigo,000,NO PROC,111,Vertigo & other labyrinth disorders,03,"Ear, Nose, Mouth, Throat and Craniofacial Diseases and Disorders",1,Minor,Minor,Medical,Blue Cross/Blue Shield,,,,N,N,3338.00,1015.24
Long Island,Nassau,2908000,000511,NYU Winthrop Hospital,70 or Older,115,M,Black/African American,Not Span/Hispanic,6,Emergency,Home w/ Home Health Services,2017,093,Conditions associated with dizziness or vertigo,000,NO PROC,111,Vertigo & other labyrinth disorders,03,"Ear, Nose, Mouth, Throat and Craniofacial Diseases and Disorders",2,Moderate,Moderate,Medical,Medicare,Medicare,Blue Cross/Blue Shield,,N,Y,90189.69,21575.59
Long Island,Nassau,2908000,000511,NYU Winthrop Hospital,70 or Older,115,F,White,Spanish/Hispanic,3,Emergency,Home or Self Care,2017,093,Conditions associated with dizziness or vertigo,000,NO PROC,111,Vertigo & other labyrinth disorders,03,"Ear, Nose, Mouth, Throat and Craniofacial Diseases and Disorders",1,Minor,Minor,Medical,Medicare,Medicare,,,N,Y,28242.22,5758.50
Long Island,Nassau,2908000,000511,NYU Winthrop Hospital,50 to 69,115,F,White,Not Span/Hispanic,3,Emergency,Home or Self Care,2017,093,Conditions associated with dizziness or vertigo,000,NO PROC,111,Vertigo & other labyrinth disorders,03,"Ear, Nose, Mouth, Throat and Craniofacial Diseases and Disorders",2,Moderate,Moderate,Medical,Blue Cross/Blue Shield,Medicare,,,N,Y,55937.41,8677.49
Long Island,Nassau,2908000,000511,NYU Winthrop Hospital,50 to 69,115,F,White,Not Span/Hispanic,2,Emergency,Home or Self Care,2017,093,Conditions associated with dizziness or vertigo,000,NO PROC,111,Vertigo & other labyrinth disorders,03,"Ear, Nose, Mouth, Throat and Craniofacial Diseases and Disorders",2,Moderate,Minor,Medical,Private Health Insurance,Private Health Insurance,,,N,Y,29170.71,5258.38
Long Island,Nassau,2908000,000511,NYU Winthrop Hospital,70 or Older,115,F,White,Not Span/Hispanic,3,Emergency,Home or Self Care,2017,093,Conditions associated with dizziness or vertigo,000,NO PROC,111,Vertigo & other labyrinth disorders,03,"Ear, Nose, Mouth, Throat and Craniofacial Diseases and Disorders",2,Moderate,Moderate,Medical,Medicaid,Medicaid,,,N,Y,29414.69,5874.65
Long Island,Nassau,2908000,000511,NYU Winthrop Hospital,70 or Older,OOS,F,White,Not Span/Hispanic,1,Emergency,Home or Self Care,2017,093,Conditions associated with dizziness or vertigo,000,NO PROC,111,Vertigo & other labyrinth disorders,03,"Ear, Nose, Mouth, Throat and Craniofacial Diseases and Disorders",2,Moderate,Moderate,Medical,Medicare,Medicare,,,N,Y,75020.13,11893.35
Long Island,Nassau,2908000,000511,NYU Winthrop Hospital,70 or Older,115,F,Black/African American,Not Span/Hispanic,4,Emergency,Home w/ Home Health Services,2017,093,Conditions associated with dizziness or vertigo,000,NO PROC,111,Vertigo & other labyrinth disorders,03,"Ear, Nose, Mouth, Throat and Craniofacial Diseases and Disorders",2,Moderate,Moderate,Medical,Medicare,Medicare,Private Health Insurance,,N,Y,83049.00,15584.10
Long Island,Nassau,2908000,000511,NYU Winthrop Hospital,50 to 69,104,F,Black/African American,Not Span/Hispanic,7,Emergency,Skilled Nursing Home,2017,093,Conditions associated with dizziness or vertigo,203,ELECTROGR CARDIAC MONIT,111,Vertigo & other labyrinth disorders,03,"Ear, Nose, Mouth, Throat and Craniofacial Diseases and Disorders",1,Minor,Minor,Medical,Medicaid,Medicaid,,,N,Y,80844.01,13610.14
Long Island,Nassau,2908000,000511,NYU Winthrop Hospital,50 to 69,110,F,White,Not Span/Hispanic,4,Emergency,Home or Self Care,2017,093,Conditions associated with dizziness or vertigo,000,NO PROC,111,Vertigo & other labyrinth disorders,03,"Ear, Nose, Mouth, Throat and Craniofacial Diseases and Disorders",1,Minor,Minor,Medical,Private Health Insurance,,,,N,Y,86753.54,16505.58
Long Island,Nassau,2908000,000511,NYU Winthrop Hospital,50 to 69,,F,Other Race,Not Span/Hispanic,2,Emergency,Home or Self Care,2017,093,Conditions associated with dizziness or vertigo,031,DX PRCS ON NOSE & MOUTH,111,Vertigo & other labyrinth disorders,03,"Ear, Nose, Mouth, Throat and Craniofacial Diseases and Disorders",2,Moderate,Minor,Medical,Medicaid,,,,N,Y,30818.25,5990.85
Long Island,Nassau,2908000,000511,NYU Winthrop Hospital,50 to 69,114,M,White,Spanish/Hispanic,6,Emergency,Home or Self Care,2017,093,Conditions associated with dizziness or vertigo,199,ELECTROENCEPHALOGRAM,111,Vertigo & other labyrinth disorders,03,"Ear, Nose, Mouth, Throat and Craniofacial Diseases and Disorders",2,Moderate,Minor,Medical,Medicaid,Medicaid,,,N,Y,130370.45,23767.95
Long Island,Nassau,2908000,000511,NYU Winthrop Hospital,70 or Older,115,M,White,Not Span/Hispanic,1,Emergency,Home or Self Care,2017,093,Conditions associated with dizziness or vertigo,000,NO PROC,111,Vertigo & other labyrinth disorders,03,"Ear, Nose, Mouth, Throat and Craniofacial Diseases and Disorders",1,Minor,Minor,Medical,Medicare,Medicare,Private Health Insurance,,N,Y,36047.50,3710.58
Long Island,Nassau,2908000,000511,NYU Winthrop Hospital,70 or Older,115,F,Black/African American,Not Span/Hispanic,1,Emergency,Home w/ Home Health Services,2017,093,Conditions associated with dizziness or vertigo,000,NO PROC,111,Vertigo & other labyrinth disorders,03,"Ear, Nose, Mouth, Throat and Craniofacial Diseases and Disorders",2,Moderate,Moderate,Medical,Medicare,Medicare,,,N,Y,28633.42,5482.53
Long Island,Nassau,2908000,000511,NYU Winthrop Hospital,30 to 49,115,F,White,Not Span/Hispanic,2,Emergency,Home or Self Care,2017,093,Conditions associated with dizziness or vertigo,000,NO PROC,111,Vertigo & other labyrinth disorders,03,"Ear, Nose, Mouth, Throat and Craniofacial Diseases and Disorders",1,Minor,Minor,Medical,Blue Cross/Blue Shield,,,,N,Y,29319.51,4923.15
Long Island,Nassau,2908000,000511,NYU Winthrop Hospital,70 or Older,115,M,Other Race,Not Span/Hispanic,2,Emergency,Home or Self Care,2017,093,Conditions associated with dizziness or vertigo,058,HEMODIALYSIS,111,Vertigo & other labyrinth disorders,03,"Ear, Nose, Mouth, Throat and Craniofacial Diseases and Disorders",2,Moderate,Moderate,Medical,Medicaid,Medicaid,,,N,Y,45822.47,9009.33
Long Island,Nassau,2908000,000511,NYU Winthrop Hospital,30 to 49,117,M,White,Spanish/Hispanic,5,Emergency,Home or Self Care,2017,093,Conditions associated with dizziness or vertigo,000,NO PROC,111,Vertigo & other labyrinth disorders,03,"Ear, Nose, Mouth, Throat and Craniofacial Diseases and Disorders",2,Moderate,Minor,Medical,Medicaid,,,,N,Y,78841.92,11124.70
Long Island,Nassau,2908000,000511,NYU Winthrop Hospital,70 or Older,115,F,Black/African American,Not Span/Hispanic,1,Emergency,Home or Self Care,2017,093,Conditions associated with dizziness or vertigo,000,NO PROC,111,Vertigo & other labyrinth disorders,03,"Ear, Nose, Mouth, Throat and Craniofacial Diseases and Disorders",3,Major,Major,Medical,Medicare,Medicare,,,N,Y,56062.79,7607.85
Long Island,Nassau,2908000,000511,NYU Winthrop Hospital,70 or Older,110,F,White,Spanish/Hispanic,2,Emergency,Home or Self Care,2017,093,Conditions associated with dizziness or vertigo,000,NO PROC,111,Vertigo & other labyrinth disorders,03,"Ear, Nose, Mouth, Throat and Craniofacial Diseases and Disorders",2,Moderate,Moderate,Medical,Medicare,Medicare,Private Health Insurance,,N,Y,89708.92,15033.85
Long Island,Nassau,2908000,000511,NYU Winthrop Hospital,50 to 69,115,F,Black/African American,Not Span/Hispanic,8,Emergency,Home w/ Home Health Services,2017,093,Conditions associated with dizziness or vertigo,000,NO PROC,111,Vertigo & other labyrinth disorders,03,"Ear, Nose, Mouth, Throat and Craniofacial Diseases and Disorders",2,Moderate,Minor,Medical,Medicare,Medicare,Blue Cross/Blue Shield,,N,Y,158304.77,34149.76
Long Island,Nassau,2908000,000511,NYU Winthrop Hospital,50 to 69,OOS,F,White,Not Span/Hispanic,1,Emergency,Home or Self Care,2017,093,Conditions associated with dizziness or vertigo,216,RESP INTUB/MECH VENTIL,111,Vertigo & other labyrinth disorders,03,"Ear, Nose, Mouth, Throat and Craniofacial Diseases and Disorders",1,Minor,Minor,Medical,Medicare,Medicare,,,N,Y,56993.97,7988.08
Long Island,Nassau,2908000,000511,NYU Winthrop Hospital,70 or Older,115,F,White,Not Span/Hispanic,3,Emergency,Home w/ Home Health Services,2017,093,Conditions associated with dizziness or vertigo,000,NO PROC,111,Vertigo & other labyrinth disorders,03,"Ear, Nose, Mouth, Throat and Craniofacial Diseases and Disorders",2,Moderate,Moderate,Medical,Medicare,Medicare,,,N,Y,42351.45,6795.29
Long Island,Nassau,2908000,000511,NYU Winthrop Hospital,50 to 69,110,F,White,Not Span/Hispanic,2,Emergency,Home or Self Care,2017,093,Conditions associated with dizziness or vertigo,000,NO PROC,111,Vertigo & other labyrinth disorders,03,"Ear, Nose, Mouth, Throat and Craniofacial Diseases and Disorders",1,Minor,Minor,Medical,Blue Cross/Blue Shield,Blue Cross/Blue Shield,,,N,Y,62948.20,10640.13
Long Island,Nassau,2908000,000511,NYU Winthrop Hospital,70 or Older,117,F,White,Not Span/Hispanic,2,Emergency,Home w/ Home Health Services,2017,093,Conditions associated with dizziness or vertigo,000,NO PROC,111,Vertigo & other labyrinth disorders,03,"Ear, Nose, Mouth, Throat and Craniofacial Diseases and Disorders",2,Moderate,Moderate,Medical,Medicare,Medicare,,,N,Y,42406.34,9200.46
Long Island,Nassau,2908000,000511,NYU Winthrop Hospital,50 to 69,115,M,Black/African American,Not Span/Hispanic,5,Emergency,Home or Self Care,2017,093,Conditions associated with dizziness or vertigo,000,NO PROC,111,Vertigo & other labyrinth disorders,03,"Ear, Nose, Mouth, Throat and Craniofacial Diseases and Disorders",2,Moderate,Minor,Medical,Medicare,Medicare,Private Health Insurance,,N,Y,41279.27,8636.18
Long Island,Nassau,2908000,000511,NYU Winthrop Hospital,50 to 69,115,F,Black/African American,Not Span/Hispanic,2,Emergency,Home w/ Home Health Services,2017,093,Conditions associated with dizziness or vertigo,000,NO PROC,111,Vertigo & other labyrinth disorders,03,"Ear, Nose, Mouth, Throat and Craniofacial Diseases and Disorders",2,Moderate,Minor,Medical,Medicare,Medicare,Blue Cross/Blue Shield,,N,Y,66116.34,10274.09