Hospital Service Area,Hospital County,Operating Certificate Number,Permanent Facility Id,Facility Name,Age Group,Zip Code - 3 digits,Gender,Race,Ethnicity,Length of Stay,Type of Admission,Patient Disposition,Discharge Year,CCS Diagnosis Code,CCS Diagnosis Description,CCS Procedure Code,CCS Procedure Description,APR DRG Code,APR DRG Description,APR MDC Code,APR MDC Description,APR Severity of Illness Code,APR Severity of Illness Description,APR Risk of Mortality,APR Medical Surgical Description,Payment Typology 1,Payment Typology 2,Payment Typology 3,Birth Weight,Abortion Edit Indicator,Emergency Department Indicator,Total Charges,Total Costs
New York City,Bronx,7000006,003058,Montefiore Med Center - Jack D Weiler Hosp of A Einstein College Div,18 to 29,104,M,Other Race,Spanish/Hispanic,1,Emergency,Home or Self Care,2020,EAR003,DISEASES OF INNER EAR AND RELATED CONDITIONS,,,111,VERTIGO & OTHER LABYRINTH DISORDERS,03,"DISEASES AND DISORDERS OF THE EAR, NOSE, MOUTH AND THROAT",1,Minor,Minor,Medical,Private Health Insurance,,,,,Y,26503.19,2903.67
New York City,Bronx,7000006,001169,Montefiore Medical Center - Henry & Lucy Moses Div,70 or Older,104,F,White,Not Span/Hispanic,3,Emergency,Home or Self Care,2020,EAR003,DISEASES OF INNER EAR AND RELATED CONDITIONS,,,111,VERTIGO & OTHER LABYRINTH DISORDERS,03,"DISEASES AND DISORDERS OF THE EAR, NOSE, MOUTH AND THROAT",1,Minor,Moderate,Medical,Medicare,,,,,Y,45110.87,7506.02
New York City,Bronx,7000006,001169,Montefiore Medical Center - Henry & Lucy Moses Div,70 or Older,104,M,Black/African American,Not Span/Hispanic,5,Emergency,Home w/ Home Health Services,2020,SYM015,GENERAL SENSATION/PERCEPTION SIGNS AND SYMPTOMS,ADM021,"ADMINISTRATION OF THERAPEUTIC SUBSTANCES, NEC",111,VERTIGO & OTHER LABYRINTH DISORDERS,03,"DISEASES AND DISORDERS OF THE EAR, NOSE, MOUTH AND THROAT",2,Moderate,Moderate,Medical,Medicare,Medicaid,,,,Y,63946.67,11633.32
New York City,Bronx,7000006,003058,Montefiore Med Center - Jack D Weiler Hosp of A Einstein College Div,50 to 69,104,M,Other Race,Not Span/Hispanic,1,Emergency,Home or Self Care,2020,SYM015,GENERAL SENSATION/PERCEPTION SIGNS AND SYMPTOMS,,,111,VERTIGO & OTHER LABYRINTH DISORDERS,03,"DISEASES AND DISORDERS OF THE EAR, NOSE, MOUTH AND THROAT",1,Minor,Moderate,Medical,Medicare,Medicaid,,,,Y,38637.84,3441.89
New York City,Bronx,7000006,003058,Montefiore Med Center - Jack D Weiler Hosp of A Einstein College Div,30 to 49,104,F,Other Race,Spanish/Hispanic,2,Emergency,Home or Self Care,2020,SYM015,GENERAL SENSATION/PERCEPTION SIGNS AND SYMPTOMS,ADM021,"ADMINISTRATION OF THERAPEUTIC SUBSTANCES, NEC",111,VERTIGO & OTHER LABYRINTH DISORDERS,03,"DISEASES AND DISORDERS OF THE EAR, NOSE, MOUTH AND THROAT",3,Major,Major,Medical,Private Health Insurance,,,,,Y,60845.75,8305.48
New York City,Bronx,7000006,003058,Montefiore Med Center - Jack D Weiler Hosp of A Einstein College Div,50 to 69,104,M,Other Race,Not Span/Hispanic,1,Emergency,Home or Self Care,2020,EAR003,DISEASES OF INNER EAR AND RELATED CONDITIONS,IMG007,COMPUTERIZED TOMOGRAPHY (CT) WITHOUT CONTRAST,111,VERTIGO & OTHER LABYRINTH DISORDERS,03,"DISEASES AND DISORDERS OF THE EAR, NOSE, MOUTH AND THROAT",1,Minor,Minor,Medical,Private Health Insurance,,,,,Y,28424.35,3055.97
New York City,Bronx,7000006,001168,Montefiore Medical Center-Wakefield Hospital,50 to 69,104,F,Other Race,Spanish/Hispanic,1,Emergency,Home or Self Care,2020,EAR003,DISEASES OF INNER EAR AND RELATED CONDITIONS,,,111,VERTIGO & OTHER LABYRINTH DISORDERS,03,"DISEASES AND DISORDERS OF THE EAR, NOSE, MOUTH AND THROAT",1,Minor,Minor,Medical,Blue Cross/Blue Shield,,,,,Y,31832.47,4779.61
New York City,Bronx,7000006,001168,Montefiore Medical Center-Wakefield Hospital,70 or Older,104,M,Black/African American,Not Span/Hispanic,3,Emergency,Home or Self Care,2020,SYM015,GENERAL SENSATION/PERCEPTION SIGNS AND SYMPTOMS,IMG007,COMPUTERIZED TOMOGRAPHY (CT) WITHOUT CONTRAST,111,VERTIGO & OTHER LABYRINTH DISORDERS,03,"DISEASES AND DISORDERS OF THE EAR, NOSE, MOUTH AND THROAT",2,Moderate,Moderate,Medical,Medicare,Medicaid,,,,Y,67274.2,11028.33
New York City,Bronx,7000006,001169,Montefiore Medical Center - Henry & Lucy Moses Div,50 to 69,104,F,Black/African American,Not Span/Hispanic,2,Emergency,Home or Self Care,2020,SYM015,GENERAL SENSATION/PERCEPTION SIGNS AND SYMPTOMS,,,111,VERTIGO & OTHER LABYRINTH DISORDERS,03,"DISEASES AND DISORDERS OF THE EAR, NOSE, MOUTH AND THROAT",1,Minor,Minor,Medical,Private Health Insurance,,,,,Y,30569.42,5272.41
New York City,Bronx,7000006,003058,Montefiore Med Center - Jack D Weiler Hosp of A Einstein College Div,50 to 69,104,F,Black/African American,Not Span/Hispanic,4,Emergency,Skilled Nursing Home,2020,SYM015,GENERAL SENSATION/PERCEPTION SIGNS AND SYMPTOMS,IMG007,COMPUTERIZED TOMOGRAPHY (CT) WITHOUT CONTRAST,111,VERTIGO & OTHER LABYRINTH DISORDERS,03,"DISEASES AND DISORDERS OF THE EAR, NOSE, MOUTH AND THROAT",1,Minor,Moderate,Medical,Medicare,Private Health Insurance,,,,Y,59443.14,8510.19
Hudson Valley,Westchester,5903001,001061,Montefiore Mount Vernon Hospital,70 or Older,105,F,Black/African American,Multi-ethnic,5,Emergency,Inpatient Rehabilitation Facility,2020,EAR003,DISEASES OF INNER EAR AND RELATED CONDITIONS,ESA001,HEMODIALYSIS,111,VERTIGO & OTHER LABYRINTH DISORDERS,03,"DISEASES AND DISORDERS OF THE EAR, NOSE, MOUTH AND THROAT",2,Moderate,Moderate,Medical,Medicare,Medicare,Private Health Insurance,,,Y,40825.55,13689.89
Hudson Valley,Westchester,5904001,001072,Montefiore New Rochelle Hospital,70 or Older,108,F,Other Race,Unknown,4,Emergency,Home or Self Care,2020,EAR003,DISEASES OF INNER EAR AND RELATED CONDITIONS,ADM017,ADMINISTRATION OF NUTRITIONAL AND ELECTROLYTIC SUBSTANCES,111,VERTIGO & OTHER LABYRINTH DISORDERS,03,"DISEASES AND DISORDERS OF THE EAR, NOSE, MOUTH AND THROAT",1,Minor,Minor,Medical,Medicaid,Medicaid,Self-Pay,,,Y,34989.16,8484.8
New York City,Bronx,7000006,003058,Montefiore Med Center - Jack D Weiler Hosp of A Einstein College Div,70 or Older,104,F,Other Race,Spanish/Hispanic,4,Emergency,Skilled Nursing Home,2020,EAR003,DISEASES OF INNER EAR AND RELATED CONDITIONS,,,111,VERTIGO & OTHER LABYRINTH DISORDERS,03,"DISEASES AND DISORDERS OF THE EAR, NOSE, MOUTH AND THROAT",2,Moderate,Moderate,Medical,Medicare,Private Health Insurance,,,,Y,58217.55,9229.51
New York City,Bronx,7000006,001168,Montefiore Medical Center-Wakefield Hospital,70 or Older,104,F,Black/African American,Not Span/Hispanic,3,Emergency,Home w/ Home Health Services,2020,SYM015,GENERAL SENSATION/PERCEPTION SIGNS AND SYMPTOMS,ADM021,"ADMINISTRATION OF THERAPEUTIC SUBSTANCES, NEC",111,VERTIGO & OTHER LABYRINTH DISORDERS,03,"DISEASES AND DISORDERS OF THE EAR, NOSE, MOUTH AND THROAT",1,Minor,Moderate,Medical,Medicare,Medicaid,,,,Y,54100.07,7787.07
New York City,Bronx,7000006,001169,Montefiore Medical Center - Henry & Lucy Moses Div,50 to 69,104,F,Other Race,Spanish/Hispanic,1,Emergency,Home or Self Care,2020,EAR003,DISEASES OF INNER EAR AND RELATED CONDITIONS,,,111,VERTIGO & OTHER LABYRINTH DISORDERS,03,"DISEASES AND DISORDERS OF THE EAR, NOSE, MOUTH AND THROAT",1,Minor,Minor,Medical,Medicare,Medicaid,,,,Y,26838.61,4038.36
New York City,Bronx,7000006,001168,Montefiore Medical Center-Wakefield Hospital,70 or Older,104,M,Black/African American,Not Span/Hispanic,2,Emergency,Home or Self Care,2020,EAR003,DISEASES OF INNER EAR AND RELATED CONDITIONS,,,111,VERTIGO & OTHER LABYRINTH DISORDERS,03,"DISEASES AND DISORDERS OF THE EAR, NOSE, MOUTH AND THROAT",1,Minor,Minor,Medical,Medicare,,,,,Y,39954.56,5505.55
New York City,Bronx,7000006,003058,Montefiore Med Center - Jack D Weiler Hosp of A Einstein College Div,18 to 29,104,M,Other Race,Not Span/Hispanic,2,Emergency,Home or Self Care,2020,EAR003,DISEASES OF INNER EAR AND RELATED CONDITIONS,,,111,VERTIGO & OTHER LABYRINTH DISORDERS,03,"DISEASES AND DISORDERS OF THE EAR, NOSE, MOUTH AND THROAT",1,Minor,Minor,Medical,Private Health Insurance,,,,,Y,34434.2,5298.64
New York City,Bronx,7000006,001168,Montefiore Medical Center-Wakefield Hospital,50 to 69,104,M,Other Race,Unknown,2,Emergency,Home or Self Care,2020,SYM015,GENERAL SENSATION/PERCEPTION SIGNS AND SYMPTOMS,,,111,VERTIGO & OTHER LABYRINTH DISORDERS,03,"DISEASES AND DISORDERS OF THE EAR, NOSE, MOUTH AND THROAT",1,Minor,Moderate,Medical,Medicaid,,,,,Y,44993.8,7641.71
New York City,Bronx,7000006,001169,Montefiore Medical Center - Henry & Lucy Moses Div,70 or Older,104,F,Other Race,Spanish/Hispanic,2,Emergency,Home or Self Care,2020,EAR003,DISEASES OF INNER EAR AND RELATED CONDITIONS,,,111,VERTIGO & OTHER LABYRINTH DISORDERS,03,"DISEASES AND DISORDERS OF THE EAR, NOSE, MOUTH AND THROAT",1,Minor,Minor,Medical,Medicare,Medicaid,,,,Y,26026.64,4195.13
New York City,Bronx,7000006,003058,Montefiore Med Center - Jack D Weiler Hosp of A Einstein College Div,70 or Older,104,F,Other Race,Spanish/Hispanic,2,Emergency,Home or Self Care,2020,SYM015,GENERAL SENSATION/PERCEPTION SIGNS AND SYMPTOMS,MAM007,ELECTROCARDIOGRAM (ECG),111,VERTIGO & OTHER LABYRINTH DISORDERS,03,"DISEASES AND DISORDERS OF THE EAR, NOSE, MOUTH AND THROAT",1,Minor,Minor,Medical,Medicare,Medicaid,,,,Y,33265.63,4804.43
New York City,Bronx,7000006,003058,Montefiore Med Center - Jack D Weiler Hosp of A Einstein College Div,70 or Older,104,M,Black/African American,Not Span/Hispanic,1,Emergency,Home or Self Care,2020,SYM015,GENERAL SENSATION/PERCEPTION SIGNS AND SYMPTOMS,ADM021,"ADMINISTRATION OF THERAPEUTIC SUBSTANCES, NEC",111,VERTIGO & OTHER LABYRINTH DISORDERS,03,"DISEASES AND DISORDERS OF THE EAR, NOSE, MOUTH AND THROAT",1,Minor,Minor,Medical,Medicare,Private Health Insurance,,,,Y,16239.95,1606.42
New York City,Kings,7002002,001324,Mount Sinai Brooklyn,70 or Older,112,F,Black/African American,Not Span/Hispanic,2,Emergency,Home or Self Care,2020,SYM015,GENERAL SENSATION/PERCEPTION SIGNS AND SYMPTOMS,,,111,VERTIGO & OTHER LABYRINTH DISORDERS,03,"DISEASES AND DISORDERS OF THE EAR, NOSE, MOUTH AND THROAT",1,Minor,Minor,Medical,Medicare,Miscellaneous/Other,Self-Pay,,,Y,31798.32,8118.72
New York City,Manhattan,7002032,001469,Mount Sinai Morningside,30 to 49,100,F,Other Race,Spanish/Hispanic,3,Emergency,Home or Self Care,2020,EAR003,DISEASES OF INNER EAR AND RELATED CONDITIONS,IMG004,FLUOROSCOPY OF NON-CIRCULATORY ORGANS,111,VERTIGO & OTHER LABYRINTH DISORDERS,03,"DISEASES AND DISORDERS OF THE EAR, NOSE, MOUTH AND THROAT",1,Minor,Minor,Medical,Medicare,Medicaid,Self-Pay,,,Y,63281.33,14814.09
New York City,Manhattan,7002032,001466,Mount Sinai West,70 or Older,100,M,White,Not Span/Hispanic,3,Emergency,Skilled Nursing Home,2020,EAR003,DISEASES OF INNER EAR AND RELATED CONDITIONS,MAM015,"MEASUREMENT AND MONITORING, NEC",111,VERTIGO & OTHER LABYRINTH DISORDERS,03,"DISEASES AND DISORDERS OF THE EAR, NOSE, MOUTH AND THROAT",1,Minor,Minor,Medical,Medicare,Private Health Insurance,Self-Pay,,,Y,41529.23,9694.97
New York City,Bronx,7000006,001169,Montefiore Medical Center - Henry & Lucy Moses Div,70 or Older,104,F,Black/African American,Not Span/Hispanic,1,Emergency,Home or Self Care,2020,EAR003,DISEASES OF INNER EAR AND RELATED CONDITIONS,,,111,VERTIGO & OTHER LABYRINTH DISORDERS,03,"DISEASES AND DISORDERS OF THE EAR, NOSE, MOUTH AND THROAT",1,Minor,Minor,Medical,Medicare,,,,,Y,17713.33,2936.45
Hudson Valley,Westchester,5901000,001039,NewYork-Presbyterian/Hudson Valley Hospital,50 to 69,105,M,White,Not Span/Hispanic,2,Emergency,Home or Self Care,2020,EAR003,DISEASES OF INNER EAR AND RELATED CONDITIONS,ADM021,"ADMINISTRATION OF THERAPEUTIC SUBSTANCES, NEC",111,VERTIGO & OTHER LABYRINTH DISORDERS,03,"DISEASES AND DISORDERS OF THE EAR, NOSE, MOUTH AND THROAT",1,Minor,Minor,Medical,Private Health Insurance,,,,,Y,25356.49,8416.9
New York City,Bronx,7000006,001169,Montefiore Medical Center - Henry & Lucy Moses Div,50 to 69,104,M,Other Race,Spanish/Hispanic,1,Emergency,Home or Self Care,2020,EAR003,DISEASES OF INNER EAR AND RELATED CONDITIONS,,,111,VERTIGO & OTHER LABYRINTH DISORDERS,03,"DISEASES AND DISORDERS OF THE EAR, NOSE, MOUTH AND THROAT",1,Minor,Minor,Medical,Blue Cross/Blue Shield,,,,,Y,31865.32,3617.83
New York City,Bronx,7000006,001169,Montefiore Medical Center - Henry & Lucy Moses Div,50 to 69,104,F,Other Race,Spanish/Hispanic,1,Emergency,Home or Self Care,2020,EAR003,DISEASES OF INNER EAR AND RELATED CONDITIONS,,,111,VERTIGO & OTHER LABYRINTH DISORDERS,03,"DISEASES AND DISORDERS OF THE EAR, NOSE, MOUTH AND THROAT",1,Minor,Minor,Medical,Self-Pay,,,,,Y,21284.47,3129.89
New York City,Bronx,7000006,001169,Montefiore Medical Center - Henry & Lucy Moses Div,70 or Older,104,F,Other Race,Spanish/Hispanic,2,Emergency,Home or Self Care,2020,SYM015,GENERAL SENSATION/PERCEPTION SIGNS AND SYMPTOMS,,,111,VERTIGO & OTHER LABYRINTH DISORDERS,03,"DISEASES AND DISORDERS OF THE EAR, NOSE, MOUTH AND THROAT",2,Moderate,Minor,Medical,Medicare,Medicaid,,,,Y,53199.56,7390.25
New York City,Bronx,7000006,001169,Montefiore Medical Center - Henry & Lucy Moses Div,0 to 17,104,M,Other Race,Spanish/Hispanic,2,Emergency,Home or Self Care,2020,SYM015,GENERAL SENSATION/PERCEPTION SIGNS AND SYMPTOMS,MAM011,ELECTROENCEPHALOGRAM (EEG),111,VERTIGO & OTHER LABYRINTH DISORDERS,03,"DISEASES AND DISORDERS OF THE EAR, NOSE, MOUTH AND THROAT",2,Moderate,Minor,Medical,Medicaid,,,,,Y,48557.04,7808.85
Hudson Valley,Westchester,5904001,001072,Montefiore New Rochelle Hospital,70 or Older,108,F,White,Unknown,2,Emergency,Home or Self Care,2020,EAR003,DISEASES OF INNER EAR AND RELATED CONDITIONS,ADM021,"ADMINISTRATION OF THERAPEUTIC SUBSTANCES, NEC",111,VERTIGO & OTHER LABYRINTH DISORDERS,03,"DISEASES AND DISORDERS OF THE EAR, NOSE, MOUTH AND THROAT",2,Moderate,Minor,Medical,Medicare,Medicare,Private Health Insurance,,,Y,19889.13,7464.53
Hudson Valley,Westchester,5904001,001072,Montefiore New Rochelle Hospital,70 or Older,108,F,Black/African American,Unknown,3,Emergency,Home w/ Home Health Services,2020,EAR003,DISEASES OF INNER EAR AND RELATED CONDITIONS,,,111,VERTIGO & OTHER LABYRINTH DISORDERS,03,"DISEASES AND DISORDERS OF THE EAR, NOSE, MOUTH AND THROAT",2,Moderate,Moderate,Medical,Medicare,Medicare,Private Health Insurance,,,Y,23898.02,6468.32
New York City,Manhattan,7002054,003975,New York Presbyterian Hospital - Allen Hospital,50 to 69,104,M,Other Race,Spanish/Hispanic,1,Emergency,Home or Self Care,2020,SYM015,GENERAL SENSATION/PERCEPTION SIGNS AND SYMPTOMS,,,111,VERTIGO & OTHER LABYRINTH DISORDERS,03,"DISEASES AND DISORDERS OF THE EAR, NOSE, MOUTH AND THROAT",1,Minor,Minor,Medical,Private Health Insurance,Self-Pay,,,,Y,15256,3320.08
New York City,Manhattan,7002054,003975,New York Presbyterian Hospital - Allen Hospital,70 or Older,104,M,Multi-racial,Multi-ethnic,1,Emergency,Home or Self Care,2020,EAR003,DISEASES OF INNER EAR AND RELATED CONDITIONS,,,111,VERTIGO & OTHER LABYRINTH DISORDERS,03,"DISEASES AND DISORDERS OF THE EAR, NOSE, MOUTH AND THROAT",1,Minor,Minor,Medical,Medicare,Medicaid,Self-Pay,,,Y,17729.62,3915.72
New York City,Manhattan,7002054,003975,New York Presbyterian Hospital - Allen Hospital,30 to 49,100,F,Other Race,Spanish/Hispanic,1,Emergency,Home or Self Care,2020,EAR003,DISEASES OF INNER EAR AND RELATED CONDITIONS,,,111,VERTIGO & OTHER LABYRINTH DISORDERS,03,"DISEASES AND DISORDERS OF THE EAR, NOSE, MOUTH AND THROAT",1,Minor,Minor,Medical,Medicaid,Medicaid,Self-Pay,,,Y,15068.15,3334.47
New York City,Manhattan,7002054,001464,New York-Presbyterian Hospital - Columbia Presbyterian Center,70 or Older,100,F,Other Race,Spanish/Hispanic,1,Emergency,Home or Self Care,2020,EAR003,DISEASES OF INNER EAR AND RELATED CONDITIONS,,,111,VERTIGO & OTHER LABYRINTH DISORDERS,03,"DISEASES AND DISORDERS OF THE EAR, NOSE, MOUTH AND THROAT",1,Minor,Minor,Medical,Medicare,Medicare,Self-Pay,,,Y,26411.9,5415.11
New York City,Manhattan,7002054,001464,New York-Presbyterian Hospital - Columbia Presbyterian Center,70 or Older,104,F,Multi-racial,Multi-ethnic,1,Emergency,Home or Self Care,2020,EAR003,DISEASES OF INNER EAR AND RELATED CONDITIONS,,,111,VERTIGO & OTHER LABYRINTH DISORDERS,03,"DISEASES AND DISORDERS OF THE EAR, NOSE, MOUTH AND THROAT",2,Moderate,Minor,Medical,Medicare,Medicare,Medicaid,,,Y,21004.83,4203.26
New York City,Manhattan,7002054,001464,New York-Presbyterian Hospital - Columbia Presbyterian Center,50 to 69,100,M,Other Race,Multi-ethnic,1,Emergency,Home or Self Care,2020,SYM015,GENERAL SENSATION/PERCEPTION SIGNS AND SYMPTOMS,,,111,VERTIGO & OTHER LABYRINTH DISORDERS,03,"DISEASES AND DISORDERS OF THE EAR, NOSE, MOUTH AND THROAT",1,Minor,Minor,Medical,Medicaid,Self-Pay,,,,Y,25529.14,5351.15
New York City,Manhattan,7002054,001464,New York-Presbyterian Hospital - Columbia Presbyterian Center,70 or Older,100,F,Black/African American,Not Span/Hispanic,7,Emergency,Home w/ Home Health Services,2020,EAR003,DISEASES OF INNER EAR AND RELATED CONDITIONS,IMG008,ULTRASONOGRAPHY,111,VERTIGO & OTHER LABYRINTH DISORDERS,03,"DISEASES AND DISORDERS OF THE EAR, NOSE, MOUTH AND THROAT",2,Moderate,Minor,Medical,Medicare,Medicaid,Self-Pay,,,Y,84898.88,18835.71
New York City,Manhattan,7002054,001464,New York-Presbyterian Hospital - Columbia Presbyterian Center,70 or Older,100,M,White,Not Span/Hispanic,2,Emergency,Home w/ Home Health Services,2020,SYM015,GENERAL SENSATION/PERCEPTION SIGNS AND SYMPTOMS,,,111,VERTIGO & OTHER LABYRINTH DISORDERS,03,"DISEASES AND DISORDERS OF THE EAR, NOSE, MOUTH AND THROAT",1,Minor,Minor,Medical,Medicare,Medicare,Self-Pay,,,Y,36165.62,7228.75
New York City,Queens,7003010,001637,New York - Presbyterian/Queens,70 or Older,113,M,White,Not Span/Hispanic,1,Emergency,Home w/ Home Health Services,2020,SYM015,GENERAL SENSATION/PERCEPTION SIGNS AND SYMPTOMS,,,111,VERTIGO & OTHER LABYRINTH DISORDERS,03,"DISEASES AND DISORDERS OF THE EAR, NOSE, MOUTH AND THROAT",1,Minor,Minor,Medical,Medicare,Private Health Insurance,Self-Pay,,,Y,24247.16,4122.7
New York City,Queens,7003010,001637,New York - Presbyterian/Queens,70 or Older,114,M,White,Not Span/Hispanic,3,Emergency,Home or Self Care,2020,SYM015,GENERAL SENSATION/PERCEPTION SIGNS AND SYMPTOMS,IMG008,ULTRASONOGRAPHY,111,VERTIGO & OTHER LABYRINTH DISORDERS,03,"DISEASES AND DISORDERS OF THE EAR, NOSE, MOUTH AND THROAT",1,Minor,Minor,Medical,Medicare,Medicaid,Self-Pay,,,Y,29510.13,7354.68
New York City,Queens,7003010,001637,New York - Presbyterian/Queens,50 to 69,111,F,Other Race,Not Span/Hispanic,2,Emergency,Home or Self Care,2020,EAR003,DISEASES OF INNER EAR AND RELATED CONDITIONS,ADM021,"ADMINISTRATION OF THERAPEUTIC SUBSTANCES, NEC",111,VERTIGO & OTHER LABYRINTH DISORDERS,03,"DISEASES AND DISORDERS OF THE EAR, NOSE, MOUTH AND THROAT",1,Minor,Minor,Medical,"Managed Care, Unspecified",Medicaid,Self-Pay,,,Y,22216.16,4512.99
New York City,Queens,7003010,001637,New York - Presbyterian/Queens,30 to 49,113,F,Other Race,Not Span/Hispanic,3,Emergency,Home or Self Care,2020,EAR003,DISEASES OF INNER EAR AND RELATED CONDITIONS,ADM021,"ADMINISTRATION OF THERAPEUTIC SUBSTANCES, NEC",111,VERTIGO & OTHER LABYRINTH DISORDERS,03,"DISEASES AND DISORDERS OF THE EAR, NOSE, MOUTH AND THROAT",1,Minor,Minor,Medical,Private Health Insurance,Self-Pay,,,,Y,28611.85,6105.99
New York City,Queens,7003010,001637,New York - Presbyterian/Queens,70 or Older,113,M,Other Race,Not Span/Hispanic,1,Emergency,Home or Self Care,2020,EAR003,DISEASES OF INNER EAR AND RELATED CONDITIONS,ADM017,ADMINISTRATION OF NUTRITIONAL AND ELECTROLYTIC SUBSTANCES,111,VERTIGO & OTHER LABYRINTH DISORDERS,03,"DISEASES AND DISORDERS OF THE EAR, NOSE, MOUTH AND THROAT",2,Moderate,Minor,Medical,Medicare,Medicare,Medicaid,,,Y,25599.18,3501.42
New York City,Queens,7003010,001637,New York - Presbyterian/Queens,70 or Older,113,F,Other Race,Spanish/Hispanic,2,Emergency,Home or Self Care,2020,EAR003,DISEASES OF INNER EAR AND RELATED CONDITIONS,IMG008,ULTRASONOGRAPHY,111,VERTIGO & OTHER LABYRINTH DISORDERS,03,"DISEASES AND DISORDERS OF THE EAR, NOSE, MOUTH AND THROAT",1,Minor,Minor,Medical,Medicare,Medicaid,Self-Pay,,,Y,34523.86,6383.5
New York City,Queens,7003010,001637,New York - Presbyterian/Queens,70 or Older,113,M,White,Not Span/Hispanic,5,Emergency,Facility w/ Custodial/Supportive Care,2020,EAR003,DISEASES OF INNER EAR AND RELATED CONDITIONS,,,111,VERTIGO & OTHER LABYRINTH DISORDERS,03,"DISEASES AND DISORDERS OF THE EAR, NOSE, MOUTH AND THROAT",1,Minor,Minor,Medical,Medicare,Private Health Insurance,Self-Pay,,,Y,41192.06,9856.25
New York City,Queens,7003010,001637,New York - Presbyterian/Queens,70 or Older,113,F,White,Not Span/Hispanic,2,Emergency,Skilled Nursing Home,2020,SYM015,GENERAL SENSATION/PERCEPTION SIGNS AND SYMPTOMS,ADM017,ADMINISTRATION OF NUTRITIONAL AND ELECTROLYTIC SUBSTANCES,111,VERTIGO & OTHER LABYRINTH DISORDERS,03,"DISEASES AND DISORDERS OF THE EAR, NOSE, MOUTH AND THROAT",1,Minor,Minor,Medical,Medicare,Medicaid,Self-Pay,,,Y,30325.47,5980.26
New York City,Queens,7003010,001637,New York - Presbyterian/Queens,50 to 69,113,F,Other Race,Not Span/Hispanic,1,Emergency,Home or Self Care,2020,EAR003,DISEASES OF INNER EAR AND RELATED CONDITIONS,ADM021,"ADMINISTRATION OF THERAPEUTIC SUBSTANCES, NEC",111,VERTIGO & OTHER LABYRINTH DISORDERS,03,"DISEASES AND DISORDERS OF THE EAR, NOSE, MOUTH AND THROAT",1,Minor,Minor,Medical,Medicare,Medicaid,Self-Pay,,,Y,27006.53,3510.89
New York City,Queens,7003010,001637,New York - Presbyterian/Queens,50 to 69,113,F,Other Race,Not Span/Hispanic,2,Emergency,Home w/ Home Health Services,2020,EAR003,DISEASES OF INNER EAR AND RELATED CONDITIONS,,,111,VERTIGO & OTHER LABYRINTH DISORDERS,03,"DISEASES AND DISORDERS OF THE EAR, NOSE, MOUTH AND THROAT",2,Moderate,Moderate,Medical,Medicare,Medicaid,Self-Pay,,,Y,19862.83,4501.14
New York City,Queens,7003010,001637,New York - Presbyterian/Queens,70 or Older,113,F,Other Race,Not Span/Hispanic,3,Emergency,Skilled Nursing Home,2020,SYM015,GENERAL SENSATION/PERCEPTION SIGNS AND SYMPTOMS,ADM017,ADMINISTRATION OF NUTRITIONAL AND ELECTROLYTIC SUBSTANCES,111,VERTIGO & OTHER LABYRINTH DISORDERS,03,"DISEASES AND DISORDERS OF THE EAR, NOSE, MOUTH AND THROAT",1,Minor,Minor,Medical,Medicaid,Self-Pay,,,,Y,34202.79,7905.34
New York City,Queens,7003010,001637,New York - Presbyterian/Queens,70 or Older,113,F,White,Spanish/Hispanic,2,Emergency,Home or Self Care,2020,SYM015,GENERAL SENSATION/PERCEPTION SIGNS AND SYMPTOMS,ADM021,"ADMINISTRATION OF THERAPEUTIC SUBSTANCES, NEC",111,VERTIGO & OTHER LABYRINTH DISORDERS,03,"DISEASES AND DISORDERS OF THE EAR, NOSE, MOUTH AND THROAT",1,Minor,Minor,Medical,Medicare,Medicare,Medicaid,,,Y,27288.4,5672.68
New York City,Bronx,7000006,001169,Montefiore Medical Center - Henry & Lucy Moses Div,70 or Older,104,F,Other Race,Spanish/Hispanic,2,Emergency,Home or Self Care,2020,EAR003,DISEASES OF INNER EAR AND RELATED CONDITIONS,,,111,VERTIGO & OTHER LABYRINTH DISORDERS,03,"DISEASES AND DISORDERS OF THE EAR, NOSE, MOUTH AND THROAT",1,Minor,Minor,Medical,Medicare,Medicaid,,,,Y,33302.67,5301.24
New York City,Manhattan,7002053,001463,NYU Langone Hospitals,50 to 69,112,F,White,Not Span/Hispanic,2,Emergency,Home or Self Care,2020,EAR003,DISEASES OF INNER EAR AND RELATED CONDITIONS,,,111,VERTIGO & OTHER LABYRINTH DISORDERS,03,"DISEASES AND DISORDERS OF THE EAR, NOSE, MOUTH AND THROAT",1,Minor,Minor,Medical,Private Health Insurance,,,,,Y,41434.48,12229.85
New York City,Manhattan,7002054,001437,New York-Presbyterian/Lower Manhattan Hospital,50 to 69,100,F,Black/African American,Not Span/Hispanic,2,Emergency,Home w/ Home Health Services,2020,EAR003,DISEASES OF INNER EAR AND RELATED CONDITIONS,ADM017,ADMINISTRATION OF NUTRITIONAL AND ELECTROLYTIC SUBSTANCES,111,VERTIGO & OTHER LABYRINTH DISORDERS,03,"DISEASES AND DISORDERS OF THE EAR, NOSE, MOUTH AND THROAT",1,Minor,Minor,Medical,Medicare,Medicare,Medicaid,,,Y,33575.15,7027.65