Hospital Service Area,Hospital County,Operating Certificate Number,Permanent Facility Id,Facility Name,Age Group,Zip Code - 3 digits,Gender,Race,Ethnicity,Length of Stay,Type of Admission,Patient Disposition,Discharge Year,CCS Diagnosis Code,CCS Diagnosis Description,CCS Procedure Code,CCS Procedure Description,APR DRG Code,APR DRG Description,APR MDC Code,APR MDC Description,APR Severity of Illness Code,APR Severity of Illness Description,APR Risk of Mortality,APR Medical Surgical Description,Payment Typology 1,Payment Typology 2,Payment Typology 3,Birth Weight,Abortion Edit Indicator,Emergency Department Indicator,Total Charges,Total Costs
Long Island,Nassau,2908000,000511,NYU Langone Hospital-Long Island,70 or Older,115,M,White,Not Span/Hispanic,2,Emergency,Home or Self Care,2020,RSP006,OTHER SPECIFIED UPPER RESPIRATORY INFECTIONS,,,113,INFECTIONS OF UPPER RESPIRATORY TRACT,03,"DISEASES AND DISORDERS OF THE EAR, NOSE, MOUTH AND THROAT",2,Moderate,Moderate,Medical,Blue Cross/Blue Shield,,,,,Y,28018.92,7944.86
Long Island,Nassau,2908000,000511,NYU Langone Hospital-Long Island,70 or Older,110,F,White,Not Span/Hispanic,1,Emergency,Home or Self Care,2020,RSP006,OTHER SPECIFIED UPPER RESPIRATORY INFECTIONS,,,113,INFECTIONS OF UPPER RESPIRATORY TRACT,03,"DISEASES AND DISORDERS OF THE EAR, NOSE, MOUTH AND THROAT",4,Extreme,Major,Medical,Medicare,Blue Cross/Blue Shield,,,,Y,22417.37,4935.77
Long Island,Nassau,2908000,000511,NYU Langone Hospital-Long Island,0 to 17,115,M,White,Not Span/Hispanic,1,Emergency,Home or Self Care,2020,RSP003,INFLUENZA,,,113,INFECTIONS OF UPPER RESPIRATORY TRACT,03,"DISEASES AND DISORDERS OF THE EAR, NOSE, MOUTH AND THROAT",1,Minor,Minor,Medical,Medicaid,,,,,Y,14167.94,3211.48
Long Island,Nassau,2908000,000511,NYU Langone Hospital-Long Island,30 to 49,118,F,White,Not Span/Hispanic,2,Emergency,Home or Self Care,2020,RSP001,SINUSITIS,,,113,INFECTIONS OF UPPER RESPIRATORY TRACT,03,"DISEASES AND DISORDERS OF THE EAR, NOSE, MOUTH AND THROAT",2,Moderate,Minor,Medical,Medicaid,,,,,Y,27552.87,7957.54
Long Island,Nassau,2908000,000511,NYU Langone Hospital-Long Island,0 to 17,115,M,Other Race,Not Span/Hispanic,1,Emergency,Home or Self Care,2020,RSP003,INFLUENZA,OTR004,ISOLATION PROCEDURES,113,INFECTIONS OF UPPER RESPIRATORY TRACT,03,"DISEASES AND DISORDERS OF THE EAR, NOSE, MOUTH AND THROAT",1,Minor,Minor,Medical,Private Health Insurance,,,,,Y,16014.48,3397.11
Long Island,Nassau,2908000,000511,NYU Langone Hospital-Long Island,0 to 17,115,M,White,Spanish/Hispanic,1,Emergency,Home or Self Care,2020,RSP003,INFLUENZA,OTR004,ISOLATION PROCEDURES,113,INFECTIONS OF UPPER RESPIRATORY TRACT,03,"DISEASES AND DISORDERS OF THE EAR, NOSE, MOUTH AND THROAT",3,Major,Major,Medical,Medicaid,,,,,Y,27081.82,4447.75
Long Island,Nassau,2908000,000511,NYU Langone Hospital-Long Island,0 to 17,117,M,Other Race,Spanish/Hispanic,1,Emergency,Home w/ Home Health Services,2020,RSP006,OTHER SPECIFIED UPPER RESPIRATORY INFECTIONS,ESA004,NON-INVASIVE VENTILATION,113,INFECTIONS OF UPPER RESPIRATORY TRACT,03,"DISEASES AND DISORDERS OF THE EAR, NOSE, MOUTH AND THROAT",3,Major,Moderate,Medical,Medicaid,,,,,Y,22855.25,5652.42
Long Island,Nassau,2908000,000511,NYU Langone Hospital-Long Island,70 or Older,115,F,Black/African American,Not Span/Hispanic,3,Emergency,Home w/ Home Health Services,2020,RSP003,INFLUENZA,OTR004,ISOLATION PROCEDURES,113,INFECTIONS OF UPPER RESPIRATORY TRACT,03,"DISEASES AND DISORDERS OF THE EAR, NOSE, MOUTH AND THROAT",2,Moderate,Minor,Medical,Medicare,,,,,Y,38018.29,11249.38
Long Island,Nassau,2908000,000511,NYU Langone Hospital-Long Island,50 to 69,115,M,White,Not Span/Hispanic,6,Emergency,Home or Self Care,2020,RSP003,INFLUENZA,ESA004,NON-INVASIVE VENTILATION,113,INFECTIONS OF UPPER RESPIRATORY TRACT,03,"DISEASES AND DISORDERS OF THE EAR, NOSE, MOUTH AND THROAT",3,Major,Major,Medical,Blue Cross/Blue Shield,,,,,Y,86079.48,23799.19
Long Island,Nassau,2908000,000511,NYU Langone Hospital-Long Island,70 or Older,117,M,White,Not Span/Hispanic,5,Emergency,Home or Self Care,2020,RSP003,INFLUENZA,OTR004,ISOLATION PROCEDURES,113,INFECTIONS OF UPPER RESPIRATORY TRACT,03,"DISEASES AND DISORDERS OF THE EAR, NOSE, MOUTH AND THROAT",2,Moderate,Minor,Medical,Medicare,Blue Cross/Blue Shield,,,,Y,45006.51,17118.6
Long Island,Nassau,2908000,000511,NYU Langone Hospital-Long Island,0 to 17,115,F,Other Race,Spanish/Hispanic,1,Emergency,Home or Self Care,2020,RSP006,OTHER SPECIFIED UPPER RESPIRATORY INFECTIONS,,,113,INFECTIONS OF UPPER RESPIRATORY TRACT,03,"DISEASES AND DISORDERS OF THE EAR, NOSE, MOUTH AND THROAT",2,Moderate,Minor,Medical,Private Health Insurance,,,,,Y,15980.07,3406.58
Long Island,Nassau,2908000,000511,NYU Langone Hospital-Long Island,0 to 17,115,M,White,Not Span/Hispanic,2,Emergency,Home or Self Care,2020,RSP006,OTHER SPECIFIED UPPER RESPIRATORY INFECTIONS,CNS002,LUMBAR PUNCTURE,113,INFECTIONS OF UPPER RESPIRATORY TRACT,03,"DISEASES AND DISORDERS OF THE EAR, NOSE, MOUTH AND THROAT",1,Minor,Minor,Medical,Medicaid,,,03500,,Y,25993.93,5845.56
Long Island,Nassau,2908000,000511,NYU Langone Hospital-Long Island,50 to 69,110,M,White,Not Span/Hispanic,1,Emergency,Home or Self Care,2020,RSP006,OTHER SPECIFIED UPPER RESPIRATORY INFECTIONS,,,113,INFECTIONS OF UPPER RESPIRATORY TRACT,03,"DISEASES AND DISORDERS OF THE EAR, NOSE, MOUTH AND THROAT",2,Moderate,Moderate,Medical,Self-Pay,,,,,Y,23314.06,5137.48
Long Island,Nassau,2908000,000511,NYU Langone Hospital-Long Island,70 or Older,115,F,Other Race,Not Span/Hispanic,1,Emergency,Home w/ Home Health Services,2020,RSP003,INFLUENZA,OTR004,ISOLATION PROCEDURES,113,INFECTIONS OF UPPER RESPIRATORY TRACT,03,"DISEASES AND DISORDERS OF THE EAR, NOSE, MOUTH AND THROAT",2,Moderate,Minor,Medical,Medicare,,,,,Y,23369.07,5113.09
Long Island,Nassau,2908000,000511,NYU Langone Hospital-Long Island,50 to 69,117,M,White,Not Span/Hispanic,3,Emergency,Home w/ Home Health Services,2020,RSP003,INFLUENZA,ESA001,HEMODIALYSIS,113,INFECTIONS OF UPPER RESPIRATORY TRACT,03,"DISEASES AND DISORDERS OF THE EAR, NOSE, MOUTH AND THROAT",3,Major,Major,Medical,Medicare,Blue Cross/Blue Shield,,,,Y,41458.89,17018.94
Long Island,Nassau,2908000,000511,NYU Langone Hospital-Long Island,50 to 69,110,F,Other Race,Not Span/Hispanic,8,Emergency,Home w/ Home Health Services,2020,RSP003,INFLUENZA,OTR004,ISOLATION PROCEDURES,113,INFECTIONS OF UPPER RESPIRATORY TRACT,03,"DISEASES AND DISORDERS OF THE EAR, NOSE, MOUTH AND THROAT",2,Moderate,Minor,Medical,Blue Cross/Blue Shield,,,,,Y,72611.06,27299.81
Long Island,Nassau,2908000,000511,NYU Langone Hospital-Long Island,0 to 17,114,F,Black/African American,Not Span/Hispanic,1,Emergency,Home or Self Care,2020,RSP003,INFLUENZA,,,113,INFECTIONS OF UPPER RESPIRATORY TRACT,03,"DISEASES AND DISORDERS OF THE EAR, NOSE, MOUTH AND THROAT",1,Minor,Minor,Medical,Blue Cross/Blue Shield,,,,,Y,21779.99,5439.24
Long Island,Nassau,2908000,000511,NYU Langone Hospital-Long Island,30 to 49,115,F,White,Spanish/Hispanic,1,Emergency,Home or Self Care,2020,RSP003,INFLUENZA,,,113,INFECTIONS OF UPPER RESPIRATORY TRACT,03,"DISEASES AND DISORDERS OF THE EAR, NOSE, MOUTH AND THROAT",2,Moderate,Moderate,Medical,Medicaid,,,,,Y,19606.96,4746.52
Long Island,Nassau,2908000,000511,NYU Langone Hospital-Long Island,70 or Older,114,M,White,Spanish/Hispanic,9,Emergency,Hospice - Medical Facility,2020,RSP003,INFLUENZA,ESA003,MECHANICAL VENTILATION,113,INFECTIONS OF UPPER RESPIRATORY TRACT,03,"DISEASES AND DISORDERS OF THE EAR, NOSE, MOUTH AND THROAT",4,Extreme,Extreme,Medical,Medicare,,,,,Y,222251.45,72944.83
Long Island,Nassau,2908000,000511,NYU Langone Hospital-Long Island,70 or Older,115,F,White,Not Span/Hispanic,6,Emergency,Home w/ Home Health Services,2020,RSP003,INFLUENZA,ESA001,HEMODIALYSIS,113,INFECTIONS OF UPPER RESPIRATORY TRACT,03,"DISEASES AND DISORDERS OF THE EAR, NOSE, MOUTH AND THROAT",3,Major,Major,Medical,Medicare,Blue Cross/Blue Shield,,,,Y,116260.75,33471.74
Long Island,Nassau,2908000,000511,NYU Langone Hospital-Long Island,0 to 17,117,F,Other Race,Spanish/Hispanic,2,Emergency,Home or Self Care,2020,RSP003,INFLUENZA,,,113,INFECTIONS OF UPPER RESPIRATORY TRACT,03,"DISEASES AND DISORDERS OF THE EAR, NOSE, MOUTH AND THROAT",2,Moderate,Moderate,Medical,Medicaid,,,,,Y,23585.61,5633.65
Long Island,Nassau,2908000,000511,NYU Langone Hospital-Long Island,0 to 17,115,M,Other Race,Spanish/Hispanic,1,Emergency,Home or Self Care,2020,RSP004,ACUTE AND CHRONIC TONSILLITIS,ENT006,ENT DRAINAGE (EXCLUDING MYRINGOTOMY),113,INFECTIONS OF UPPER RESPIRATORY TRACT,03,"DISEASES AND DISORDERS OF THE EAR, NOSE, MOUTH AND THROAT",1,Minor,Minor,Medical,Blue Cross/Blue Shield,,,,,Y,36029.63,6186.01
Long Island,Nassau,2908000,000511,NYU Langone Hospital-Long Island,0 to 17,115,F,Other Race,Spanish/Hispanic,1,Emergency,Home or Self Care,2020,RSP003,INFLUENZA,,,113,INFECTIONS OF UPPER RESPIRATORY TRACT,03,"DISEASES AND DISORDERS OF THE EAR, NOSE, MOUTH AND THROAT",2,Moderate,Minor,Medical,Medicaid,,,,,Y,16169.36,3414.78
Long Island,Nassau,2908000,000511,NYU Langone Hospital-Long Island,50 to 69,115,F,Black/African American,Not Span/Hispanic,2,Emergency,Home or Self Care,2020,RSP006,OTHER SPECIFIED UPPER RESPIRATORY INFECTIONS,,,113,INFECTIONS OF UPPER RESPIRATORY TRACT,03,"DISEASES AND DISORDERS OF THE EAR, NOSE, MOUTH AND THROAT",2,Moderate,Minor,Medical,Private Health Insurance,Private Health Insurance,,,,Y,33021.39,8603.85
Long Island,Nassau,2908000,000511,NYU Langone Hospital-Long Island,0 to 17,115,M,Other Race,Not Span/Hispanic,2,Urgent,Home or Self Care,2020,RSP006,OTHER SPECIFIED UPPER RESPIRATORY INFECTIONS,,,113,INFECTIONS OF UPPER RESPIRATORY TRACT,03,"DISEASES AND DISORDERS OF THE EAR, NOSE, MOUTH AND THROAT",3,Major,Major,Medical,Medicaid,,,,,N,14291.66,4405.7
Long Island,Nassau,2908000,000511,NYU Langone Hospital-Long Island,50 to 69,115,F,Black/African American,Not Span/Hispanic,3,Emergency,Home w/ Home Health Services,2020,RSP003,INFLUENZA,OTR004,ISOLATION PROCEDURES,113,INFECTIONS OF UPPER RESPIRATORY TRACT,03,"DISEASES AND DISORDERS OF THE EAR, NOSE, MOUTH AND THROAT",1,Minor,Moderate,Medical,Private Health Insurance,,,,,Y,50840.63,12614.44
Long Island,Nassau,2908000,000511,NYU Langone Hospital-Long Island,70 or Older,115,F,White,Not Span/Hispanic,14,Emergency,Home w/ Home Health Services,2020,RSP003,INFLUENZA,,,113,INFECTIONS OF UPPER RESPIRATORY TRACT,03,"DISEASES AND DISORDERS OF THE EAR, NOSE, MOUTH AND THROAT",2,Moderate,Moderate,Medical,Medicare,Medicare,,,,Y,138053.7,48437.07
Long Island,Nassau,2908000,000511,NYU Langone Hospital-Long Island,50 to 69,117,M,White,Not Span/Hispanic,2,Emergency,Home or Self Care,2020,RSP003,INFLUENZA,,,113,INFECTIONS OF UPPER RESPIRATORY TRACT,03,"DISEASES AND DISORDERS OF THE EAR, NOSE, MOUTH AND THROAT",2,Moderate,Major,Medical,Medicare,Blue Cross/Blue Shield,,,,Y,60720.52,16107.87
Long Island,Nassau,2908000,000511,NYU Langone Hospital-Long Island,70 or Older,115,F,Black/African American,Not Span/Hispanic,6,Emergency,Home w/ Home Health Services,2020,RSP003,INFLUENZA,OTR004,ISOLATION PROCEDURES,113,INFECTIONS OF UPPER RESPIRATORY TRACT,03,"DISEASES AND DISORDERS OF THE EAR, NOSE, MOUTH AND THROAT",3,Major,Major,Medical,Medicare,Blue Cross/Blue Shield,,,,Y,68634.98,22361.95
Long Island,Nassau,2908000,000511,NYU Langone Hospital-Long Island,70 or Older,115,M,White,Not Span/Hispanic,6,Emergency,Skilled Nursing Home,2020,RSP003,INFLUENZA,,,113,INFECTIONS OF UPPER RESPIRATORY TRACT,03,"DISEASES AND DISORDERS OF THE EAR, NOSE, MOUTH AND THROAT",2,Moderate,Moderate,Medical,Medicare,Blue Cross/Blue Shield,Medicaid,,,Y,67252.72,22352.16
Long Island,Nassau,2908000,000511,NYU Langone Hospital-Long Island,50 to 69,115,M,White,Not Span/Hispanic,2,Emergency,Home w/ Home Health Services,2020,RSP003,INFLUENZA,,,113,INFECTIONS OF UPPER RESPIRATORY TRACT,03,"DISEASES AND DISORDERS OF THE EAR, NOSE, MOUTH AND THROAT",1,Minor,Minor,Medical,Medicare,Medicare,,,,Y,32761.76,8561.19
Long Island,Nassau,2908000,000511,NYU Langone Hospital-Long Island,0 to 17,115,F,Other Race,Spanish/Hispanic,1,Emergency,Home or Self Care,2020,RSP003,INFLUENZA,,,113,INFECTIONS OF UPPER RESPIRATORY TRACT,03,"DISEASES AND DISORDERS OF THE EAR, NOSE, MOUTH AND THROAT",1,Minor,Minor,Medical,Private Health Insurance,,,,,Y,21946.12,7983.69
Long Island,Nassau,2908000,000511,NYU Langone Hospital-Long Island,0 to 17,115,M,Other Race,Spanish/Hispanic,2,Emergency,Home or Self Care,2020,RSP003,INFLUENZA,,,113,INFECTIONS OF UPPER RESPIRATORY TRACT,03,"DISEASES AND DISORDERS OF THE EAR, NOSE, MOUTH AND THROAT",3,Major,Moderate,Medical,Medicaid,,,,,Y,27482.79,5624.34
Long Island,Nassau,2908000,000511,NYU Langone Hospital-Long Island,0 to 17,115,F,Other Race,Spanish/Hispanic,1,Emergency,Home w/ Home Health Services,2020,RSP003,INFLUENZA,OTR004,ISOLATION PROCEDURES,113,INFECTIONS OF UPPER RESPIRATORY TRACT,03,"DISEASES AND DISORDERS OF THE EAR, NOSE, MOUTH AND THROAT",2,Moderate,Minor,Medical,Medicaid,,,,,Y,19565.49,4083.32
Long Island,Nassau,2908000,000511,NYU Langone Hospital-Long Island,50 to 69,114,F,White,Not Span/Hispanic,2,Emergency,Home or Self Care,2020,RSP003,INFLUENZA,OTR004,ISOLATION PROCEDURES,113,INFECTIONS OF UPPER RESPIRATORY TRACT,03,"DISEASES AND DISORDERS OF THE EAR, NOSE, MOUTH AND THROAT",2,Moderate,Moderate,Medical,Private Health Insurance,,,,,Y,51022.22,9378.26
Long Island,Nassau,2908000,000511,NYU Langone Hospital-Long Island,0 to 17,117,M,White,Not Span/Hispanic,2,Emergency,Home or Self Care,2020,RSP003,INFLUENZA,CNS002,LUMBAR PUNCTURE,113,INFECTIONS OF UPPER RESPIRATORY TRACT,03,"DISEASES AND DISORDERS OF THE EAR, NOSE, MOUTH AND THROAT",1,Minor,Minor,Medical,Medicaid,,,03400,,Y,24336.97,5623.53
Long Island,Nassau,2908000,000511,NYU Langone Hospital-Long Island,70 or Older,115,M,White,Not Span/Hispanic,3,Emergency,Home or Self Care,2020,RSP003,INFLUENZA,,,113,INFECTIONS OF UPPER RESPIRATORY TRACT,03,"DISEASES AND DISORDERS OF THE EAR, NOSE, MOUTH AND THROAT",2,Moderate,Moderate,Medical,Private Health Insurance,,,,,Y,42742.61,12201.11
Long Island,Nassau,2908000,000511,NYU Langone Hospital-Long Island,70 or Older,117,M,White,Not Span/Hispanic,4,Emergency,Home or Self Care,2020,RSP003,INFLUENZA,ESA001,HEMODIALYSIS,113,INFECTIONS OF UPPER RESPIRATORY TRACT,03,"DISEASES AND DISORDERS OF THE EAR, NOSE, MOUTH AND THROAT",4,Extreme,Extreme,Medical,Medicare,Private Health Insurance,,,,Y,71046.85,21524.68
Long Island,Nassau,2908000,000511,NYU Langone Hospital-Long Island,70 or Older,110,F,White,Not Span/Hispanic,5,Emergency,Home or Self Care,2020,RSP003,INFLUENZA,,,113,INFECTIONS OF UPPER RESPIRATORY TRACT,03,"DISEASES AND DISORDERS OF THE EAR, NOSE, MOUTH AND THROAT",4,Extreme,Extreme,Medical,Medicare,Private Health Insurance,,,,Y,75006.48,25816.91
Long Island,Nassau,2908000,000511,NYU Langone Hospital-Long Island,0 to 17,115,F,White,Not Span/Hispanic,1,Emergency,Home or Self Care,2020,RSP003,INFLUENZA,ENT001,LARYNGOSCOPY (DIAGNOSTIC),113,INFECTIONS OF UPPER RESPIRATORY TRACT,03,"DISEASES AND DISORDERS OF THE EAR, NOSE, MOUTH AND THROAT",2,Moderate,Minor,Medical,Blue Cross/Blue Shield,,,,,Y,43101.81,5652.98
Long Island,Nassau,2908000,000511,NYU Langone Hospital-Long Island,18 to 29,117,M,White,Not Span/Hispanic,1,Emergency,Home or Self Care,2020,RSP006,OTHER SPECIFIED UPPER RESPIRATORY INFECTIONS,,,113,INFECTIONS OF UPPER RESPIRATORY TRACT,03,"DISEASES AND DISORDERS OF THE EAR, NOSE, MOUTH AND THROAT",2,Moderate,Moderate,Medical,Self-Pay,,,,,Y,28866.86,5891.77
Long Island,Nassau,2908000,000511,NYU Langone Hospital-Long Island,50 to 69,117,M,Other Race,Spanish/Hispanic,4,Emergency,Home or Self Care,2020,RSP003,INFLUENZA,,,113,INFECTIONS OF UPPER RESPIRATORY TRACT,03,"DISEASES AND DISORDERS OF THE EAR, NOSE, MOUTH AND THROAT",2,Moderate,Moderate,Medical,Private Health Insurance,,,,,Y,49129.73,14393.86
Long Island,Nassau,2908000,000511,NYU Langone Hospital-Long Island,0 to 17,118,F,Other Race,Not Span/Hispanic,3,Emergency,Home or Self Care,2020,RSP003,INFLUENZA,OTR004,ISOLATION PROCEDURES,113,INFECTIONS OF UPPER RESPIRATORY TRACT,03,"DISEASES AND DISORDERS OF THE EAR, NOSE, MOUTH AND THROAT",2,Moderate,Minor,Medical,Private Health Insurance,,,,,Y,28032.59,7322
Long Island,Nassau,2908000,000511,NYU Langone Hospital-Long Island,0 to 17,117,F,White,Not Span/Hispanic,1,Emergency,Home or Self Care,2020,RSP003,INFLUENZA,,,113,INFECTIONS OF UPPER RESPIRATORY TRACT,03,"DISEASES AND DISORDERS OF THE EAR, NOSE, MOUTH AND THROAT",1,Minor,Minor,Medical,Blue Cross/Blue Shield,,,,,Y,16090.41,3294.45
Long Island,Nassau,2908000,000511,NYU Langone Hospital-Long Island,70 or Older,115,M,White,Not Span/Hispanic,5,Emergency,Home or Self Care,2020,RSP003,INFLUENZA,MAM005,MEASUREMENT DURING CARDIAC CATHETERIZATION,113,INFECTIONS OF UPPER RESPIRATORY TRACT,03,"DISEASES AND DISORDERS OF THE EAR, NOSE, MOUTH AND THROAT",2,Moderate,Moderate,Medical,Medicare,,,,,Y,83729.79,22011.51
Long Island,Nassau,2908000,000511,NYU Langone Hospital-Long Island,50 to 69,115,M,Other Race,Not Span/Hispanic,2,Emergency,Home or Self Care,2020,RSP003,INFLUENZA,,,113,INFECTIONS OF UPPER RESPIRATORY TRACT,03,"DISEASES AND DISORDERS OF THE EAR, NOSE, MOUTH AND THROAT",3,Major,Moderate,Medical,Blue Cross/Blue Shield,,,,,Y,32980.97,8360.47
Long Island,Nassau,2908000,000511,NYU Langone Hospital-Long Island,0 to 17,117,F,White,Not Span/Hispanic,1,Emergency,Home or Self Care,2020,RSP003,INFLUENZA,,,113,INFECTIONS OF UPPER RESPIRATORY TRACT,03,"DISEASES AND DISORDERS OF THE EAR, NOSE, MOUTH AND THROAT",2,Moderate,Minor,Medical,Blue Cross/Blue Shield,,,,,Y,17882.51,3491.61
Long Island,Nassau,2908000,000511,NYU Langone Hospital-Long Island,70 or Older,117,F,White,Not Span/Hispanic,7,Emergency,Another Type Not Listed,2020,RSP003,INFLUENZA,OTR004,ISOLATION PROCEDURES,113,INFECTIONS OF UPPER RESPIRATORY TRACT,03,"DISEASES AND DISORDERS OF THE EAR, NOSE, MOUTH AND THROAT",2,Moderate,Major,Medical,Private Health Insurance,,,,,Y,79811.26,25112.5
Long Island,Nassau,2908000,000511,NYU Langone Hospital-Long Island,70 or Older,115,F,Black/African American,Not Span/Hispanic,3,Emergency,Home w/ Home Health Services,2020,RSP006,OTHER SPECIFIED UPPER RESPIRATORY INFECTIONS,,,113,INFECTIONS OF UPPER RESPIRATORY TRACT,03,"DISEASES AND DISORDERS OF THE EAR, NOSE, MOUTH AND THROAT",3,Major,Major,Medical,Medicare,Blue Cross/Blue Shield,,,,Y,49684.69,13048.45
Long Island,Nassau,2908000,000511,NYU Langone Hospital-Long Island,70 or Older,115,F,Black/African American,Not Span/Hispanic,4,Emergency,Home or Self Care,2020,RSP003,INFLUENZA,ESA001,HEMODIALYSIS,113,INFECTIONS OF UPPER RESPIRATORY TRACT,03,"DISEASES AND DISORDERS OF THE EAR, NOSE, MOUTH AND THROAT",3,Major,Major,Medical,Medicare,Medicaid,,,,Y,77398.47,22326.88
Long Island,Nassau,2908000,000511,NYU Langone Hospital-Long Island,0 to 17,110,F,White,Spanish/Hispanic,1,Emergency,Home or Self Care,2020,RSP004,ACUTE AND CHRONIC TONSILLITIS,,,113,INFECTIONS OF UPPER RESPIRATORY TRACT,03,"DISEASES AND DISORDERS OF THE EAR, NOSE, MOUTH AND THROAT",2,Moderate,Minor,Medical,Medicaid,,,,,Y,17835.68,3629.64
Long Island,Nassau,2908000,000511,NYU Langone Hospital-Long Island,18 to 29,110,F,White,Not Span/Hispanic,1,Emergency,Home or Self Care,2020,RSP003,INFLUENZA,,,113,INFECTIONS OF UPPER RESPIRATORY TRACT,03,"DISEASES AND DISORDERS OF THE EAR, NOSE, MOUTH AND THROAT",2,Moderate,Minor,Medical,Private Health Insurance,,,,,Y,22146.43,6760.05
Long Island,Nassau,2908000,000511,NYU Langone Hospital-Long Island,70 or Older,114,M,Black/African American,Not Span/Hispanic,2,Emergency,Home or Self Care,2020,RSP003,INFLUENZA,,,113,INFECTIONS OF UPPER RESPIRATORY TRACT,03,"DISEASES AND DISORDERS OF THE EAR, NOSE, MOUTH AND THROAT",2,Moderate,Major,Medical,Medicare,Blue Cross/Blue Shield,,,,Y,39059.37,8857.13
Long Island,Nassau,2908000,000511,NYU Langone Hospital-Long Island,0 to 17,115,M,White,Unknown,1,Emergency,Home or Self Care,2020,RSP003,INFLUENZA,,,113,INFECTIONS OF UPPER RESPIRATORY TRACT,03,"DISEASES AND DISORDERS OF THE EAR, NOSE, MOUTH AND THROAT",2,Moderate,Minor,Medical,Medicaid,,,,,Y,17201.47,3557.21
Long Island,Nassau,2908000,000511,NYU Langone Hospital-Long Island,0 to 17,115,F,Other Race,Not Span/Hispanic,1,Emergency,Home or Self Care,2020,RSP003,INFLUENZA,,,113,INFECTIONS OF UPPER RESPIRATORY TRACT,03,"DISEASES AND DISORDERS OF THE EAR, NOSE, MOUTH AND THROAT",2,Moderate,Minor,Medical,Medicaid,,,,,Y,17220.33,3760.9
Long Island,Nassau,2908000,000511,NYU Langone Hospital-Long Island,70 or Older,117,M,White,Not Span/Hispanic,7,Emergency,Home w/ Home Health Services,2020,RSP003,INFLUENZA,,,113,INFECTIONS OF UPPER RESPIRATORY TRACT,03,"DISEASES AND DISORDERS OF THE EAR, NOSE, MOUTH AND THROAT",1,Minor,Minor,Medical,Medicare,,,,,Y,71073.64,24676.26
Long Island,Nassau,2908000,000511,NYU Langone Hospital-Long Island,70 or Older,118,M,White,Not Span/Hispanic,7,Emergency,Home w/ Home Health Services,2020,RSP003,INFLUENZA,OTR004,ISOLATION PROCEDURES,113,INFECTIONS OF UPPER RESPIRATORY TRACT,03,"DISEASES AND DISORDERS OF THE EAR, NOSE, MOUTH AND THROAT",4,Extreme,Extreme,Medical,Medicare,,,,,Y,64934.47,24263.14
Long Island,Nassau,2908000,000511,NYU Langone Hospital-Long Island,30 to 49,115,F,White,Not Span/Hispanic,2,Emergency,Home or Self Care,2020,RSP003,INFLUENZA,OTR004,ISOLATION PROCEDURES,113,INFECTIONS OF UPPER RESPIRATORY TRACT,03,"DISEASES AND DISORDERS OF THE EAR, NOSE, MOUTH AND THROAT",2,Moderate,Minor,Medical,Blue Cross/Blue Shield,,,,,Y,24667.38,7477.15
Long Island,Nassau,2908000,000511,NYU Langone Hospital-Long Island,70 or Older,115,F,Black/African American,Not Span/Hispanic,1,Emergency,Home or Self Care,2020,RSP003,INFLUENZA,,,113,INFECTIONS OF UPPER RESPIRATORY TRACT,03,"DISEASES AND DISORDERS OF THE EAR, NOSE, MOUTH AND THROAT",2,Moderate,Major,Medical,Medicare,Medicare,,,,Y,42691.41,11005.21
Long Island,Nassau,2908000,000511,NYU Langone Hospital-Long Island,50 to 69,110,M,White,Not Span/Hispanic,1,Emergency,Home or Self Care,2020,RSP006,OTHER SPECIFIED UPPER RESPIRATORY INFECTIONS,OTR004,ISOLATION PROCEDURES,113,INFECTIONS OF UPPER RESPIRATORY TRACT,03,"DISEASES AND DISORDERS OF THE EAR, NOSE, MOUTH AND THROAT",1,Minor,Minor,Medical,Blue Cross/Blue Shield,Medicare,,,,Y,34177.2,9737.36
Long Island,Nassau,2908000,000511,NYU Langone Hospital-Long Island,50 to 69,115,F,White,Not Span/Hispanic,3,Emergency,Home or Self Care,2020,RSP003,INFLUENZA,OTR004,ISOLATION PROCEDURES,113,INFECTIONS OF UPPER RESPIRATORY TRACT,03,"DISEASES AND DISORDERS OF THE EAR, NOSE, MOUTH AND THROAT",1,Minor,Minor,Medical,Blue Cross/Blue Shield,,,,,Y,79875.73,18967.32
Long Island,Nassau,2908000,000511,NYU Langone Hospital-Long Island,50 to 69,115,M,Black/African American,Not Span/Hispanic,1,Emergency,Home or Self Care,2020,RSP006,OTHER SPECIFIED UPPER RESPIRATORY INFECTIONS,OTR004,ISOLATION PROCEDURES,113,INFECTIONS OF UPPER RESPIRATORY TRACT,03,"DISEASES AND DISORDERS OF THE EAR, NOSE, MOUTH AND THROAT",3,Major,Major,Medical,Medicare,Blue Cross/Blue Shield,,,,Y,42369,11214.53
Long Island,Nassau,2908000,000511,NYU Langone Hospital-Long Island,70 or Older,110,F,White,Not Span/Hispanic,7,Emergency,Inpatient Rehabilitation Facility,2020,RSP003,INFLUENZA,ESA004,NON-INVASIVE VENTILATION,113,INFECTIONS OF UPPER RESPIRATORY TRACT,03,"DISEASES AND DISORDERS OF THE EAR, NOSE, MOUTH AND THROAT",4,Extreme,Extreme,Medical,Medicare,,,,,Y,112603.95,28693.94
Long Island,Nassau,2908000,000511,NYU Langone Hospital-Long Island,0 to 17,115,F,Other Race,Spanish/Hispanic,1,Emergency,Home or Self Care,2020,RSP006,OTHER SPECIFIED UPPER RESPIRATORY INFECTIONS,OTR004,ISOLATION PROCEDURES,113,INFECTIONS OF UPPER RESPIRATORY TRACT,03,"DISEASES AND DISORDERS OF THE EAR, NOSE, MOUTH AND THROAT",1,Minor,Minor,Medical,Medicaid,,,,,Y,34250.81,5457.35