Hospital Service Area,Hospital County,Operating Certificate Number,Permanent Facility Id,Facility Name,Age Group,Zip Code - 3 digits,Gender,Race,Ethnicity,Length of Stay,Type of Admission,Patient Disposition,Discharge Year,CCS Diagnosis Code,CCS Diagnosis Description,CCS Procedure Code,CCS Procedure Description,APR DRG Code,APR DRG Description,APR MDC Code,APR MDC Description,APR Severity of Illness Code,APR Severity of Illness Description,APR Risk of Mortality,APR Medical Surgical Description,Payment Typology 1,Payment Typology 2,Payment Typology 3,Birth Weight,Abortion Edit Indicator,Emergency Department Indicator,Total Charges,Total Costs
New York City,Bronx,7000006,001169,Montefiore Medical Center - Henry & Lucy Moses Div,30 to 49,104,M,Black/African American,Not Span/Hispanic,1,Emergency,Home or Self Care,2020,DIG002,DISORDERS OF TEETH AND GINGIVA,,,114,DENTAL DISEASES & DISORDERS,03,"DISEASES AND DISORDERS OF THE EAR, NOSE, MOUTH AND THROAT",1,Minor,Minor,Medical,Private Health Insurance,,,,,Y,13209.55,2563.37
New York City,Bronx,7000006,001169,Montefiore Medical Center - Henry & Lucy Moses Div,0 to 17,105,M,White,Not Span/Hispanic,2,Emergency,Home or Self Care,2020,DIG003,DISEASES OF MOUTH; EXCLUDING DENTAL,ADM015,ADMINISTRATION OF ANTIBIOTICS,114,DENTAL DISEASES & DISORDERS,03,"DISEASES AND DISORDERS OF THE EAR, NOSE, MOUTH AND THROAT",1,Minor,Minor,Medical,Medicaid,,,,,N,22671.91,6473.9
New York City,Manhattan,7002024,001456,Mount Sinai Hospital,18 to 29,OOS,M,White,Not Span/Hispanic,1,Elective,Home or Self Care,2020,DIG002,DISORDERS OF TEETH AND GINGIVA,ENT015,DENTAL PROCEDURES,114,DENTAL DISEASES & DISORDERS,03,"DISEASES AND DISORDERS OF THE EAR, NOSE, MOUTH AND THROAT",2,Moderate,Moderate,Medical,Blue Cross/Blue Shield,Self-Pay,,,,N,30754.66,8322.76
New York City,Manhattan,7002054,001464,New York-Presbyterian Hospital - Columbia Presbyterian Center,18 to 29,100,F,Other Race,Multi-ethnic,1,Emergency,Home or Self Care,2020,DIG002,DISORDERS OF TEETH AND GINGIVA,,,114,DENTAL DISEASES & DISORDERS,03,"DISEASES AND DISORDERS OF THE EAR, NOSE, MOUTH AND THROAT",1,Minor,Minor,Medical,Medicaid,Self-Pay,,,,Y,20481.64,4340.7
New York City,Manhattan,7002054,001464,New York-Presbyterian Hospital - Columbia Presbyterian Center,0 to 17,112,M,Black/African American,Not Span/Hispanic,5,Emergency,Home or Self Care,2020,DIG003,DISEASES OF MOUTH; EXCLUDING DENTAL,,,114,DENTAL DISEASES & DISORDERS,03,"DISEASES AND DISORDERS OF THE EAR, NOSE, MOUTH AND THROAT",3,Major,Minor,Medical,Medicaid,Medicaid,Self-Pay,,,N,68313.91,16134.91
New York City,Queens,7003010,001637,New York - Presbyterian/Queens,0 to 17,113,M,White,Not Span/Hispanic,3,Emergency,Home or Self Care,2020,DIG003,DISEASES OF MOUTH; EXCLUDING DENTAL,ADM017,ADMINISTRATION OF NUTRITIONAL AND ELECTROLYTIC SUBSTANCES,114,DENTAL DISEASES & DISORDERS,03,"DISEASES AND DISORDERS OF THE EAR, NOSE, MOUTH AND THROAT",1,Minor,Minor,Medical,"Managed Care, Unspecified",Medicaid,Self-Pay,,,Y,26346.76,6520.47
New York City,Kings,7001021,001306,New York - Presbyterian Brooklyn Methodist Hospital,0 to 17,112,M,Other Race,Spanish/Hispanic,3,Emergency,Home or Self Care,2020,DIG002,DISORDERS OF TEETH AND GINGIVA,ENT015,DENTAL PROCEDURES,114,DENTAL DISEASES & DISORDERS,03,"DISEASES AND DISORDERS OF THE EAR, NOSE, MOUTH AND THROAT",1,Minor,Minor,Medical,Blue Cross/Blue Shield,Self-Pay,,,,Y,18470.76,9842.17
New York City,Manhattan,7002024,001456,Mount Sinai Hospital,50 to 69,100,M,Black/African American,Not Span/Hispanic,6,Emergency,Another Type Not Listed,2020,DIG002,DISORDERS OF TEETH AND GINGIVA,IMG009,PLAIN RADIOGRAPHY,114,DENTAL DISEASES & DISORDERS,03,"DISEASES AND DISORDERS OF THE EAR, NOSE, MOUTH AND THROAT",3,Major,Moderate,Medical,Medicaid,Self-Pay,,,,Y,85966.52,20560.18
New York City,Manhattan,7002024,001456,Mount Sinai Hospital,50 to 69,117,M,White,Not Span/Hispanic,2,Emergency,Home or Self Care,2020,DIG002,DISORDERS OF TEETH AND GINGIVA,MAM005,MEASUREMENT DURING CARDIAC CATHETERIZATION,114,DENTAL DISEASES & DISORDERS,03,"DISEASES AND DISORDERS OF THE EAR, NOSE, MOUTH AND THROAT",2,Moderate,Minor,Medical,Blue Cross/Blue Shield,Medicare,Self-Pay,,,Y,56747.1,13811.07
New York City,Bronx,7000006,003058,Montefiore Med Center - Jack D Weiler Hosp of A Einstein College Div,70 or Older,104,F,Other Race,Not Span/Hispanic,2,Emergency,Home w/ Home Health Services,2020,DIG002,DISORDERS OF TEETH AND GINGIVA,ADM015,ADMINISTRATION OF ANTIBIOTICS,114,DENTAL DISEASES & DISORDERS,03,"DISEASES AND DISORDERS OF THE EAR, NOSE, MOUTH AND THROAT",2,Moderate,Minor,Medical,Medicare,Medicaid,,,,Y,29967.31,3379.83
New York City,Manhattan,7002032,001466,Mount Sinai West,70 or Older,100,M,White,Not Span/Hispanic,10,Emergency,Skilled Nursing Home,2020,DIG003,DISEASES OF MOUTH; EXCLUDING DENTAL,IMG008,ULTRASONOGRAPHY,114,DENTAL DISEASES & DISORDERS,03,"DISEASES AND DISORDERS OF THE EAR, NOSE, MOUTH AND THROAT",3,Major,Major,Medical,Blue Cross/Blue Shield,Medicare,Self-Pay,,,Y,109024.13,23246.21
New York City,Manhattan,7002024,001456,Mount Sinai Hospital,18 to 29,100,F,Black/African American,Not Span/Hispanic,8,Emergency,Home or Self Care,2020,DIG002,DISORDERS OF TEETH AND GINGIVA,ENT015,DENTAL PROCEDURES,114,DENTAL DISEASES & DISORDERS,03,"DISEASES AND DISORDERS OF THE EAR, NOSE, MOUTH AND THROAT",3,Major,Moderate,Medical,Medicaid,Medicaid,Self-Pay,,,Y,110484.61,30057.84
New York City,Manhattan,7002053,001463,NYU Langone Hospitals,30 to 49,100,F,White,Not Span/Hispanic,1,Emergency,Home or Self Care,2020,DIG002,DISORDERS OF TEETH AND GINGIVA,,,114,DENTAL DISEASES & DISORDERS,03,"DISEASES AND DISORDERS OF THE EAR, NOSE, MOUTH AND THROAT",1,Minor,Minor,Medical,Private Health Insurance,,,,,Y,26946.1,7955.75
New York City,Manhattan,7002024,001456,Mount Sinai Hospital,50 to 69,100,M,Black/African American,Not Span/Hispanic,7,Emergency,Home or Self Care,2020,DIG002,DISORDERS OF TEETH AND GINGIVA,MAM005,MEASUREMENT DURING CARDIAC CATHETERIZATION,114,DENTAL DISEASES & DISORDERS,03,"DISEASES AND DISORDERS OF THE EAR, NOSE, MOUTH AND THROAT",3,Major,Major,Medical,Medicaid,Self-Pay,,,,Y,93804.67,24593.68
Capital/Adirond,Albany,0101000,000001,Albany Medical Center Hospital,18 to 29,121,F,Black/African American,Not Span/Hispanic,1,Emergency,Home or Self Care,2020,DIG002,DISORDERS OF TEETH AND GINGIVA,,,114,DENTAL DISEASES & DISORDERS,03,"DISEASES AND DISORDERS OF THE EAR, NOSE, MOUTH AND THROAT",1,Minor,Minor,Medical,Self-Pay,,,,,Y,10412.64,2306.66
Hudson Valley,Rockland,4329000,000779,Good Samaritan Hospital of Suffern,30 to 49,109,F,Black/African American,Not Span/Hispanic,3,Emergency,Home or Self Care,2020,DIG002,DISORDERS OF TEETH AND GINGIVA,,,114,DENTAL DISEASES & DISORDERS,03,"DISEASES AND DISORDERS OF THE EAR, NOSE, MOUTH AND THROAT",2,Moderate,Minor,Medical,Medicare,,,,,Y,46344.67,5848.75
New York City,Manhattan,7002053,001463,NYU Langone Hospitals,30 to 49,100,M,Other Race,Not Span/Hispanic,1,Emergency,Home or Self Care,2020,DIG002,DISORDERS OF TEETH AND GINGIVA,,,114,DENTAL DISEASES & DISORDERS,03,"DISEASES AND DISORDERS OF THE EAR, NOSE, MOUTH AND THROAT",1,Minor,Minor,Medical,Medicaid,,,,,Y,24877,7363.01
New York City,Kings,7002053,001304,NYU Langone Hospital-Brooklyn,0 to 17,112,F,White,Not Span/Hispanic,1,Emergency,Home or Self Care,2020,DIG002,DISORDERS OF TEETH AND GINGIVA,,,114,DENTAL DISEASES & DISORDERS,03,"DISEASES AND DISORDERS OF THE EAR, NOSE, MOUTH AND THROAT",1,Minor,Minor,Medical,Medicaid,,,,,Y,12232.65,2982.6
New York City,Bronx,7000006,001169,Montefiore Medical Center - Henry & Lucy Moses Div,0 to 17,107,F,Other Race,Spanish/Hispanic,2,Emergency,Home or Self Care,2020,DIG002,DISORDERS OF TEETH AND GINGIVA,ENT015,DENTAL PROCEDURES,114,DENTAL DISEASES & DISORDERS,03,"DISEASES AND DISORDERS OF THE EAR, NOSE, MOUTH AND THROAT",1,Minor,Minor,Medical,Medicaid,,,,,Y,25540.97,6498.19
Finger Lakes,Monroe,2701005,000413,Strong Memorial Hospital,50 to 69,146,M,Black/African American,Not Span/Hispanic,8,Emergency,Home or Self Care,2020,DIG002,DISORDERS OF TEETH AND GINGIVA,ENT015,DENTAL PROCEDURES,114,DENTAL DISEASES & DISORDERS,03,"DISEASES AND DISORDERS OF THE EAR, NOSE, MOUTH AND THROAT",3,Major,Moderate,Medical,Medicaid,,,,,Y,29087.73,13330.79
Finger Lakes,Monroe,2701005,000413,Strong Memorial Hospital,30 to 49,145,F,White,Not Span/Hispanic,5,Emergency,Home or Self Care,2020,DIG002,DISORDERS OF TEETH AND GINGIVA,,,114,DENTAL DISEASES & DISORDERS,03,"DISEASES AND DISORDERS OF THE EAR, NOSE, MOUTH AND THROAT",3,Major,Moderate,Medical,Blue Cross/Blue Shield,,,,,Y,17102.01,7999.74
Capital/Adirond,Albany,0101000,000001,Albany Medical Center Hospital,50 to 69,124,F,Other Race,Not Span/Hispanic,3,Emergency,Home or Self Care,2020,DIG002,DISORDERS OF TEETH AND GINGIVA,ENT006,ENT DRAINAGE (EXCLUDING MYRINGOTOMY),114,DENTAL DISEASES & DISORDERS,03,"DISEASES AND DISORDERS OF THE EAR, NOSE, MOUTH AND THROAT",2,Moderate,Minor,Medical,"Managed Care, Unspecified",,,,,Y,16919.69,4924.31
Capital/Adirond,Albany,0101000,000001,Albany Medical Center Hospital,0 to 17,121,M,White,Not Span/Hispanic,1,Emergency,Home or Self Care,2020,DIG002,DISORDERS OF TEETH AND GINGIVA,,,114,DENTAL DISEASES & DISORDERS,03,"DISEASES AND DISORDERS OF THE EAR, NOSE, MOUTH AND THROAT",1,Minor,Minor,Medical,"Managed Care, Unspecified",,,,,Y,8781.61,2083.17
Capital/Adirond,Albany,0101000,000001,Albany Medical Center Hospital,30 to 49,123,M,White,Not Span/Hispanic,2,Emergency,Home or Self Care,2020,DIG002,DISORDERS OF TEETH AND GINGIVA,,,114,DENTAL DISEASES & DISORDERS,03,"DISEASES AND DISORDERS OF THE EAR, NOSE, MOUTH AND THROAT",2,Moderate,Minor,Medical,"Managed Care, Unspecified",,,,,Y,12167.29,3139.54
Long Island,Nassau,2908000,000511,NYU Langone Hospital-Long Island,30 to 49,110,F,Black/African American,Not Span/Hispanic,3,Emergency,Inpatient Rehabilitation Facility,2020,DIG002,DISORDERS OF TEETH AND GINGIVA,,,114,DENTAL DISEASES & DISORDERS,03,"DISEASES AND DISORDERS OF THE EAR, NOSE, MOUTH AND THROAT",2,Moderate,Moderate,Medical,Medicare,Medicaid,,,,Y,35945.45,10587.29
New York City,Bronx,7000006,001169,Montefiore Medical Center - Henry & Lucy Moses Div,0 to 17,107,F,Other Race,Spanish/Hispanic,4,Emergency,Home or Self Care,2020,DIG002,DISORDERS OF TEETH AND GINGIVA,ENT015,DENTAL PROCEDURES,114,DENTAL DISEASES & DISORDERS,03,"DISEASES AND DISORDERS OF THE EAR, NOSE, MOUTH AND THROAT",3,Major,Minor,Medical,Medicaid,,,,,N,82129.23,18864.88
Central NY,Tompkins,5401001,000977,Cayuga Medical Center at Ithaca,0 to 17,130,M,White,Not Span/Hispanic,3,Emergency,Home or Self Care,2020,DIG002,DISORDERS OF TEETH AND GINGIVA,,,114,DENTAL DISEASES & DISORDERS,03,"DISEASES AND DISORDERS OF THE EAR, NOSE, MOUTH AND THROAT",1,Minor,Minor,Medical,Blue Cross/Blue Shield,Self-Pay,Self-Pay,,,Y,4601.05,3709.73
New York City,Kings,7001021,001306,New York - Presbyterian Brooklyn Methodist Hospital,0 to 17,112,F,Other Race,Not Span/Hispanic,3,Emergency,Home or Self Care,2020,DIG003,DISEASES OF MOUTH; EXCLUDING DENTAL,,,114,DENTAL DISEASES & DISORDERS,03,"DISEASES AND DISORDERS OF THE EAR, NOSE, MOUTH AND THROAT",2,Moderate,Minor,Medical,"Managed Care, Unspecified",Medicaid,Self-Pay,,,Y,19654.15,9956.9
New York City,Manhattan,7002054,001458,New York-Presbyterian Hospital - New York Weill Cornell Center,70 or Older,100,F,White,Not Span/Hispanic,3,Emergency,Home or Self Care,2020,DIG002,DISORDERS OF TEETH AND GINGIVA,ADM010,VACCINATIONS,114,DENTAL DISEASES & DISORDERS,03,"DISEASES AND DISORDERS OF THE EAR, NOSE, MOUTH AND THROAT",1,Minor,Minor,Medical,Medicare,Miscellaneous/Other,Self-Pay,,,Y,38255.49,8209.6
New York City,Kings,7001021,001306,New York - Presbyterian Brooklyn Methodist Hospital,0 to 17,112,F,Other Race,Not Span/Hispanic,1,Emergency,Home or Self Care,2020,DIG003,DISEASES OF MOUTH; EXCLUDING DENTAL,,,114,DENTAL DISEASES & DISORDERS,03,"DISEASES AND DISORDERS OF THE EAR, NOSE, MOUTH AND THROAT",1,Minor,Minor,Medical,"Managed Care, Unspecified",Medicaid,Self-Pay,,,Y,7291.62,3599.03
New York City,Kings,7001020,001305,Maimonides Medical Center,0 to 17,112,M,White,Not Span/Hispanic,2,Emergency,Home or Self Care,2020,DIG002,DISORDERS OF TEETH AND GINGIVA,,,114,DENTAL DISEASES & DISORDERS,03,"DISEASES AND DISORDERS OF THE EAR, NOSE, MOUTH AND THROAT",1,Minor,Minor,Medical,Medicaid,Self-Pay,,,,Y,15569,8139.42
New York City,Manhattan,7002024,001456,Mount Sinai Hospital,30 to 49,100,M,Black/African American,Not Span/Hispanic,2,Urgent,Home or Self Care,2020,DIG002,DISORDERS OF TEETH AND GINGIVA,ENT006,ENT DRAINAGE (EXCLUDING MYRINGOTOMY),114,DENTAL DISEASES & DISORDERS,03,"DISEASES AND DISORDERS OF THE EAR, NOSE, MOUTH AND THROAT",3,Major,Moderate,Medical,Medicare,Private Health Insurance,Self-Pay,,,N,22590.35,6096.96
Capital/Adirond,Albany,0101000,000001,Albany Medical Center Hospital,0 to 17,121,F,White,Spanish/Hispanic,5,Emergency,Home or Self Care,2020,DIG003,DISEASES OF MOUTH; EXCLUDING DENTAL,,,114,DENTAL DISEASES & DISORDERS,03,"DISEASES AND DISORDERS OF THE EAR, NOSE, MOUTH AND THROAT",2,Moderate,Minor,Medical,"Managed Care, Unspecified",,,,,Y,18495.36,6993.07
New York City,Richmond,7004003,001740,Staten Island University Hosp-North,0 to 17,103,F,Other Race,Unknown,2,Emergency,Home or Self Care,2020,DIG002,DISORDERS OF TEETH AND GINGIVA,ENT015,DENTAL PROCEDURES,114,DENTAL DISEASES & DISORDERS,03,"DISEASES AND DISORDERS OF THE EAR, NOSE, MOUTH AND THROAT",1,Minor,Minor,Medical,Medicaid,,,,,Y,12856.46,14360.01
New York City,Richmond,7004003,001740,Staten Island University Hosp-North,70 or Older,103,F,White,Not Span/Hispanic,2,Emergency,Home or Self Care,2020,DIG002,DISORDERS OF TEETH AND GINGIVA,,,114,DENTAL DISEASES & DISORDERS,03,"DISEASES AND DISORDERS OF THE EAR, NOSE, MOUTH AND THROAT",2,Moderate,Minor,Medical,Medicare,Medicare,,,,Y,14924.56,3681.02
New York City,Richmond,7004003,001740,Staten Island University Hosp-North,30 to 49,103,F,White,Not Span/Hispanic,3,Emergency,Home or Self Care,2020,DIG002,DISORDERS OF TEETH AND GINGIVA,,,114,DENTAL DISEASES & DISORDERS,03,"DISEASES AND DISORDERS OF THE EAR, NOSE, MOUTH AND THROAT",1,Minor,Minor,Medical,Medicaid,,,,,Y,20329.33,5326.59
New York City,Richmond,7004003,001740,Staten Island University Hosp-North,0 to 17,112,F,White,Not Span/Hispanic,2,Emergency,Home or Self Care,2020,DIG002,DISORDERS OF TEETH AND GINGIVA,ENT015,DENTAL PROCEDURES,114,DENTAL DISEASES & DISORDERS,03,"DISEASES AND DISORDERS OF THE EAR, NOSE, MOUTH AND THROAT",1,Minor,Minor,Medical,Self-Pay,,,,,Y,12459.42,14145.17
New York City,Richmond,7004003,001740,Staten Island University Hosp-North,0 to 17,103,M,White,Spanish/Hispanic,3,Emergency,Home or Self Care,2020,DIG002,DISORDERS OF TEETH AND GINGIVA,,,114,DENTAL DISEASES & DISORDERS,03,"DISEASES AND DISORDERS OF THE EAR, NOSE, MOUTH AND THROAT",2,Moderate,Minor,Medical,Medicaid,Medicaid,,,,Y,16840.73,20703.02
New York City,Richmond,7004003,001740,Staten Island University Hosp-North,18 to 29,103,F,White,Not Span/Hispanic,5,Emergency,Home or Self Care,2020,DIG002,DISORDERS OF TEETH AND GINGIVA,,,114,DENTAL DISEASES & DISORDERS,03,"DISEASES AND DISORDERS OF THE EAR, NOSE, MOUTH AND THROAT",1,Minor,Minor,Medical,Medicaid,,,,,Y,30862.16,8013.73
Western NY,Erie,1401005,000210,Erie County Medical Center,30 to 49,142,M,Black/African American,Not Span/Hispanic,1,Emergency,Home or Self Care,2020,MUS029,DISORDERS OF JAW,MST012,BONE FIXATION (EXCLUDING EXTREMITIES),114,DENTAL DISEASES & DISORDERS,03,"DISEASES AND DISORDERS OF THE EAR, NOSE, MOUTH AND THROAT",3,Major,Minor,Medical,Blue Cross/Blue Shield,,,,,Y,32949.15,9965.96
New York City,Kings,7002053,001304,NYU Langone Hospital-Brooklyn,18 to 29,112,M,Other Race,Not Span/Hispanic,1,Emergency,Left Against Medical Advice,2020,DIG002,DISORDERS OF TEETH AND GINGIVA,ENT015,DENTAL PROCEDURES,114,DENTAL DISEASES & DISORDERS,03,"DISEASES AND DISORDERS OF THE EAR, NOSE, MOUTH AND THROAT",1,Minor,Minor,Medical,Medicaid,,,,,Y,41345.84,7787.71
New York City,Bronx,7000006,001169,Montefiore Medical Center - Henry & Lucy Moses Div,30 to 49,104,M,Black/African American,Not Span/Hispanic,2,Emergency,Home or Self Care,2020,DIG002,DISORDERS OF TEETH AND GINGIVA,,,114,DENTAL DISEASES & DISORDERS,03,"DISEASES AND DISORDERS OF THE EAR, NOSE, MOUTH AND THROAT",2,Moderate,Minor,Medical,Medicaid,,,,,Y,37143.6,5657.82
New York City,Kings,7001003,001288,Brooklyn Hospital Center - Downtown Campus,30 to 49,112,F,Black/African American,Not Span/Hispanic,2,Emergency,Home or Self Care,2020,DIG002,DISORDERS OF TEETH AND GINGIVA,ENT015,DENTAL PROCEDURES,114,DENTAL DISEASES & DISORDERS,03,"DISEASES AND DISORDERS OF THE EAR, NOSE, MOUTH AND THROAT",1,Minor,Minor,Medical,Medicare,Medicaid,Self-Pay,,,Y,29517.42,7842.96
New York City,Kings,7001003,001288,Brooklyn Hospital Center - Downtown Campus,0 to 17,112,F,Other Race,Unknown,2,Emergency,Home or Self Care,2020,DIG002,DISORDERS OF TEETH AND GINGIVA,ENT015,DENTAL PROCEDURES,114,DENTAL DISEASES & DISORDERS,03,"DISEASES AND DISORDERS OF THE EAR, NOSE, MOUTH AND THROAT",1,Minor,Minor,Medical,Blue Cross/Blue Shield,Private Health Insurance,Self-Pay,,,N,25082.85,6854.1
Western NY,Chautauqua,0602001,000103,UPMC Chautauqua at WCA,50 to 69,147,F,White,Not Span/Hispanic,4,Emergency,Home or Self Care,2020,DIG002,DISORDERS OF TEETH AND GINGIVA,,,114,DENTAL DISEASES & DISORDERS,03,"DISEASES AND DISORDERS OF THE EAR, NOSE, MOUTH AND THROAT",1,Minor,Minor,Medical,Private Health Insurance,Medicare,,,,Y,10462,4662.23
Capital/Adirond,Franklin,1624000,000325,The University of Vermont Health Network - Alice Hyde Medical Center,50 to 69,129,F,White,Not Span/Hispanic,13,Emergency,Home or Self Care,2020,DIG002,DISORDERS OF TEETH AND GINGIVA,,,114,DENTAL DISEASES & DISORDERS,03,"DISEASES AND DISORDERS OF THE EAR, NOSE, MOUTH AND THROAT",1,Minor,Minor,Medical,Medicare,Medicaid,,,,Y,33336.35,12105.59
Central NY,Onondaga,3301007,000635,University Hospital SUNY Health Science Center,50 to 69,134,M,Black/African American,Not Span/Hispanic,2,Emergency,Home or Self Care,2020,DIG002,DISORDERS OF TEETH AND GINGIVA,ENT015,DENTAL PROCEDURES,114,DENTAL DISEASES & DISORDERS,03,"DISEASES AND DISORDERS OF THE EAR, NOSE, MOUTH AND THROAT",1,Minor,Minor,Medical,Department of Corrections,Medicaid,,,,Y,22877.11,5649.21
New York City,Bronx,7000001,001178,BronxCare Hospital Center,50 to 69,104,M,Black/African American,Not Span/Hispanic,4,Emergency,Home or Self Care,2020,DIG002,DISORDERS OF TEETH AND GINGIVA,,,114,DENTAL DISEASES & DISORDERS,03,"DISEASES AND DISORDERS OF THE EAR, NOSE, MOUTH AND THROAT",2,Moderate,Moderate,Medical,Medicaid,Medicaid,,,,Y,15500.25,21708.91
Central NY,Onondaga,3301007,000635,University Hospital SUNY Health Science Center,30 to 49,134,F,White,Not Span/Hispanic,1,Emergency,Home or Self Care,2020,DIG002,DISORDERS OF TEETH AND GINGIVA,ENT001,LARYNGOSCOPY (DIAGNOSTIC),114,DENTAL DISEASES & DISORDERS,03,"DISEASES AND DISORDERS OF THE EAR, NOSE, MOUTH AND THROAT",1,Minor,Minor,Medical,Medicaid,,,,,Y,8488,2232.23
New York City,Bronx,7000001,001178,BronxCare Hospital Center,0 to 17,104,F,Other Race,Spanish/Hispanic,2,Emergency,Home or Self Care,2020,DIG002,DISORDERS OF TEETH AND GINGIVA,ENT006,ENT DRAINAGE (EXCLUDING MYRINGOTOMY),114,DENTAL DISEASES & DISORDERS,03,"DISEASES AND DISORDERS OF THE EAR, NOSE, MOUTH AND THROAT",1,Minor,Minor,Medical,Medicaid,Medicaid,,,,Y,7597.61,6234.24
Central NY,Onondaga,3301007,000635,University Hospital SUNY Health Science Center,0 to 17,132,F,White,Not Span/Hispanic,6,Emergency,Home or Self Care,2020,DIG003,DISEASES OF MOUTH; EXCLUDING DENTAL,,,114,DENTAL DISEASES & DISORDERS,03,"DISEASES AND DISORDERS OF THE EAR, NOSE, MOUTH AND THROAT",1,Minor,Minor,Medical,Medicaid,,,,,Y,44625.4,11735.5
New York City,Bronx,7000001,001178,BronxCare Hospital Center,0 to 17,104,M,Other Race,Unknown,1,Emergency,Home or Self Care,2020,DIG002,DISORDERS OF TEETH AND GINGIVA,,,114,DENTAL DISEASES & DISORDERS,03,"DISEASES AND DISORDERS OF THE EAR, NOSE, MOUTH AND THROAT",1,Minor,Minor,Medical,Medicaid,Medicaid,,,,Y,4611.39,3362.35
Central NY,Onondaga,3301007,000635,University Hospital SUNY Health Science Center,18 to 29,132,F,Black/African American,Not Span/Hispanic,4,Emergency,Home or Self Care,2020,DIG002,DISORDERS OF TEETH AND GINGIVA,ADM001,TRANSFUSION OF BLOOD AND BLOOD PRODUCTS,114,DENTAL DISEASES & DISORDERS,03,"DISEASES AND DISORDERS OF THE EAR, NOSE, MOUTH AND THROAT",3,Major,Moderate,Medical,Medicare,Medicaid,,,,Y,38138.3,12146.31
Long Island,Nassau,2950001,000527,Mount Sinai South Nassau,70 or Older,115,F,White,Not Span/Hispanic,1,Emergency,Home w/ Home Health Services,2020,DIG002,DISORDERS OF TEETH AND GINGIVA,,,114,DENTAL DISEASES & DISORDERS,03,"DISEASES AND DISORDERS OF THE EAR, NOSE, MOUTH AND THROAT",1,Minor,Minor,Medical,Medicare,Medicaid,,,,Y,22071.45,2014.17
Hudson Valley,Westchester,5957001,001139,Westchester Medical Center,0 to 17,124,M,White,Not Span/Hispanic,1,Emergency,Home or Self Care,2020,DIG002,DISORDERS OF TEETH AND GINGIVA,ENT015,DENTAL PROCEDURES,114,DENTAL DISEASES & DISORDERS,03,"DISEASES AND DISORDERS OF THE EAR, NOSE, MOUTH AND THROAT",1,Minor,Minor,Medical,Private Health Insurance,,,,,Y,19689.06,3286.34
Hudson Valley,Westchester,5957001,001139,Westchester Medical Center,0 to 17,125,M,White,Not Span/Hispanic,1,Emergency,Home or Self Care,2020,DIG002,DISORDERS OF TEETH AND GINGIVA,ENT015,DENTAL PROCEDURES,114,DENTAL DISEASES & DISORDERS,03,"DISEASES AND DISORDERS OF THE EAR, NOSE, MOUTH AND THROAT",1,Minor,Minor,Medical,Private Health Insurance,,,,,Y,20057.65,3295.41
New York City,Queens,7003004,003376,Cohen Children's Medical Center,0 to 17,114,F,Black/African American,Not Span/Hispanic,2,Emergency,Home or Self Care,2020,DIG002,DISORDERS OF TEETH AND GINGIVA,ENT015,DENTAL PROCEDURES,114,DENTAL DISEASES & DISORDERS,03,"DISEASES AND DISORDERS OF THE EAR, NOSE, MOUTH AND THROAT",2,Moderate,Minor,Medical,Private Health Insurance,Self-Pay,,,,N,17479.1,3109.59
New York City,Queens,7003004,003376,Cohen Children's Medical Center,0 to 17,114,M,Black/African American,Not Span/Hispanic,2,Emergency,Home or Self Care,2020,DIG002,DISORDERS OF TEETH AND GINGIVA,ENT015,DENTAL PROCEDURES,114,DENTAL DISEASES & DISORDERS,03,"DISEASES AND DISORDERS OF THE EAR, NOSE, MOUTH AND THROAT",1,Minor,Minor,Medical,Medicaid,Medicaid,Self-Pay,,,N,18628.72,2758.15
New York City,Queens,7003004,003376,Cohen Children's Medical Center,0 to 17,115,M,Other Race,Not Span/Hispanic,2,Urgent,Home or Self Care,2020,DIG002,DISORDERS OF TEETH AND GINGIVA,,,114,DENTAL DISEASES & DISORDERS,03,"DISEASES AND DISORDERS OF THE EAR, NOSE, MOUTH AND THROAT",1,Minor,Minor,Medical,Medicaid,Medicaid,Self-Pay,,,N,17284.72,3070.63
New York City,Queens,7003004,001630,Long Island Jewish Medical Center,70 or Older,114,F,Black/African American,Not Span/Hispanic,6,Emergency,Home or Self Care,2020,DIG002,DISORDERS OF TEETH AND GINGIVA,ENT015,DENTAL PROCEDURES,114,DENTAL DISEASES & DISORDERS,03,"DISEASES AND DISORDERS OF THE EAR, NOSE, MOUTH AND THROAT",2,Moderate,Minor,Medical,Medicare,Medicare,Self-Pay,,,N,86415.53,14757.08
Hudson Valley,Westchester,7002054,001122,New York - Presbyterian Hospital,0 to 17,107,F,White,Not Span/Hispanic,4,Emergency,Home or Self Care,2020,DIG003,DISEASES OF MOUTH; EXCLUDING DENTAL,OTR004,ISOLATION PROCEDURES,114,DENTAL DISEASES & DISORDERS,03,"DISEASES AND DISORDERS OF THE EAR, NOSE, MOUTH AND THROAT",1,Minor,Minor,Medical,Medicaid,Medicaid,,,,Y,49863.02,12100.91
Hudson Valley,Westchester,7002054,001122,New York - Presbyterian Hospital,70 or Older,104,F,White,Not Span/Hispanic,3,Emergency,Home w/ Home Health Services,2020,DIG002,DISORDERS OF TEETH AND GINGIVA,ADM001,TRANSFUSION OF BLOOD AND BLOOD PRODUCTS,114,DENTAL DISEASES & DISORDERS,03,"DISEASES AND DISORDERS OF THE EAR, NOSE, MOUTH AND THROAT",2,Moderate,Moderate,Medical,Medicare,Private Health Insurance,,,,Y,53778.59,13455.64