Hospital Service Area,Hospital County,Operating Certificate Number,Permanent Facility Id,Facility Name,Age Group,Zip Code - 3 digits,Gender,Race,Ethnicity,Length of Stay,Type of Admission,Patient Disposition,Discharge Year,CCS Diagnosis Code,CCS Diagnosis Description,CCS Procedure Code,CCS Procedure Description,APR DRG Code,APR DRG Description,APR MDC Code,APR MDC Description,APR Severity of Illness Code,APR Severity of Illness Description,APR Risk of Mortality,APR Medical Surgical Description,Payment Typology 1,Payment Typology 2,Payment Typology 3,Birth Weight,Abortion Edit Indicator,Emergency Department Indicator,Total Charges,Total Costs
New York City,Queens,7003004,001630,Long Island Jewish Medical Center,70 or Older,117,F,White,Not Span/Hispanic,4,Elective,Home or Self Care,2018,NEO022,RESPIRATORY CANCERS,RES008,"LUNG, PLEURA, OR DIAPHRAGM RESECTION (OPEN AND THORACOSCOPIC)",120,MAJOR RESPIRATORY & CHEST PROCEDURES,04,DISEASES AND DISORDERS OF THE RESPIRATORY SYSTEM,2,Moderate,Moderate,Surgical,Medicare,Federal/State/Local/VA,Self-Pay,,,false,92851.1,18624.97
New York City,Manhattan,7002054,001458,New York-Presbyterian Hospital - New York Weill Cornell Center,70 or Older,100,F,White,Not Span/Hispanic,3,Elective,Home w/ Home Health Services,2018,NEO022,RESPIRATORY CANCERS,RES008,"LUNG, PLEURA, OR DIAPHRAGM RESECTION (OPEN AND THORACOSCOPIC)",120,MAJOR RESPIRATORY & CHEST PROCEDURES,04,DISEASES AND DISORDERS OF THE RESPIRATORY SYSTEM,2,Moderate,Minor,Surgical,Medicare,Blue Cross/Blue Shield,Self-Pay,,,false,101409.19,37805.9
New York City,Richmond,7004003,001740,Staten Island University Hosp-North,50 to 69,103,M,White,Not Span/Hispanic,3,Elective,Home or Self Care,2018,NEO022,RESPIRATORY CANCERS,RES008,"LUNG, PLEURA, OR DIAPHRAGM RESECTION (OPEN AND THORACOSCOPIC)",120,MAJOR RESPIRATORY & CHEST PROCEDURES,04,DISEASES AND DISORDERS OF THE RESPIRATORY SYSTEM,3,Major,Moderate,Surgical,Medicare,Blue Cross/Blue Shield,,,,false,64110.88,18396.78
New York City,Manhattan,7002054,001464,New York-Presbyterian Hospital - Columbia Presbyterian Center,70 or Older,109,F,White,Not Span/Hispanic,9,Elective,Skilled Nursing Home,2018,NEO022,RESPIRATORY CANCERS,RES008,"LUNG, PLEURA, OR DIAPHRAGM RESECTION (OPEN AND THORACOSCOPIC)",120,MAJOR RESPIRATORY & CHEST PROCEDURES,04,DISEASES AND DISORDERS OF THE RESPIRATORY SYSTEM,3,Major,Major,Surgical,Medicare,Medicare,Medicaid,,,false,200405.85,50925.08
Capital/Adirond,Albany,0101004,000005,St. Peter's Hospital,70 or Older,121,M,White,Not Span/Hispanic,9,Elective,Home w/ Home Health Services,2018,NEO022,RESPIRATORY CANCERS,RES008,"LUNG, PLEURA, OR DIAPHRAGM RESECTION (OPEN AND THORACOSCOPIC)",120,MAJOR RESPIRATORY & CHEST PROCEDURES,04,DISEASES AND DISORDERS OF THE RESPIRATORY SYSTEM,3,Major,Major,Surgical,Medicare,Medicare,,,,false,72866.19,28024.7
Hudson Valley,Rockland,4329000,000779,Good Samaritan Hospital of Suffern,70 or Older,109,F,White,Not Span/Hispanic,7,Elective,Home w/ Home Health Services,2018,NEO022,RESPIRATORY CANCERS,RES008,"LUNG, PLEURA, OR DIAPHRAGM RESECTION (OPEN AND THORACOSCOPIC)",120,MAJOR RESPIRATORY & CHEST PROCEDURES,04,DISEASES AND DISORDERS OF THE RESPIRATORY SYSTEM,2,Moderate,Minor,Surgical,Medicare,,,,,false,181960.14,32831.37
Finger Lakes,Monroe,2701003,000411,Rochester General Hospital,70 or Older,146,M,White,Not Span/Hispanic,1,Elective,Home w/ Home Health Services,2018,NEO022,RESPIRATORY CANCERS,RES008,"LUNG, PLEURA, OR DIAPHRAGM RESECTION (OPEN AND THORACOSCOPIC)",120,MAJOR RESPIRATORY & CHEST PROCEDURES,04,DISEASES AND DISORDERS OF THE RESPIRATORY SYSTEM,2,Moderate,Moderate,Surgical,Medicare,,,,,false,27509.25,11588.78
New York City,Queens,7003010,001637,New York - Presbyterian/Queens,70 or Older,113,M,Other Race,Not Span/Hispanic,5,Elective,Home w/ Home Health Services,2018,NEO022,RESPIRATORY CANCERS,RES008,"LUNG, PLEURA, OR DIAPHRAGM RESECTION (OPEN AND THORACOSCOPIC)",120,MAJOR RESPIRATORY & CHEST PROCEDURES,04,DISEASES AND DISORDERS OF THE RESPIRATORY SYSTEM,2,Moderate,Minor,Surgical,Medicare,Medicare,Medicaid,,,false,77651.38,27204.14
Hudson Valley,Westchester,5957001,001139,Westchester Medical Center,70 or Older,108,F,Black/African American,Not Span/Hispanic,1,Elective,Home or Self Care,2018,NEO022,RESPIRATORY CANCERS,RES008,"LUNG, PLEURA, OR DIAPHRAGM RESECTION (OPEN AND THORACOSCOPIC)",120,MAJOR RESPIRATORY & CHEST PROCEDURES,04,DISEASES AND DISORDERS OF THE RESPIRATORY SYSTEM,2,Moderate,Minor,Surgical,Medicare,Private Health Insurance,,,,false,96584.98,19235.48
New York City,Manhattan,7002020,001453,Memorial Hospital for Cancer and Allied Diseases,70 or Older,103,F,White,Not Span/Hispanic,3,Elective,Home or Self Care,2018,NEO022,RESPIRATORY CANCERS,RES008,"LUNG, PLEURA, OR DIAPHRAGM RESECTION (OPEN AND THORACOSCOPIC)",120,MAJOR RESPIRATORY & CHEST PROCEDURES,04,DISEASES AND DISORDERS OF THE RESPIRATORY SYSTEM,1,Minor,Minor,Surgical,Medicare,,,,,false,56295.82,23607.82
New York City,Manhattan,7002020,001453,Memorial Hospital for Cancer and Allied Diseases,70 or Older,112,F,White,Not Span/Hispanic,2,Elective,Home or Self Care,2018,NEO022,RESPIRATORY CANCERS,RES008,"LUNG, PLEURA, OR DIAPHRAGM RESECTION (OPEN AND THORACOSCOPIC)",120,MAJOR RESPIRATORY & CHEST PROCEDURES,04,DISEASES AND DISORDERS OF THE RESPIRATORY SYSTEM,2,Moderate,Moderate,Surgical,Medicare,Private Health Insurance,,,,false,47376.68,19470.99
Capital/Adirond,Albany,0101004,000005,St. Peter's Hospital,50 to 69,128,F,White,Not Span/Hispanic,6,Elective,Home or Self Care,2018,NEO022,RESPIRATORY CANCERS,RES008,"LUNG, PLEURA, OR DIAPHRAGM RESECTION (OPEN AND THORACOSCOPIC)",120,MAJOR RESPIRATORY & CHEST PROCEDURES,04,DISEASES AND DISORDERS OF THE RESPIRATORY SYSTEM,2,Moderate,Minor,Surgical,Medicare,Medicare,,,,false,52265.93,20966.12
New York City,Manhattan,7002024,001456,Mount Sinai Hospital,50 to 69,104,F,Black/African American,Not Span/Hispanic,11,Urgent,Inpatient Rehabilitation Facility,2018,CIR013,ACUTE PULMONARY EMBOLISM,CAR007,"EMBOLECTOMY, ENDARTERECTOMY, AND RELATED VESSEL PROCEDURES (NON-ENDOVASCULAR; EXCLUDING CAROTID)",120,MAJOR RESPIRATORY & CHEST PROCEDURES,04,DISEASES AND DISORDERS OF THE RESPIRATORY SYSTEM,3,Major,Major,Surgical,Medicare,Self-Pay,,,,false,186460.98,45667.68
New York City,Manhattan,7002053,001463,NYU Langone Hospitals,50 to 69,107,F,White,Not Span/Hispanic,6,Elective,Inpatient Rehabilitation Facility,2018,NEO022,RESPIRATORY CANCERS,RES008,"LUNG, PLEURA, OR DIAPHRAGM RESECTION (OPEN AND THORACOSCOPIC)",120,MAJOR RESPIRATORY & CHEST PROCEDURES,04,DISEASES AND DISORDERS OF THE RESPIRATORY SYSTEM,2,Moderate,Minor,Surgical,Medicare,,,,,false,153707.21,34827.49
Long Island,Nassau,2908000,000511,NYU Langone Hospital-Long Island,50 to 69,117,F,White,Not Span/Hispanic,3,Elective,Home w/ Home Health Services,2018,NEO022,RESPIRATORY CANCERS,RES008,"LUNG, PLEURA, OR DIAPHRAGM RESECTION (OPEN AND THORACOSCOPIC)",120,MAJOR RESPIRATORY & CHEST PROCEDURES,04,DISEASES AND DISORDERS OF THE RESPIRATORY SYSTEM,1,Minor,Minor,Surgical,Blue Cross/Blue Shield,,,,,false,175387.46,27680.19
Finger Lakes,Monroe,2701003,000411,Rochester General Hospital,50 to 69,144,F,White,Not Span/Hispanic,10,Elective,Home w/ Home Health Services,2018,NEO022,RESPIRATORY CANCERS,RES008,"LUNG, PLEURA, OR DIAPHRAGM RESECTION (OPEN AND THORACOSCOPIC)",120,MAJOR RESPIRATORY & CHEST PROCEDURES,04,DISEASES AND DISORDERS OF THE RESPIRATORY SYSTEM,2,Moderate,Minor,Surgical,Medicare,,,,,false,70782.25,32739.4
Finger Lakes,Monroe,2701005,000413,Strong Memorial Hospital,70 or Older,146,F,White,Not Span/Hispanic,2,Elective,Home or Self Care,2018,NEO022,RESPIRATORY CANCERS,RES008,"LUNG, PLEURA, OR DIAPHRAGM RESECTION (OPEN AND THORACOSCOPIC)",120,MAJOR RESPIRATORY & CHEST PROCEDURES,04,DISEASES AND DISORDERS OF THE RESPIRATORY SYSTEM,2,Moderate,Minor,Surgical,Medicare,Medicare,Self-Pay,,,false,50086.78,23468.73
New York City,Manhattan,7002054,001458,New York-Presbyterian Hospital - New York Weill Cornell Center,18 to 29,112,F,White,Not Span/Hispanic,3,Elective,Home or Self Care,2018,NEO022,RESPIRATORY CANCERS,RES008,"LUNG, PLEURA, OR DIAPHRAGM RESECTION (OPEN AND THORACOSCOPIC)",120,MAJOR RESPIRATORY & CHEST PROCEDURES,04,DISEASES AND DISORDERS OF THE RESPIRATORY SYSTEM,2,Moderate,Minor,Surgical,Private Health Insurance,Self-Pay,,,,false,102247.86,37163.43
New York City,Queens,7003004,001638,Long Island Jewish Forest Hills,50 to 69,113,F,Other Race,Spanish/Hispanic,7,Elective,Home or Self Care,2018,RSP016,OTHER SPECIFIED AND UNSPECIFIED LOWER RESPIRATORY DISEASE,RES008,"LUNG, PLEURA, OR DIAPHRAGM RESECTION (OPEN AND THORACOSCOPIC)",120,MAJOR RESPIRATORY & CHEST PROCEDURES,04,DISEASES AND DISORDERS OF THE RESPIRATORY SYSTEM,2,Moderate,Moderate,Surgical,Blue Cross/Blue Shield,,,,,false,152954.27,38276.49
Western NY,Erie,1401014,000207,Buffalo General Medical Center,50 to 69,141,F,White,Not Span/Hispanic,1,Urgent,Home or Self Care,2018,MAL008,MUSCULOSKELETAL CONGENITAL CONDITIONS,RES011,DIAPHRAGMATIC HERNIA REPAIR,120,MAJOR RESPIRATORY & CHEST PROCEDURES,04,DISEASES AND DISORDERS OF THE RESPIRATORY SYSTEM,1,Minor,Minor,Surgical,Medicare,Self-Pay,,,,false,24062.05,7200.26
Long Island,Nassau,2908000,000511,NYU Langone Hospital-Long Island,50 to 69,117,M,White,Not Span/Hispanic,1,Elective,Home or Self Care,2018,NEO022,RESPIRATORY CANCERS,RES008,"LUNG, PLEURA, OR DIAPHRAGM RESECTION (OPEN AND THORACOSCOPIC)",120,MAJOR RESPIRATORY & CHEST PROCEDURES,04,DISEASES AND DISORDERS OF THE RESPIRATORY SYSTEM,1,Minor,Minor,Surgical,Medicaid,Medicaid,,,,false,171381.33,24656.43
New York City,Queens,7003004,001630,Long Island Jewish Medical Center,70 or Older,114,M,Other Race,Not Span/Hispanic,1,Elective,Home or Self Care,2018,NEO022,RESPIRATORY CANCERS,RES008,"LUNG, PLEURA, OR DIAPHRAGM RESECTION (OPEN AND THORACOSCOPIC)",120,MAJOR RESPIRATORY & CHEST PROCEDURES,04,DISEASES AND DISORDERS OF THE RESPIRATORY SYSTEM,1,Minor,Moderate,Surgical,Medicare,Medicare,Self-Pay,,,false,45608.56,15210.27
New York City,Manhattan,7002053,001463,NYU Langone Hospitals,50 to 69,117,F,White,Not Span/Hispanic,2,Elective,Home or Self Care,2018,RSP002,PNEUMONIA (EXCEPT THAT CAUSED BY TUBERCULOSIS),RES008,"LUNG, PLEURA, OR DIAPHRAGM RESECTION (OPEN AND THORACOSCOPIC)",120,MAJOR RESPIRATORY & CHEST PROCEDURES,04,DISEASES AND DISORDERS OF THE RESPIRATORY SYSTEM,2,Moderate,Minor,Surgical,Medicare,,,,,false,115709.11,26370.9
Capital/Adirond,Albany,0101004,000005,St. Peter's Hospital,50 to 69,121,M,White,Not Span/Hispanic,2,Elective,Home or Self Care,2018,NEO022,RESPIRATORY CANCERS,RES008,"LUNG, PLEURA, OR DIAPHRAGM RESECTION (OPEN AND THORACOSCOPIC)",120,MAJOR RESPIRATORY & CHEST PROCEDURES,04,DISEASES AND DISORDERS OF THE RESPIRATORY SYSTEM,1,Minor,Minor,Surgical,Medicare,Medicare,,,,false,43314.4,15282.8
New York City,Manhattan,7002054,001458,New York-Presbyterian Hospital - New York Weill Cornell Center,70 or Older,OOS,F,Other Race,Not Span/Hispanic,4,Elective,Home or Self Care,2018,NEO022,RESPIRATORY CANCERS,RES008,"LUNG, PLEURA, OR DIAPHRAGM RESECTION (OPEN AND THORACOSCOPIC)",120,MAJOR RESPIRATORY & CHEST PROCEDURES,04,DISEASES AND DISORDERS OF THE RESPIRATORY SYSTEM,3,Major,Extreme,Surgical,Medicare,Private Health Insurance,Self-Pay,,,false,120302.12,40967.08
New York City,Manhattan,7002054,001464,New York-Presbyterian Hospital - Columbia Presbyterian Center,30 to 49,100,M,White,Not Span/Hispanic,2,Elective,Home or Self Care,2018,MAL007,RESPIRATORY CONGENITAL MALFORMATIONS,RES008,"LUNG, PLEURA, OR DIAPHRAGM RESECTION (OPEN AND THORACOSCOPIC)",120,MAJOR RESPIRATORY & CHEST PROCEDURES,04,DISEASES AND DISORDERS OF THE RESPIRATORY SYSTEM,1,Minor,Minor,Surgical,Blue Cross/Blue Shield,Self-Pay,,,,false,77491.92,18162.13
Central NY,Onondaga,3301007,000635,University Hospital SUNY Health Science Center,50 to 69,132,F,White,Not Span/Hispanic,5,Elective,Home or Self Care,2018,NEO022,RESPIRATORY CANCERS,RES008,"LUNG, PLEURA, OR DIAPHRAGM RESECTION (OPEN AND THORACOSCOPIC)",120,MAJOR RESPIRATORY & CHEST PROCEDURES,04,DISEASES AND DISORDERS OF THE RESPIRATORY SYSTEM,2,Moderate,Minor,Surgical,Private Health Insurance,,,,,false,100499.7,32994.33
Long Island,Nassau,2908000,000511,NYU Langone Hospital-Long Island,70 or Older,115,M,White,Not Span/Hispanic,2,Elective,Home w/ Home Health Services,2018,NEO022,RESPIRATORY CANCERS,RES008,"LUNG, PLEURA, OR DIAPHRAGM RESECTION (OPEN AND THORACOSCOPIC)",120,MAJOR RESPIRATORY & CHEST PROCEDURES,04,DISEASES AND DISORDERS OF THE RESPIRATORY SYSTEM,2,Moderate,Major,Surgical,Private Health Insurance,Medicare,Medicare,,,false,154978.93,23547.55
Central NY,Onondaga,3301003,000630,St. Joseph's Hospital Health Center,50 to 69,130,F,White,Not Span/Hispanic,5,Elective,Home w/ Home Health Services,2018,NEO022,RESPIRATORY CANCERS,RES008,"LUNG, PLEURA, OR DIAPHRAGM RESECTION (OPEN AND THORACOSCOPIC)",120,MAJOR RESPIRATORY & CHEST PROCEDURES,04,DISEASES AND DISORDERS OF THE RESPIRATORY SYSTEM,2,Moderate,Minor,Surgical,Medicare,Medicaid,,,,false,50843.58,19808.96
New York City,Manhattan,7002054,001464,New York-Presbyterian Hospital - Columbia Presbyterian Center,50 to 69,112,F,White,Not Span/Hispanic,1,Elective,Home or Self Care,2018,NEO022,RESPIRATORY CANCERS,RES008,"LUNG, PLEURA, OR DIAPHRAGM RESECTION (OPEN AND THORACOSCOPIC)",120,MAJOR RESPIRATORY & CHEST PROCEDURES,04,DISEASES AND DISORDERS OF THE RESPIRATORY SYSTEM,1,Minor,Minor,Surgical,Medicare,Blue Cross/Blue Shield,Self-Pay,,,false,80289.53,20872.59
New York City,Manhattan,7002053,001463,NYU Langone Hospitals,50 to 69,113,M,Other Race,Spanish/Hispanic,2,Elective,Home or Self Care,2018,NEO022,RESPIRATORY CANCERS,RES008,"LUNG, PLEURA, OR DIAPHRAGM RESECTION (OPEN AND THORACOSCOPIC)",120,MAJOR RESPIRATORY & CHEST PROCEDURES,04,DISEASES AND DISORDERS OF THE RESPIRATORY SYSTEM,2,Moderate,Minor,Surgical,Medicare,,,,,false,189540.89,31695.13
New York City,Kings,7001020,001305,Maimonides Medical Center,30 to 49,112,M,Black/African American,Not Span/Hispanic,4,Elective,Home w/ Home Health Services,2018,NEO022,RESPIRATORY CANCERS,RES008,"LUNG, PLEURA, OR DIAPHRAGM RESECTION (OPEN AND THORACOSCOPIC)",120,MAJOR RESPIRATORY & CHEST PROCEDURES,04,DISEASES AND DISORDERS OF THE RESPIRATORY SYSTEM,2,Moderate,Minor,Surgical,Private Health Insurance,Self-Pay,,,,false,80174,26089.49
Western NY,Erie,1401013,000218,Sisters of Charity Hospital,50 to 69,141,M,White,Not Span/Hispanic,7,Elective,Home w/ Home Health Services,2018,NEO022,RESPIRATORY CANCERS,RES008,"LUNG, PLEURA, OR DIAPHRAGM RESECTION (OPEN AND THORACOSCOPIC)",120,MAJOR RESPIRATORY & CHEST PROCEDURES,04,DISEASES AND DISORDERS OF THE RESPIRATORY SYSTEM,3,Major,Moderate,Surgical,Medicare,Medicare,,,,false,84364.87,31501.85
New York City,Queens,7003004,003376,Cohen Children's Medical Center,0 to 17,110,M,White,Not Span/Hispanic,28,Urgent,Home w/ Home Health Services,2018,MAL008,MUSCULOSKELETAL CONGENITAL CONDITIONS,RES011,DIAPHRAGMATIC HERNIA REPAIR,120,MAJOR RESPIRATORY & CHEST PROCEDURES,04,DISEASES AND DISORDERS OF THE RESPIRATORY SYSTEM,3,Major,Minor,Surgical,Blue Cross/Blue Shield,Self-Pay,,,,false,471526.07,89563.82
New York City,Kings,7002002,001324,Mount Sinai Brooklyn,70 or Older,112,M,White,Not Span/Hispanic,8,Elective,Skilled Nursing Home,2018,NEO022,RESPIRATORY CANCERS,RES008,"LUNG, PLEURA, OR DIAPHRAGM RESECTION (OPEN AND THORACOSCOPIC)",120,MAJOR RESPIRATORY & CHEST PROCEDURES,04,DISEASES AND DISORDERS OF THE RESPIRATORY SYSTEM,2,Moderate,Moderate,Surgical,Medicare,Medicaid,Self-Pay,,,false,168119.79,31668.67
Capital/Adirond,Albany,0101004,000005,St. Peter's Hospital,50 to 69,120,F,White,Not Span/Hispanic,6,Elective,Home or Self Care,2018,NEO022,RESPIRATORY CANCERS,RES002,"LUNG, PLEURA, OR DIAPHRAGM BIOPSY (NON-ENDOSCOPIC)",120,MAJOR RESPIRATORY & CHEST PROCEDURES,04,DISEASES AND DISORDERS OF THE RESPIRATORY SYSTEM,2,Moderate,Minor,Surgical,Federal/State/Local/VA,,,,,false,67207.05,24688.16
New York City,Queens,7003004,001630,Long Island Jewish Medical Center,70 or Older,113,F,White,Not Span/Hispanic,19,Urgent,Home or Self Care,2018,NEO022,RESPIRATORY CANCERS,RES008,"LUNG, PLEURA, OR DIAPHRAGM RESECTION (OPEN AND THORACOSCOPIC)",120,MAJOR RESPIRATORY & CHEST PROCEDURES,04,DISEASES AND DISORDERS OF THE RESPIRATORY SYSTEM,4,Extreme,Extreme,Surgical,Medicare,Medicare,Self-Pay,,,false,370832.13,161946.78
Central NY,Onondaga,3301003,000630,St. Joseph's Hospital Health Center,70 or Older,131,F,White,Not Span/Hispanic,5,Elective,Home w/ Home Health Services,2018,NEO022,RESPIRATORY CANCERS,RES008,"LUNG, PLEURA, OR DIAPHRAGM RESECTION (OPEN AND THORACOSCOPIC)",120,MAJOR RESPIRATORY & CHEST PROCEDURES,04,DISEASES AND DISORDERS OF THE RESPIRATORY SYSTEM,3,Major,Moderate,Surgical,Medicare,Private Health Insurance,,,,false,58533.05,20318.76
Long Island,Nassau,2908000,000511,NYU Langone Hospital-Long Island,70 or Older,115,F,White,Not Span/Hispanic,2,Elective,Home w/ Home Health Services,2018,NEO022,RESPIRATORY CANCERS,RES008,"LUNG, PLEURA, OR DIAPHRAGM RESECTION (OPEN AND THORACOSCOPIC)",120,MAJOR RESPIRATORY & CHEST PROCEDURES,04,DISEASES AND DISORDERS OF THE RESPIRATORY SYSTEM,3,Major,Extreme,Surgical,Medicare,Medicare,Blue Cross/Blue Shield,,,false,169974.22,24969.75
New York City,Manhattan,7002054,001458,New York-Presbyterian Hospital - New York Weill Cornell Center,70 or Older,100,F,White,Not Span/Hispanic,2,Elective,Home or Self Care,2018,NEO066,MALIGNANT NEUROENDOCRINE TUMORS,RES008,"LUNG, PLEURA, OR DIAPHRAGM RESECTION (OPEN AND THORACOSCOPIC)",120,MAJOR RESPIRATORY & CHEST PROCEDURES,04,DISEASES AND DISORDERS OF THE RESPIRATORY SYSTEM,1,Minor,Minor,Surgical,Medicare,Private Health Insurance,Self-Pay,,,false,84209.25,29415.5
Hudson Valley,Westchester,5957001,001139,Westchester Medical Center,50 to 69,105,M,White,Not Span/Hispanic,14,Emergency,Court/Law Enforcement,2018,BLD008,IMMUNITY DISORDERS,RES008,"LUNG, PLEURA, OR DIAPHRAGM RESECTION (OPEN AND THORACOSCOPIC)",120,MAJOR RESPIRATORY & CHEST PROCEDURES,04,DISEASES AND DISORDERS OF THE RESPIRATORY SYSTEM,2,Moderate,Minor,Surgical,Medicaid,Department of Corrections,,,,true,285209.46,51283.54
Long Island,Nassau,2950001,000527,Mount Sinai South Nassau,70 or Older,115,F,White,Not Span/Hispanic,7,Elective,Inpatient Rehabilitation Facility,2018,NEO022,RESPIRATORY CANCERS,RES008,"LUNG, PLEURA, OR DIAPHRAGM RESECTION (OPEN AND THORACOSCOPIC)",120,MAJOR RESPIRATORY & CHEST PROCEDURES,04,DISEASES AND DISORDERS OF THE RESPIRATORY SYSTEM,3,Major,Major,Surgical,Medicare,Medicare,,,,false,148121.85,29292.95
New York City,Manhattan,7002020,001453,Memorial Hospital for Cancer and Allied Diseases,50 to 69,117,M,Other Race,Not Span/Hispanic,3,Elective,Home or Self Care,2018,NEO022,RESPIRATORY CANCERS,RES008,"LUNG, PLEURA, OR DIAPHRAGM RESECTION (OPEN AND THORACOSCOPIC)",120,MAJOR RESPIRATORY & CHEST PROCEDURES,04,DISEASES AND DISORDERS OF THE RESPIRATORY SYSTEM,1,Minor,Minor,Surgical,Medicare,Blue Cross/Blue Shield,Medicare,,,false,95904.47,35543
New York City,Manhattan,7002020,001453,Memorial Hospital for Cancer and Allied Diseases,70 or Older,105,M,White,Not Span/Hispanic,5,Elective,Home or Self Care,2018,NEO022,RESPIRATORY CANCERS,RES008,"LUNG, PLEURA, OR DIAPHRAGM RESECTION (OPEN AND THORACOSCOPIC)",120,MAJOR RESPIRATORY & CHEST PROCEDURES,04,DISEASES AND DISORDERS OF THE RESPIRATORY SYSTEM,3,Major,Moderate,Surgical,Medicare,Private Health Insurance,,,,false,71599.34,28554.93
New York City,Queens,7003010,001637,New York - Presbyterian/Queens,50 to 69,113,M,Other Race,Spanish/Hispanic,8,Urgent,Home or Self Care,2018,RSP017,POSTPROCEDURAL OR POSTOPERATIVE RESPIRATORY SYSTEM COMPLICATION,RES002,"LUNG, PLEURA, OR DIAPHRAGM BIOPSY (NON-ENDOSCOPIC)",120,MAJOR RESPIRATORY & CHEST PROCEDURES,04,DISEASES AND DISORDERS OF THE RESPIRATORY SYSTEM,2,Moderate,Major,Surgical,Medicare,Medicaid,Self-Pay,,,false,77365.85,22099.01
New York City,Manhattan,7002054,001464,New York-Presbyterian Hospital - Columbia Presbyterian Center,70 or Older,OOS,M,White,Not Span/Hispanic,2,Elective,Home or Self Care,2018,NEO022,RESPIRATORY CANCERS,RES008,"LUNG, PLEURA, OR DIAPHRAGM RESECTION (OPEN AND THORACOSCOPIC)",120,MAJOR RESPIRATORY & CHEST PROCEDURES,04,DISEASES AND DISORDERS OF THE RESPIRATORY SYSTEM,2,Moderate,Moderate,Surgical,Medicare,Private Health Insurance,Self-Pay,,,false,44892.72,8079.67
New York City,Kings,7001020,001305,Maimonides Medical Center,70 or Older,112,F,White,Not Span/Hispanic,4,Elective,Home or Self Care,2018,NEO022,RESPIRATORY CANCERS,RES008,"LUNG, PLEURA, OR DIAPHRAGM RESECTION (OPEN AND THORACOSCOPIC)",120,MAJOR RESPIRATORY & CHEST PROCEDURES,04,DISEASES AND DISORDERS OF THE RESPIRATORY SYSTEM,2,Moderate,Minor,Surgical,Medicare,Self-Pay,,,,false,96174.04,30523.72
New York City,Manhattan,7002020,001453,Memorial Hospital for Cancer and Allied Diseases,50 to 69,119,F,White,Not Span/Hispanic,4,Elective,Home or Self Care,2018,NEO022,RESPIRATORY CANCERS,RES008,"LUNG, PLEURA, OR DIAPHRAGM RESECTION (OPEN AND THORACOSCOPIC)",120,MAJOR RESPIRATORY & CHEST PROCEDURES,04,DISEASES AND DISORDERS OF THE RESPIRATORY SYSTEM,3,Major,Moderate,Surgical,Medicare,Medicare,,,,false,73386.54,29560.11
New York City,Manhattan,7002053,001463,NYU Langone Hospitals,70 or Older,103,M,Other Race,Not Span/Hispanic,2,Elective,Home or Self Care,2018,NEO022,RESPIRATORY CANCERS,CAR024,VENOUS AND ARTERIAL CATHETER PLACEMENT,120,MAJOR RESPIRATORY & CHEST PROCEDURES,04,DISEASES AND DISORDERS OF THE RESPIRATORY SYSTEM,2,Moderate,Moderate,Surgical,Medicare,,,,,false,165662.25,28247
New York City,Queens,7003004,001630,Long Island Jewish Medical Center,70 or Older,114,F,Other Race,Not Span/Hispanic,3,Elective,Home w/ Home Health Services,2018,NEO022,RESPIRATORY CANCERS,RES008,"LUNG, PLEURA, OR DIAPHRAGM RESECTION (OPEN AND THORACOSCOPIC)",120,MAJOR RESPIRATORY & CHEST PROCEDURES,04,DISEASES AND DISORDERS OF THE RESPIRATORY SYSTEM,2,Moderate,Minor,Surgical,Medicare,Medicare,Medicaid,,,false,90759.75,24164.19
Long Island,Nassau,2908000,000511,NYU Langone Hospital-Long Island,50 to 69,115,F,White,Not Span/Hispanic,4,Elective,Home w/ Home Health Services,2018,NEO022,RESPIRATORY CANCERS,RES008,"LUNG, PLEURA, OR DIAPHRAGM RESECTION (OPEN AND THORACOSCOPIC)",120,MAJOR RESPIRATORY & CHEST PROCEDURES,04,DISEASES AND DISORDERS OF THE RESPIRATORY SYSTEM,2,Moderate,Moderate,Surgical,Medicare,Medicare,Private Health Insurance,,,false,208107.04,33505.5
New York City,Manhattan,7002054,001464,New York-Presbyterian Hospital - Columbia Presbyterian Center,50 to 69,105,M,White,Not Span/Hispanic,4,Elective,Home or Self Care,2018,RSP016,OTHER SPECIFIED AND UNSPECIFIED LOWER RESPIRATORY DISEASE,RES008,"LUNG, PLEURA, OR DIAPHRAGM RESECTION (OPEN AND THORACOSCOPIC)",120,MAJOR RESPIRATORY & CHEST PROCEDURES,04,DISEASES AND DISORDERS OF THE RESPIRATORY SYSTEM,1,Minor,Minor,Surgical,Medicare,Blue Cross/Blue Shield,Self-Pay,,,false,106703.47,28561.05
Capital/Adirond,Albany,0101004,000005,St. Peter's Hospital,70 or Older,121,M,White,Not Span/Hispanic,11,Elective,Home or Self Care,2018,NEO022,RESPIRATORY CANCERS,CAR004,PERCUTANEOUS CORONARY INTERVENTIONS (PCI),120,MAJOR RESPIRATORY & CHEST PROCEDURES,04,DISEASES AND DISORDERS OF THE RESPIRATORY SYSTEM,3,Major,Moderate,Surgical,Medicare,Private Health Insurance,,,,false,133973.65,37096.48
New York City,Kings,7001021,001306,New York - Presbyterian Brooklyn Methodist Hospital,70 or Older,112,M,Black/African American,Not Span/Hispanic,4,Elective,Home w/ Home Health Services,2018,NEO022,RESPIRATORY CANCERS,RES008,"LUNG, PLEURA, OR DIAPHRAGM RESECTION (OPEN AND THORACOSCOPIC)",120,MAJOR RESPIRATORY & CHEST PROCEDURES,04,DISEASES AND DISORDERS OF THE RESPIRATORY SYSTEM,2,Moderate,Moderate,Surgical,Medicare,Medicare,Medicaid,,,false,63989.49,24324.92