Hospital Service Area,Hospital County,Operating Certificate Number,Permanent Facility Id,Facility Name,Age Group,Zip Code - 3 digits,Gender,Race,Ethnicity,Length of Stay,Type of Admission,Patient Disposition,Discharge Year,CCS Diagnosis Code,CCS Diagnosis Description,CCS Procedure Code,CCS Procedure Description,APR DRG Code,APR DRG Description,APR MDC Code,APR MDC Description,APR Severity of Illness Code,APR Severity of Illness Description,APR Risk of Mortality,APR Medical Surgical Description,Payment Typology 1,Payment Typology 2,Payment Typology 3,Birth Weight,Abortion Edit Indicator,Emergency Department Indicator,Total Charges,Total Costs
New York City,Kings,7002053,001304,NYU Langone Hospital-Brooklyn,50 to 69,113,M,White,Not Span/Hispanic,2,Elective,Home or Self Care,2019,NEO022,RESPIRATORY CANCERS,RES008,"LUNG, PLEURA, OR DIAPHRAGM RESECTION (OPEN AND THORACOSCOPIC)",120,MAJOR RESPIRATORY & CHEST PROCEDURES,04,DISEASES AND DISORDERS OF THE RESPIRATORY SYSTEM,1,Minor,Minor,Surgical,Blue Cross/Blue Shield,,,,,false,171104.74,34647.37
Long Island,Suffolk,5151001,000245,Stony Brook University Hospital,50 to 69,117,F,White,Not Span/Hispanic,8,Elective,Home w/ Home Health Services,2019,NEO022,RESPIRATORY CANCERS,RES008,"LUNG, PLEURA, OR DIAPHRAGM RESECTION (OPEN AND THORACOSCOPIC)",120,MAJOR RESPIRATORY & CHEST PROCEDURES,04,DISEASES AND DISORDERS OF THE RESPIRATORY SYSTEM,2,Moderate,Moderate,Surgical,Blue Cross/Blue Shield,,,,,false,127332.41,48176.59
New York City,Manhattan,7002054,001458,New York-Presbyterian Hospital - New York Weill Cornell Center,50 to 69,OOS,F,Other Race,Not Span/Hispanic,3,Elective,Home w/ Home Health Services,2019,RSP007,OTHER SPECIFIED AND UNSPECIFIED UPPER RESPIRATORY DISEASE,RES014,"RESPIRATORY SYSTEM PROCEDURES, NEC",120,MAJOR RESPIRATORY & CHEST PROCEDURES,04,DISEASES AND DISORDERS OF THE RESPIRATORY SYSTEM,1,Minor,Minor,Surgical,Blue Cross/Blue Shield,Self-Pay,,,,false,101287.71,38568.18
New York City,Manhattan,7002054,001458,New York-Presbyterian Hospital - New York Weill Cornell Center,50 to 69,100,F,Other Race,Spanish/Hispanic,5,Elective,Home or Self Care,2019,NEO066,MALIGNANT NEUROENDOCRINE TUMORS,RES008,"LUNG, PLEURA, OR DIAPHRAGM RESECTION (OPEN AND THORACOSCOPIC)",120,MAJOR RESPIRATORY & CHEST PROCEDURES,04,DISEASES AND DISORDERS OF THE RESPIRATORY SYSTEM,2,Moderate,Minor,Surgical,Private Health Insurance,Self-Pay,,,,false,125208.92,51753.71
Capital/Adirond,Albany,0101004,000005,St. Peter's Hospital,70 or Older,120,M,White,Not Span/Hispanic,9,Elective,Home or Self Care,2019,NEO022,RESPIRATORY CANCERS,RES008,"LUNG, PLEURA, OR DIAPHRAGM RESECTION (OPEN AND THORACOSCOPIC)",120,MAJOR RESPIRATORY & CHEST PROCEDURES,04,DISEASES AND DISORDERS OF THE RESPIRATORY SYSTEM,2,Moderate,Moderate,Surgical,Medicare,Medicare,,,,false,54687.65,23707.38
New York City,Manhattan,7002054,001458,New York-Presbyterian Hospital - New York Weill Cornell Center,50 to 69,100,F,White,Not Span/Hispanic,2,Elective,Home or Self Care,2019,RSP016,OTHER SPECIFIED AND UNSPECIFIED LOWER RESPIRATORY DISEASE,RES008,"LUNG, PLEURA, OR DIAPHRAGM RESECTION (OPEN AND THORACOSCOPIC)",120,MAJOR RESPIRATORY & CHEST PROCEDURES,04,DISEASES AND DISORDERS OF THE RESPIRATORY SYSTEM,2,Moderate,Moderate,Surgical,Private Health Insurance,Self-Pay,,,,false,52671.27,14878.42
Finger Lakes,Monroe,2701003,000411,Rochester General Hospital,70 or Older,146,M,White,Not Span/Hispanic,5,Elective,Home w/ Home Health Services,2019,NEO022,RESPIRATORY CANCERS,RES008,"LUNG, PLEURA, OR DIAPHRAGM RESECTION (OPEN AND THORACOSCOPIC)",120,MAJOR RESPIRATORY & CHEST PROCEDURES,04,DISEASES AND DISORDERS OF THE RESPIRATORY SYSTEM,2,Moderate,Minor,Surgical,Medicare,,,,,false,45386.27,20401.05
New York City,Manhattan,7002001,001438,Bellevue Hospital Center,50 to 69,114,M,Other Race,Spanish/Hispanic,16,Emergency,Home w/ Home Health Services,2019,RSP016,OTHER SPECIFIED AND UNSPECIFIED LOWER RESPIRATORY DISEASE,RES008,"LUNG, PLEURA, OR DIAPHRAGM RESECTION (OPEN AND THORACOSCOPIC)",120,MAJOR RESPIRATORY & CHEST PROCEDURES,04,DISEASES AND DISORDERS OF THE RESPIRATORY SYSTEM,3,Major,Major,Surgical,Self-Pay,,,,,true,93320.86,62021.04
New York City,Kings,7001020,001305,Maimonides Medical Center,50 to 69,112,F,Black/African American,Not Span/Hispanic,2,Elective,Home or Self Care,2019,END009,OBESITY,GIS010,GASTRECTOMY,120,MAJOR RESPIRATORY & CHEST PROCEDURES,04,DISEASES AND DISORDERS OF THE RESPIRATORY SYSTEM,2,Moderate,Moderate,Surgical,Medicare,Medicare,Medicaid,,,false,33965.03,8982.16
Capital/Adirond,Albany,0101004,000005,St. Peter's Hospital,50 to 69,123,M,White,Not Span/Hispanic,9,Elective,Inpatient Rehabilitation Facility,2019,NEO022,RESPIRATORY CANCERS,RES008,"LUNG, PLEURA, OR DIAPHRAGM RESECTION (OPEN AND THORACOSCOPIC)",120,MAJOR RESPIRATORY & CHEST PROCEDURES,04,DISEASES AND DISORDERS OF THE RESPIRATORY SYSTEM,4,Extreme,Major,Surgical,Blue Cross/Blue Shield,,,,,false,97072.45,31010.2
New York City,Manhattan,7002053,001463,NYU Langone Hospitals,50 to 69,112,M,Other Race,Not Span/Hispanic,1,Elective,Home or Self Care,2019,RSP016,OTHER SPECIFIED AND UNSPECIFIED LOWER RESPIRATORY DISEASE,RES008,"LUNG, PLEURA, OR DIAPHRAGM RESECTION (OPEN AND THORACOSCOPIC)",120,MAJOR RESPIRATORY & CHEST PROCEDURES,04,DISEASES AND DISORDERS OF THE RESPIRATORY SYSTEM,1,Minor,Minor,Surgical,Medicare,Medicaid,,,,false,180454.38,28465.03
Southern Tier,Broome,0303001,000058,United Health Services Hospitals Inc. - Wilson Medical Center,70 or Older,138,M,White,Not Span/Hispanic,7,Elective,Home or Self Care,2019,NEO022,RESPIRATORY CANCERS,RES008,"LUNG, PLEURA, OR DIAPHRAGM RESECTION (OPEN AND THORACOSCOPIC)",120,MAJOR RESPIRATORY & CHEST PROCEDURES,04,DISEASES AND DISORDERS OF THE RESPIRATORY SYSTEM,2,Moderate,Moderate,Surgical,Medicare,Medicare,,,,false,81318.3,32274.75
Southern Tier,Broome,0303001,000058,United Health Services Hospitals Inc. - Wilson Medical Center,70 or Older,138,F,White,Not Span/Hispanic,2,Elective,Home or Self Care,2019,MAL008,MUSCULOSKELETAL CONGENITAL CONDITIONS,RES011,DIAPHRAGMATIC HERNIA REPAIR,120,MAJOR RESPIRATORY & CHEST PROCEDURES,04,DISEASES AND DISORDERS OF THE RESPIRATORY SYSTEM,1,Minor,Minor,Surgical,Medicare,Medicare,,,,false,32540.2,16579.01
New York City,Manhattan,7002054,001464,New York-Presbyterian Hospital - Columbia Presbyterian Center,50 to 69,104,M,White,Spanish/Hispanic,2,Elective,Home or Self Care,2019,NEO022,RESPIRATORY CANCERS,RES008,"LUNG, PLEURA, OR DIAPHRAGM RESECTION (OPEN AND THORACOSCOPIC)",120,MAJOR RESPIRATORY & CHEST PROCEDURES,04,DISEASES AND DISORDERS OF THE RESPIRATORY SYSTEM,2,Moderate,Minor,Surgical,Medicaid,Medicaid,Self-Pay,,,false,109275.77,33472.35
Capital/Adirond,Albany,0101004,000005,St. Peter's Hospital,50 to 69,124,M,White,Not Span/Hispanic,9,Elective,Home or Self Care,2019,NEO022,RESPIRATORY CANCERS,RES008,"LUNG, PLEURA, OR DIAPHRAGM RESECTION (OPEN AND THORACOSCOPIC)",120,MAJOR RESPIRATORY & CHEST PROCEDURES,04,DISEASES AND DISORDERS OF THE RESPIRATORY SYSTEM,3,Major,Major,Surgical,Blue Cross/Blue Shield,Medicare,,,,false,96732.5,32813.26
Capital/Adirond,Albany,0101004,000005,St. Peter's Hospital,70 or Older,121,M,White,Not Span/Hispanic,11,Elective,Home or Self Care,2019,NEO022,RESPIRATORY CANCERS,RES008,"LUNG, PLEURA, OR DIAPHRAGM RESECTION (OPEN AND THORACOSCOPIC)",120,MAJOR RESPIRATORY & CHEST PROCEDURES,04,DISEASES AND DISORDERS OF THE RESPIRATORY SYSTEM,3,Major,Major,Surgical,Medicare,Private Health Insurance,,,,false,71469.5,28907.96
New York City,Manhattan,7002054,001464,New York-Presbyterian Hospital - Columbia Presbyterian Center,50 to 69,104,M,Multi-racial,Not Span/Hispanic,5,Elective,Home or Self Care,2019,RSP016,OTHER SPECIFIED AND UNSPECIFIED LOWER RESPIRATORY DISEASE,RES008,"LUNG, PLEURA, OR DIAPHRAGM RESECTION (OPEN AND THORACOSCOPIC)",120,MAJOR RESPIRATORY & CHEST PROCEDURES,04,DISEASES AND DISORDERS OF THE RESPIRATORY SYSTEM,1,Minor,Minor,Surgical,Blue Cross/Blue Shield,Medicare,Self-Pay,,,false,113470.19,24197.57
New York City,Richmond,7004003,001740,Staten Island University Hosp-North,70 or Older,103,F,White,Not Span/Hispanic,6,Elective,Home or Self Care,2019,NEO022,RESPIRATORY CANCERS,RES008,"LUNG, PLEURA, OR DIAPHRAGM RESECTION (OPEN AND THORACOSCOPIC)",120,MAJOR RESPIRATORY & CHEST PROCEDURES,04,DISEASES AND DISORDERS OF THE RESPIRATORY SYSTEM,2,Moderate,Minor,Surgical,Medicare,Blue Cross/Blue Shield,,,,false,81511.45,21420.77
New York City,Manhattan,7002054,001458,New York-Presbyterian Hospital - New York Weill Cornell Center,50 to 69,112,M,Other Race,Not Span/Hispanic,5,Elective,Home or Self Care,2019,NEO022,RESPIRATORY CANCERS,RES008,"LUNG, PLEURA, OR DIAPHRAGM RESECTION (OPEN AND THORACOSCOPIC)",120,MAJOR RESPIRATORY & CHEST PROCEDURES,04,DISEASES AND DISORDERS OF THE RESPIRATORY SYSTEM,2,Moderate,Minor,Surgical,"Managed Care, Unspecified",Medicaid,Self-Pay,,,false,139000.28,53309.73
New York City,Queens,7003004,001630,Long Island Jewish Medical Center,70 or Older,113,F,Other Race,Not Span/Hispanic,15,Elective,Home w/ Home Health Services,2019,NEO022,RESPIRATORY CANCERS,RES008,"LUNG, PLEURA, OR DIAPHRAGM RESECTION (OPEN AND THORACOSCOPIC)",120,MAJOR RESPIRATORY & CHEST PROCEDURES,04,DISEASES AND DISORDERS OF THE RESPIRATORY SYSTEM,2,Moderate,Moderate,Surgical,Medicare,Medicaid,Self-Pay,,,false,262838.46,56438.89
New York City,Manhattan,7002054,001464,New York-Presbyterian Hospital - Columbia Presbyterian Center,30 to 49,117,F,White,Not Span/Hispanic,2,Elective,Home or Self Care,2019,RSP016,OTHER SPECIFIED AND UNSPECIFIED LOWER RESPIRATORY DISEASE,RES001,BRONCHOSCOPY (DIAGNOSTIC),120,MAJOR RESPIRATORY & CHEST PROCEDURES,04,DISEASES AND DISORDERS OF THE RESPIRATORY SYSTEM,1,Minor,Minor,Surgical,Private Health Insurance,Self-Pay,,,,false,58538.16,16780.82
New York City,Manhattan,7002020,001453,Memorial Hospital for Cancer and Allied Diseases,50 to 69,OOS,M,Other Race,Not Span/Hispanic,2,Elective,Home or Self Care,2019,NEO022,RESPIRATORY CANCERS,RES008,"LUNG, PLEURA, OR DIAPHRAGM RESECTION (OPEN AND THORACOSCOPIC)",120,MAJOR RESPIRATORY & CHEST PROCEDURES,04,DISEASES AND DISORDERS OF THE RESPIRATORY SYSTEM,2,Moderate,Moderate,Surgical,Blue Cross/Blue Shield,,,,,false,50229.33,20041.11
New York City,Manhattan,7002032,001469,Mount Sinai Morningside,50 to 69,100,M,Other Race,Spanish/Hispanic,2,Elective,Home w/ Home Health Services,2019,NEO022,RESPIRATORY CANCERS,RES008,"LUNG, PLEURA, OR DIAPHRAGM RESECTION (OPEN AND THORACOSCOPIC)",120,MAJOR RESPIRATORY & CHEST PROCEDURES,04,DISEASES AND DISORDERS OF THE RESPIRATORY SYSTEM,2,Moderate,Minor,Surgical,Medicare,Private Health Insurance,Self-Pay,,,false,79867.93,25400.17
New York City,Kings,7001003,001288,Brooklyn Hospital Center - Downtown Campus,50 to 69,103,F,Other Race,Unknown,2,Elective,Home or Self Care,2019,NEO022,RESPIRATORY CANCERS,RES008,"LUNG, PLEURA, OR DIAPHRAGM RESECTION (OPEN AND THORACOSCOPIC)",120,MAJOR RESPIRATORY & CHEST PROCEDURES,04,DISEASES AND DISORDERS OF THE RESPIRATORY SYSTEM,1,Minor,Minor,Surgical,Medicaid,Medicaid,Self-Pay,,,false,65748.53,15787.84
New York City,Manhattan,7002020,001453,Memorial Hospital for Cancer and Allied Diseases,70 or Older,OOS,M,White,Not Span/Hispanic,3,Elective,Home or Self Care,2019,NEO022,RESPIRATORY CANCERS,RES008,"LUNG, PLEURA, OR DIAPHRAGM RESECTION (OPEN AND THORACOSCOPIC)",120,MAJOR RESPIRATORY & CHEST PROCEDURES,04,DISEASES AND DISORDERS OF THE RESPIRATORY SYSTEM,1,Minor,Moderate,Surgical,Medicare,Private Health Insurance,,,,false,62889.39,25842.11
Finger Lakes,Monroe,2701003,000411,Rochester General Hospital,70 or Older,146,F,Multi-racial,Not Span/Hispanic,2,Urgent,Home w/ Home Health Services,2019,NEO022,RESPIRATORY CANCERS,RES008,"LUNG, PLEURA, OR DIAPHRAGM RESECTION (OPEN AND THORACOSCOPIC)",120,MAJOR RESPIRATORY & CHEST PROCEDURES,04,DISEASES AND DISORDERS OF THE RESPIRATORY SYSTEM,2,Moderate,Major,Surgical,Medicare,,,,,false,37725.89,15506.22
Hudson Valley,Westchester,5932000,001129,Phelps Hospital,50 to 69,105,M,Other Race,Spanish/Hispanic,7,Urgent,Home or Self Care,2019,NEO070,SECONDARY MALIGNANCIES,RES008,"LUNG, PLEURA, OR DIAPHRAGM RESECTION (OPEN AND THORACOSCOPIC)",120,MAJOR RESPIRATORY & CHEST PROCEDURES,04,DISEASES AND DISORDERS OF THE RESPIRATORY SYSTEM,1,Minor,Minor,Surgical,Private Health Insurance,,,,,false,102174.82,25809.31
New York City,Manhattan,7002053,001463,NYU Langone Hospitals,70 or Older,113,F,Other Race,Spanish/Hispanic,3,Elective,Home or Self Care,2019,NEO022,RESPIRATORY CANCERS,RES008,"LUNG, PLEURA, OR DIAPHRAGM RESECTION (OPEN AND THORACOSCOPIC)",120,MAJOR RESPIRATORY & CHEST PROCEDURES,04,DISEASES AND DISORDERS OF THE RESPIRATORY SYSTEM,2,Moderate,Moderate,Surgical,Medicaid,,,,,false,195918.95,34679.27
Capital/Adirond,Albany,0101004,000005,St. Peter's Hospital,70 or Older,,M,Other Race,Not Span/Hispanic,13,Elective,Inpatient Rehabilitation Facility,2019,NEO022,RESPIRATORY CANCERS,RES008,"LUNG, PLEURA, OR DIAPHRAGM RESECTION (OPEN AND THORACOSCOPIC)",120,MAJOR RESPIRATORY & CHEST PROCEDURES,04,DISEASES AND DISORDERS OF THE RESPIRATORY SYSTEM,4,Extreme,Major,Surgical,Medicare,,,,,false,128704.42,44579.77
Finger Lakes,Monroe,2701005,000413,Strong Memorial Hospital,70 or Older,131,F,White,Not Span/Hispanic,5,Elective,Home or Self Care,2019,NEO022,RESPIRATORY CANCERS,RES008,"LUNG, PLEURA, OR DIAPHRAGM RESECTION (OPEN AND THORACOSCOPIC)",120,MAJOR RESPIRATORY & CHEST PROCEDURES,04,DISEASES AND DISORDERS OF THE RESPIRATORY SYSTEM,3,Major,Major,Surgical,Medicare,Private Health Insurance,,,,false,57955.7,25811.25
Hudson Valley,Westchester,5907001,001097,SJRH - St Johns Division,50 to 69,105,F,Black/African American,Not Span/Hispanic,3,Emergency,Home or Self Care,2019,NEO022,RESPIRATORY CANCERS,RES008,"LUNG, PLEURA, OR DIAPHRAGM RESECTION (OPEN AND THORACOSCOPIC)",120,MAJOR RESPIRATORY & CHEST PROCEDURES,04,DISEASES AND DISORDERS OF THE RESPIRATORY SYSTEM,2,Moderate,Minor,Surgical,Medicaid,Medicaid,,,,false,50337.71,20007.88
Capital/Adirond,Albany,0101004,000005,St. Peter's Hospital,70 or Older,122,F,White,Not Span/Hispanic,7,Elective,Home w/ Home Health Services,2019,NEO022,RESPIRATORY CANCERS,RES008,"LUNG, PLEURA, OR DIAPHRAGM RESECTION (OPEN AND THORACOSCOPIC)",120,MAJOR RESPIRATORY & CHEST PROCEDURES,04,DISEASES AND DISORDERS OF THE RESPIRATORY SYSTEM,2,Moderate,Major,Surgical,Medicare,Medicare,,,,false,59550.55,24168.87
Capital/Adirond,Albany,0101004,000005,St. Peter's Hospital,50 to 69,122,M,White,Not Span/Hispanic,7,Elective,Skilled Nursing Home,2019,NEO022,RESPIRATORY CANCERS,RES008,"LUNG, PLEURA, OR DIAPHRAGM RESECTION (OPEN AND THORACOSCOPIC)",120,MAJOR RESPIRATORY & CHEST PROCEDURES,04,DISEASES AND DISORDERS OF THE RESPIRATORY SYSTEM,3,Major,Major,Surgical,Medicare,Medicare,,,,false,104006.93,39007.91
New York City,Manhattan,7002053,001463,NYU Langone Hospitals,50 to 69,112,M,Other Race,Not Span/Hispanic,2,Elective,Home w/ Home Health Services,2019,NEO022,RESPIRATORY CANCERS,RES008,"LUNG, PLEURA, OR DIAPHRAGM RESECTION (OPEN AND THORACOSCOPIC)",120,MAJOR RESPIRATORY & CHEST PROCEDURES,04,DISEASES AND DISORDERS OF THE RESPIRATORY SYSTEM,1,Minor,Minor,Surgical,Private Health Insurance,Medicare,,,,false,110495.22,20583.78
Hudson Valley,Rockland,4324000,000776,Montefiore Nyack,70 or Older,OOS,F,White,Not Span/Hispanic,8,Elective,Inpatient Rehabilitation Facility,2019,NEO022,RESPIRATORY CANCERS,RES008,"LUNG, PLEURA, OR DIAPHRAGM RESECTION (OPEN AND THORACOSCOPIC)",120,MAJOR RESPIRATORY & CHEST PROCEDURES,04,DISEASES AND DISORDERS OF THE RESPIRATORY SYSTEM,4,Extreme,Major,Surgical,Medicare,Blue Cross/Blue Shield,,,,false,199139.96,39130.17
Finger Lakes,Monroe,2701005,000413,Strong Memorial Hospital,50 to 69,140,F,White,Not Span/Hispanic,2,Elective,Home or Self Care,2019,NEO022,RESPIRATORY CANCERS,RES008,"LUNG, PLEURA, OR DIAPHRAGM RESECTION (OPEN AND THORACOSCOPIC)",120,MAJOR RESPIRATORY & CHEST PROCEDURES,04,DISEASES AND DISORDERS OF THE RESPIRATORY SYSTEM,1,Minor,Minor,Surgical,Medicare,,,,,false,48529.5,24422
Finger Lakes,Monroe,2701005,000413,Strong Memorial Hospital,70 or Older,148,F,White,Not Span/Hispanic,3,Elective,Home or Self Care,2019,NEO022,RESPIRATORY CANCERS,RES008,"LUNG, PLEURA, OR DIAPHRAGM RESECTION (OPEN AND THORACOSCOPIC)",120,MAJOR RESPIRATORY & CHEST PROCEDURES,04,DISEASES AND DISORDERS OF THE RESPIRATORY SYSTEM,1,Minor,Moderate,Surgical,Medicare,Private Health Insurance,,,,false,56975.51,26053.7
Finger Lakes,Monroe,2701003,000411,Rochester General Hospital,70 or Older,146,M,White,Not Span/Hispanic,28,Emergency,Home w/ Home Health Services,2019,RSP014,PNEUMOTHORAX,RES008,"LUNG, PLEURA, OR DIAPHRAGM RESECTION (OPEN AND THORACOSCOPIC)",120,MAJOR RESPIRATORY & CHEST PROCEDURES,04,DISEASES AND DISORDERS OF THE RESPIRATORY SYSTEM,4,Extreme,Major,Surgical,Medicare,Blue Cross/Blue Shield,,,,true,113116.48,51014.24
Capital/Adirond,Albany,0101004,000005,St. Peter's Hospital,50 to 69,121,F,White,Not Span/Hispanic,5,Elective,Home or Self Care,2019,NEO022,RESPIRATORY CANCERS,RES008,"LUNG, PLEURA, OR DIAPHRAGM RESECTION (OPEN AND THORACOSCOPIC)",120,MAJOR RESPIRATORY & CHEST PROCEDURES,04,DISEASES AND DISORDERS OF THE RESPIRATORY SYSTEM,3,Major,Major,Surgical,Blue Cross/Blue Shield,,,,,false,49321.85,20014.2
Capital/Adirond,Albany,0101000,000001,Albany Medical Center Hospital,50 to 69,121,F,White,Not Span/Hispanic,4,Elective,Home or Self Care,2019,NEO022,RESPIRATORY CANCERS,RES008,"LUNG, PLEURA, OR DIAPHRAGM RESECTION (OPEN AND THORACOSCOPIC)",120,MAJOR RESPIRATORY & CHEST PROCEDURES,04,DISEASES AND DISORDERS OF THE RESPIRATORY SYSTEM,1,Minor,Minor,Surgical,Blue Cross/Blue Shield,,,,,false,41553.35,17105.76
New York City,Kings,7001021,001306,New York - Presbyterian Brooklyn Methodist Hospital,70 or Older,112,M,Other Race,Not Span/Hispanic,2,Elective,Home w/ Home Health Services,2019,NEO022,RESPIRATORY CANCERS,RES008,"LUNG, PLEURA, OR DIAPHRAGM RESECTION (OPEN AND THORACOSCOPIC)",120,MAJOR RESPIRATORY & CHEST PROCEDURES,04,DISEASES AND DISORDERS OF THE RESPIRATORY SYSTEM,2,Moderate,Minor,Surgical,Medicare,Medicare,Medicaid,,,false,34105.93,15503.18
Central NY,Jefferson,2201000,000367,Samaritan Medical Center,50 to 69,136,F,White,Not Span/Hispanic,8,Elective,Home or Self Care,2019,NEO022,RESPIRATORY CANCERS,RES008,"LUNG, PLEURA, OR DIAPHRAGM RESECTION (OPEN AND THORACOSCOPIC)",120,MAJOR RESPIRATORY & CHEST PROCEDURES,04,DISEASES AND DISORDERS OF THE RESPIRATORY SYSTEM,1,Minor,Minor,Surgical,Medicare,,,,,false,75884.53,38864.51
New York City,Kings,7001021,001306,New York - Presbyterian Brooklyn Methodist Hospital,30 to 49,112,F,Black/African American,Not Span/Hispanic,4,Elective,Home w/ Home Health Services,2019,NEO022,RESPIRATORY CANCERS,RES008,"LUNG, PLEURA, OR DIAPHRAGM RESECTION (OPEN AND THORACOSCOPIC)",120,MAJOR RESPIRATORY & CHEST PROCEDURES,04,DISEASES AND DISORDERS OF THE RESPIRATORY SYSTEM,2,Moderate,Minor,Surgical,Private Health Insurance,Self-Pay,,,,false,58150.57,24736.95
Hudson Valley,Westchester,5957001,001139,Westchester Medical Center,30 to 49,125,M,White,Not Span/Hispanic,2,Elective,Home or Self Care,2019,NEO066,MALIGNANT NEUROENDOCRINE TUMORS,RES008,"LUNG, PLEURA, OR DIAPHRAGM RESECTION (OPEN AND THORACOSCOPIC)",120,MAJOR RESPIRATORY & CHEST PROCEDURES,04,DISEASES AND DISORDERS OF THE RESPIRATORY SYSTEM,1,Minor,Minor,Surgical,Blue Cross/Blue Shield,,,,,false,172135.4,34448.87
Capital/Adirond,Albany,0101004,000005,St. Peter's Hospital,70 or Older,123,F,White,Not Span/Hispanic,10,Elective,Home or Self Care,2019,NEO022,RESPIRATORY CANCERS,RES008,"LUNG, PLEURA, OR DIAPHRAGM RESECTION (OPEN AND THORACOSCOPIC)",120,MAJOR RESPIRATORY & CHEST PROCEDURES,04,DISEASES AND DISORDERS OF THE RESPIRATORY SYSTEM,2,Moderate,Moderate,Surgical,Medicare,Medicare,,,,false,83951.3,30074.53
Long Island,Nassau,2908000,000511,NYU Langone Hospital-Long Island,70 or Older,117,M,White,Not Span/Hispanic,6,Elective,Home w/ Home Health Services,2019,NEO022,RESPIRATORY CANCERS,RES008,"LUNG, PLEURA, OR DIAPHRAGM RESECTION (OPEN AND THORACOSCOPIC)",120,MAJOR RESPIRATORY & CHEST PROCEDURES,04,DISEASES AND DISORDERS OF THE RESPIRATORY SYSTEM,2,Moderate,Moderate,Surgical,Medicare,Medicare,Private Health Insurance,,,false,199735.35,33944.43
New York City,Manhattan,7002054,001458,New York-Presbyterian Hospital - New York Weill Cornell Center,70 or Older,113,F,White,Not Span/Hispanic,10,Elective,Inpatient Rehabilitation Facility,2019,NEO022,RESPIRATORY CANCERS,RES008,"LUNG, PLEURA, OR DIAPHRAGM RESECTION (OPEN AND THORACOSCOPIC)",120,MAJOR RESPIRATORY & CHEST PROCEDURES,04,DISEASES AND DISORDERS OF THE RESPIRATORY SYSTEM,3,Major,Major,Surgical,Medicare,Blue Cross/Blue Shield,Self-Pay,,,false,258634.98,104799.5
Capital/Adirond,Albany,0101004,000005,St. Peter's Hospital,70 or Older,120,M,White,Not Span/Hispanic,4,Elective,Home or Self Care,2019,NEO072,NEOPLASMS OF UNSPECIFIED NATURE OR UNCERTAIN BEHAVIOR,RES008,"LUNG, PLEURA, OR DIAPHRAGM RESECTION (OPEN AND THORACOSCOPIC)",120,MAJOR RESPIRATORY & CHEST PROCEDURES,04,DISEASES AND DISORDERS OF THE RESPIRATORY SYSTEM,2,Moderate,Minor,Surgical,Medicare,Medicare,,,,false,42621.75,16084.81
New York City,Kings,7001037,001320,University Hospital of Brooklyn,50 to 69,112,M,Black/African American,Not Span/Hispanic,4,Elective,Home or Self Care,2019,SYM017,ABNORMAL FINDINGS WITHOUT DIAGNOSIS,RES008,"LUNG, PLEURA, OR DIAPHRAGM RESECTION (OPEN AND THORACOSCOPIC)",120,MAJOR RESPIRATORY & CHEST PROCEDURES,04,DISEASES AND DISORDERS OF THE RESPIRATORY SYSTEM,2,Moderate,Minor,Surgical,Private Health Insurance,Self-Pay,,,,false,82771,49632.79
Long Island,Nassau,2908000,000511,NYU Langone Hospital-Long Island,50 to 69,119,M,White,Not Span/Hispanic,5,Elective,Home w/ Home Health Services,2019,NEO022,RESPIRATORY CANCERS,RES008,"LUNG, PLEURA, OR DIAPHRAGM RESECTION (OPEN AND THORACOSCOPIC)",120,MAJOR RESPIRATORY & CHEST PROCEDURES,04,DISEASES AND DISORDERS OF THE RESPIRATORY SYSTEM,3,Major,Major,Surgical,Medicare,Medicare,Private Health Insurance,,,false,230425.95,33274.86
New York City,Queens,7003010,001637,New York - Presbyterian/Queens,70 or Older,113,M,Other Race,Not Span/Hispanic,3,Elective,Home or Self Care,2019,NEO022,RESPIRATORY CANCERS,RES008,"LUNG, PLEURA, OR DIAPHRAGM RESECTION (OPEN AND THORACOSCOPIC)",120,MAJOR RESPIRATORY & CHEST PROCEDURES,04,DISEASES AND DISORDERS OF THE RESPIRATORY SYSTEM,2,Moderate,Moderate,Surgical,Medicaid,Self-Pay,,,,false,60099.2,22162.9
New York City,Kings,7002053,001304,NYU Langone Hospital-Brooklyn,70 or Older,112,M,Other Race,Not Span/Hispanic,4,Elective,Home w/ Home Health Services,2019,NEO022,RESPIRATORY CANCERS,RES008,"LUNG, PLEURA, OR DIAPHRAGM RESECTION (OPEN AND THORACOSCOPIC)",120,MAJOR RESPIRATORY & CHEST PROCEDURES,04,DISEASES AND DISORDERS OF THE RESPIRATORY SYSTEM,2,Moderate,Moderate,Surgical,Medicare,Medicaid,,,,false,201051.59,34606.37
New York City,Manhattan,7002024,001456,Mount Sinai Hospital,50 to 69,112,M,Other Race,Spanish/Hispanic,4,Elective,Home or Self Care,2019,NEO022,RESPIRATORY CANCERS,RES008,"LUNG, PLEURA, OR DIAPHRAGM RESECTION (OPEN AND THORACOSCOPIC)",120,MAJOR RESPIRATORY & CHEST PROCEDURES,04,DISEASES AND DISORDERS OF THE RESPIRATORY SYSTEM,3,Major,Major,Surgical,Medicaid,Medicaid,Self-Pay,,,false,104189.01,29363.62
New York City,Manhattan,7002053,001463,NYU Langone Hospitals,70 or Older,103,F,White,Not Span/Hispanic,3,Elective,Home or Self Care,2019,NEO022,RESPIRATORY CANCERS,RES008,"LUNG, PLEURA, OR DIAPHRAGM RESECTION (OPEN AND THORACOSCOPIC)",120,MAJOR RESPIRATORY & CHEST PROCEDURES,04,DISEASES AND DISORDERS OF THE RESPIRATORY SYSTEM,2,Moderate,Moderate,Surgical,Medicare,Medicaid,,,,false,170721.21,29743.33