Hospital Service Area,Hospital County,Operating Certificate Number,Permanent Facility Id,Facility Name,Age Group,Zip Code - 3 digits,Gender,Race,Ethnicity,Length of Stay,Type of Admission,Patient Disposition,Discharge Year,CCS Diagnosis Code,CCS Diagnosis Description,CCS Procedure Code,CCS Procedure Description,APR DRG Code,APR DRG Description,APR MDC Code,APR MDC Description,APR Severity of Illness Code,APR Severity of Illness Description,APR Risk of Mortality,APR Medical Surgical Description,Payment Typology 1,Payment Typology 2,Payment Typology 3,Birth Weight,Abortion Edit Indicator,Emergency Department Indicator,Total Charges,Total Costs
New York City,Manhattan,7002009,001445,Harlem Hospital Center,50 to 69,100,F,Black/African American,Not Span/Hispanic,16,Emergency,Short-term Hospital,2018,RSP017,POSTPROCEDURAL OR POSTOPERATIVE RESPIRATORY SYSTEM COMPLICATION,ESA003,MECHANICAL VENTILATION,121,OTHER RESPIRATORY & CHEST PROCEDURES,04,DISEASES AND DISORDERS OF THE RESPIRATORY SYSTEM,4,Extreme,Extreme,Surgical,Medicare,Medicaid,,,,true,106190.21,78913.24
New York City,Queens,7003004,001630,Long Island Jewish Medical Center,70 or Older,114,M,Other Race,Not Span/Hispanic,1,Elective,Home or Self Care,2018,NEO022,RESPIRATORY CANCERS,RES012,RELEASE OF LUNG AND PLEURA,121,OTHER RESPIRATORY & CHEST PROCEDURES,04,DISEASES AND DISORDERS OF THE RESPIRATORY SYSTEM,1,Minor,Minor,Surgical,Private Health Insurance,Self-Pay,,,,false,34994.93,7536.27
Hudson Valley,Dutchess,1302001,000181,Vassar Brothers Medical Center,30 to 49,125,F,White,Not Span/Hispanic,5,Elective,Home or Self Care,2018,RSP016,OTHER SPECIFIED AND UNSPECIFIED LOWER RESPIRATORY DISEASE,RES002,"LUNG, PLEURA, OR DIAPHRAGM BIOPSY (NON-ENDOSCOPIC)",121,OTHER RESPIRATORY & CHEST PROCEDURES,04,DISEASES AND DISORDERS OF THE RESPIRATORY SYSTEM,2,Moderate,Minor,Surgical,Medicaid,,,,,false,52295.85,18237.22
New York City,Manhattan,7002054,001458,New York-Presbyterian Hospital - New York Weill Cornell Center,30 to 49,OOS,M,White,Not Span/Hispanic,4,Elective,Home or Self Care,2018,NEO070,SECONDARY MALIGNANCIES,RES008,"LUNG, PLEURA, OR DIAPHRAGM RESECTION (OPEN AND THORACOSCOPIC)",121,OTHER RESPIRATORY & CHEST PROCEDURES,04,DISEASES AND DISORDERS OF THE RESPIRATORY SYSTEM,3,Major,Major,Surgical,Blue Cross/Blue Shield,Self-Pay,,,,false,126585.65,48185.13
Hudson Valley,Rockland,4329000,000779,Good Samaritan Hospital of Suffern,50 to 69,109,F,White,Not Span/Hispanic,3,Elective,Home w/ Home Health Services,2018,NEO022,RESPIRATORY CANCERS,RES002,"LUNG, PLEURA, OR DIAPHRAGM BIOPSY (NON-ENDOSCOPIC)",121,OTHER RESPIRATORY & CHEST PROCEDURES,04,DISEASES AND DISORDERS OF THE RESPIRATORY SYSTEM,2,Moderate,Minor,Surgical,Blue Cross/Blue Shield,,,,,false,119116.55,18481.46
New York City,Manhattan,7002054,001464,New York-Presbyterian Hospital - Columbia Presbyterian Center,70 or Older,109,M,Other Race,Not Span/Hispanic,1,Elective,Home or Self Care,2018,RSP016,OTHER SPECIFIED AND UNSPECIFIED LOWER RESPIRATORY DISEASE,RES008,"LUNG, PLEURA, OR DIAPHRAGM RESECTION (OPEN AND THORACOSCOPIC)",121,OTHER RESPIRATORY & CHEST PROCEDURES,04,DISEASES AND DISORDERS OF THE RESPIRATORY SYSTEM,1,Minor,Minor,Surgical,Blue Cross/Blue Shield,Medicare,Self-Pay,,,false,26029.24,4837.16
New York City,Manhattan,7002054,001464,New York-Presbyterian Hospital - Columbia Presbyterian Center,70 or Older,100,F,Other Race,Not Span/Hispanic,2,Elective,Home w/ Home Health Services,2018,SYM017,ABNORMAL FINDINGS WITHOUT DIAGNOSIS,RES002,"LUNG, PLEURA, OR DIAPHRAGM BIOPSY (NON-ENDOSCOPIC)",121,OTHER RESPIRATORY & CHEST PROCEDURES,04,DISEASES AND DISORDERS OF THE RESPIRATORY SYSTEM,2,Moderate,Minor,Surgical,Medicare,Medicare,Medicaid,,,false,76884.72,17366.75
Long Island,Suffolk,5151001,000245,Stony Brook University Hospital,30 to 49,119,M,White,Not Span/Hispanic,1,Urgent,Home or Self Care,2018,RSP007,OTHER SPECIFIED AND UNSPECIFIED UPPER RESPIRATORY DISEASE,RES009,BRONCHOSCOPIC EXCISION AND FULGURATION,121,OTHER RESPIRATORY & CHEST PROCEDURES,04,DISEASES AND DISORDERS OF THE RESPIRATORY SYSTEM,1,Minor,Moderate,Surgical,Medicaid,Medicaid,,,,false,22257.63,8224.03
Central NY,Oneida,3201002,000589,"Rome Memorial Hospital, Inc",50 to 69,134,F,White,Not Span/Hispanic,5,Emergency,Skilled Nursing Home,2018,CIR013,ACUTE PULMONARY EMBOLISM,GNR004,ENDOSCOPIC CONTROL OF BLEEDING,121,OTHER RESPIRATORY & CHEST PROCEDURES,04,DISEASES AND DISORDERS OF THE RESPIRATORY SYSTEM,3,Major,Major,Surgical,Medicare,Medicaid,,,,true,44279.52,13280.75
Finger Lakes,Monroe,2701003,000411,Rochester General Hospital,70 or Older,144,M,White,Not Span/Hispanic,3,Urgent,Home or Self Care,2018,INJ010,"INTERNAL ORGAN INJURY, INITIAL ENCOUNTER",RES012,RELEASE OF LUNG AND PLEURA,121,OTHER RESPIRATORY & CHEST PROCEDURES,04,DISEASES AND DISORDERS OF THE RESPIRATORY SYSTEM,2,Moderate,Minor,Surgical,Medicare,,,,,false,20449.74,8107.14
New York City,Manhattan,7002054,001464,New York-Presbyterian Hospital - Columbia Presbyterian Center,70 or Older,OOS,F,Other Race,Not Span/Hispanic,5,Urgent,Home w/ Home Health Services,2018,NEO070,SECONDARY MALIGNANCIES,RES010,TRACHEOSTOMY,121,OTHER RESPIRATORY & CHEST PROCEDURES,04,DISEASES AND DISORDERS OF THE RESPIRATORY SYSTEM,1,Minor,Minor,Surgical,Medicare,Private Health Insurance,Self-Pay,,,false,50853.13,11038.33
New York City,Kings,7002053,001304,NYU Langone Hospital-Brooklyn,70 or Older,112,M,Other Race,Spanish/Hispanic,4,Elective,Home or Self Care,2018,NEO070,SECONDARY MALIGNANCIES,RES002,"LUNG, PLEURA, OR DIAPHRAGM BIOPSY (NON-ENDOSCOPIC)",121,OTHER RESPIRATORY & CHEST PROCEDURES,04,DISEASES AND DISORDERS OF THE RESPIRATORY SYSTEM,1,Minor,Minor,Surgical,Medicare,,,,,false,76362.35,19356.78
New York City,Manhattan,7002024,001456,Mount Sinai Hospital,50 to 69,105,F,White,Not Span/Hispanic,1,Elective,Home or Self Care,2018,NEO022,RESPIRATORY CANCERS,RES008,"LUNG, PLEURA, OR DIAPHRAGM RESECTION (OPEN AND THORACOSCOPIC)",121,OTHER RESPIRATORY & CHEST PROCEDURES,04,DISEASES AND DISORDERS OF THE RESPIRATORY SYSTEM,1,Minor,Minor,Surgical,Medicare,Private Health Insurance,Self-Pay,,,false,26805.06,8764.22
Hudson Valley,Westchester,5902001,001045,White Plains Hospital Center,50 to 69,105,F,Black/African American,Not Span/Hispanic,2,Elective,Home w/ Home Health Services,2018,NEO022,RESPIRATORY CANCERS,RES002,"LUNG, PLEURA, OR DIAPHRAGM BIOPSY (NON-ENDOSCOPIC)",121,OTHER RESPIRATORY & CHEST PROCEDURES,04,DISEASES AND DISORDERS OF THE RESPIRATORY SYSTEM,1,Minor,Minor,Surgical,Medicaid,,,,,false,58991,11281.29
New York City,Manhattan,7002017,001450,Lenox Hill Hospital,70 or Older,100,F,White,Not Span/Hispanic,2,Elective,Home or Self Care,2018,SYM017,ABNORMAL FINDINGS WITHOUT DIAGNOSIS,RES008,"LUNG, PLEURA, OR DIAPHRAGM RESECTION (OPEN AND THORACOSCOPIC)",121,OTHER RESPIRATORY & CHEST PROCEDURES,04,DISEASES AND DISORDERS OF THE RESPIRATORY SYSTEM,2,Moderate,Minor,Surgical,Medicare,Medicare,,,,false,70160.23,19608.09
Capital/Adirond,Albany,0101000,000001,Albany Medical Center Hospital,70 or Older,121,M,White,Not Span/Hispanic,1,Elective,Home or Self Care,2018,NEO022,RESPIRATORY CANCERS,RES008,"LUNG, PLEURA, OR DIAPHRAGM RESECTION (OPEN AND THORACOSCOPIC)",121,OTHER RESPIRATORY & CHEST PROCEDURES,04,DISEASES AND DISORDERS OF THE RESPIRATORY SYSTEM,1,Minor,Minor,Surgical,Private Health Insurance,,,,,false,26849.51,13587.75
Capital/Adirond,Albany,0101000,000001,Albany Medical Center Hospital,50 to 69,124,M,White,Unknown,11,Emergency,Expired,2018,RSP012,RESPIRATORY FAILURE; INSUFFICIENCY; ARREST,RES008,"LUNG, PLEURA, OR DIAPHRAGM RESECTION (OPEN AND THORACOSCOPIC)",121,OTHER RESPIRATORY & CHEST PROCEDURES,04,DISEASES AND DISORDERS OF THE RESPIRATORY SYSTEM,4,Extreme,Extreme,Surgical,Blue Cross/Blue Shield,,,,,true,213955.98,61674.01
New York City,Manhattan,7002054,001464,New York-Presbyterian Hospital - Columbia Presbyterian Center,50 to 69,110,M,Other Race,Not Span/Hispanic,2,Elective,Home or Self Care,2018,SYM017,ABNORMAL FINDINGS WITHOUT DIAGNOSIS,RES008,"LUNG, PLEURA, OR DIAPHRAGM RESECTION (OPEN AND THORACOSCOPIC)",121,OTHER RESPIRATORY & CHEST PROCEDURES,04,DISEASES AND DISORDERS OF THE RESPIRATORY SYSTEM,1,Minor,Minor,Surgical,Medicare,Private Health Insurance,Self-Pay,,,false,97258,21367.58
New York City,Kings,7001016,001301,Kings County Hospital Center,18 to 29,112,M,Black/African American,Not Span/Hispanic,6,Emergency,Home or Self Care,2018,INJ010,"INTERNAL ORGAN INJURY, INITIAL ENCOUNTER",RES011,DIAPHRAGMATIC HERNIA REPAIR,121,OTHER RESPIRATORY & CHEST PROCEDURES,04,DISEASES AND DISORDERS OF THE RESPIRATORY SYSTEM,3,Major,Major,Surgical,Medicaid,Medicaid,,,,true,59324.84,42142.05
New York City,Manhattan,7002054,001464,New York-Presbyterian Hospital - Columbia Presbyterian Center,70 or Older,101,F,Other Race,Not Span/Hispanic,6,Elective,Home w/ Home Health Services,2018,RSP016,OTHER SPECIFIED AND UNSPECIFIED LOWER RESPIRATORY DISEASE,RES008,"LUNG, PLEURA, OR DIAPHRAGM RESECTION (OPEN AND THORACOSCOPIC)",121,OTHER RESPIRATORY & CHEST PROCEDURES,04,DISEASES AND DISORDERS OF THE RESPIRATORY SYSTEM,2,Moderate,Moderate,Surgical,Medicare,Private Health Insurance,Self-Pay,,,false,115337.73,26936.57
Long Island,Nassau,2908000,000511,NYU Langone Hospital-Long Island,70 or Older,110,M,White,Not Span/Hispanic,3,Emergency,Home w/ Home Health Services,2018,NEO022,RESPIRATORY CANCERS,RES002,"LUNG, PLEURA, OR DIAPHRAGM BIOPSY (NON-ENDOSCOPIC)",121,OTHER RESPIRATORY & CHEST PROCEDURES,04,DISEASES AND DISORDERS OF THE RESPIRATORY SYSTEM,2,Moderate,Moderate,Surgical,Medicare,Medicare,Private Health Insurance,,,true,88728.79,11387.55
New York City,Manhattan,7002017,001450,Lenox Hill Hospital,50 to 69,112,F,White,Spanish/Hispanic,4,Urgent,Home w/ Home Health Services,2018,NEO022,RESPIRATORY CANCERS,RES008,"LUNG, PLEURA, OR DIAPHRAGM RESECTION (OPEN AND THORACOSCOPIC)",121,OTHER RESPIRATORY & CHEST PROCEDURES,04,DISEASES AND DISORDERS OF THE RESPIRATORY SYSTEM,1,Minor,Minor,Surgical,Blue Cross/Blue Shield,,,,,false,88228.62,20065.98
New York City,Manhattan,7002020,001453,Memorial Hospital for Cancer and Allied Diseases,50 to 69,138,M,White,Not Span/Hispanic,2,Elective,Home or Self Care,2018,NEO022,RESPIRATORY CANCERS,RES008,"LUNG, PLEURA, OR DIAPHRAGM RESECTION (OPEN AND THORACOSCOPIC)",121,OTHER RESPIRATORY & CHEST PROCEDURES,04,DISEASES AND DISORDERS OF THE RESPIRATORY SYSTEM,2,Moderate,Minor,Surgical,Blue Cross/Blue Shield,,,,,false,48967.93,19231.19
Capital/Adirond,Albany,0101004,000005,St. Peter's Hospital,50 to 69,120,F,White,Not Span/Hispanic,10,Urgent,Home or Self Care,2018,RSP011,"PLEURISY, PLEURAL EFFUSION AND PULMONARY COLLAPSE",RES012,RELEASE OF LUNG AND PLEURA,121,OTHER RESPIRATORY & CHEST PROCEDURES,04,DISEASES AND DISORDERS OF THE RESPIRATORY SYSTEM,4,Extreme,Extreme,Surgical,Medicare,Medicare,,,,false,95771.21,34469.2
New York City,Manhattan,7002024,001456,Mount Sinai Hospital,18 to 29,100,M,Black/African American,Not Span/Hispanic,9,Emergency,Home or Self Care,2018,INF001,TUBERCULOSIS,RES001,BRONCHOSCOPY (DIAGNOSTIC),121,OTHER RESPIRATORY & CHEST PROCEDURES,04,DISEASES AND DISORDERS OF THE RESPIRATORY SYSTEM,4,Extreme,Extreme,Surgical,Private Health Insurance,Medicaid,Self-Pay,,,true,139020.14,32622.98
Western NY,Erie,1401008,000213,Mercy Hospital of Buffalo,50 to 69,140,F,White,Not Span/Hispanic,3,Elective,Home or Self Care,2018,RSP011,"PLEURISY, PLEURAL EFFUSION AND PULMONARY COLLAPSE",RES008,"LUNG, PLEURA, OR DIAPHRAGM RESECTION (OPEN AND THORACOSCOPIC)",121,OTHER RESPIRATORY & CHEST PROCEDURES,04,DISEASES AND DISORDERS OF THE RESPIRATORY SYSTEM,2,Moderate,Moderate,Surgical,Medicaid,Medicaid,,,,false,27144.41,11481.85
New York City,Queens,7003004,001630,Long Island Jewish Medical Center,70 or Older,104,F,Other Race,Not Span/Hispanic,2,Elective,Home or Self Care,2018,NEO073,BENIGN NEOPLASMS,RES008,"LUNG, PLEURA, OR DIAPHRAGM RESECTION (OPEN AND THORACOSCOPIC)",121,OTHER RESPIRATORY & CHEST PROCEDURES,04,DISEASES AND DISORDERS OF THE RESPIRATORY SYSTEM,1,Minor,Minor,Surgical,Medicare,Medicare,Self-Pay,,,false,51854.99,16032.7
Capital/Adirond,Albany,0101000,000001,Albany Medical Center Hospital,70 or Older,121,F,White,Not Span/Hispanic,1,Elective,Home or Self Care,2018,NEO022,RESPIRATORY CANCERS,RES008,"LUNG, PLEURA, OR DIAPHRAGM RESECTION (OPEN AND THORACOSCOPIC)",121,OTHER RESPIRATORY & CHEST PROCEDURES,04,DISEASES AND DISORDERS OF THE RESPIRATORY SYSTEM,1,Minor,Minor,Surgical,Medicare,,,,,false,22489.6,8015.04
Capital/Adirond,Albany,0101004,000005,St. Peter's Hospital,18 to 29,125,M,White,Not Span/Hispanic,7,Urgent,Home or Self Care,2018,RSP014,PNEUMOTHORAX,RES008,"LUNG, PLEURA, OR DIAPHRAGM RESECTION (OPEN AND THORACOSCOPIC)",121,OTHER RESPIRATORY & CHEST PROCEDURES,04,DISEASES AND DISORDERS OF THE RESPIRATORY SYSTEM,1,Minor,Minor,Surgical,Medicaid,Medicaid,,,,false,36262.25,15908.16
New York City,Kings,7001020,001305,Maimonides Medical Center,50 to 69,112,M,Black/African American,Not Span/Hispanic,5,Emergency,Skilled Nursing Home,2018,RSP017,POSTPROCEDURAL OR POSTOPERATIVE RESPIRATORY SYSTEM COMPLICATION,RES014,"RESPIRATORY SYSTEM PROCEDURES, NEC",121,OTHER RESPIRATORY & CHEST PROCEDURES,04,DISEASES AND DISORDERS OF THE RESPIRATORY SYSTEM,3,Major,Major,Surgical,Medicare,Medicaid,Self-Pay,,,false,59450.02,16163.98
New York City,Manhattan,7002054,001458,New York-Presbyterian Hospital - New York Weill Cornell Center,70 or Older,100,F,Black/African American,Not Span/Hispanic,21,Emergency,Home w/ Home Health Services,2018,NEO022,RESPIRATORY CANCERS,RES009,BRONCHOSCOPIC EXCISION AND FULGURATION,121,OTHER RESPIRATORY & CHEST PROCEDURES,04,DISEASES AND DISORDERS OF THE RESPIRATORY SYSTEM,2,Moderate,Moderate,Surgical,Medicare,Medicare,Self-Pay,,,true,356159.32,78866.46
Hudson Valley,Westchester,5902001,001045,White Plains Hospital Center,70 or Older,105,M,Other Race,Not Span/Hispanic,2,Elective,Home w/ Home Health Services,2018,RSP011,"PLEURISY, PLEURAL EFFUSION AND PULMONARY COLLAPSE",RES002,"LUNG, PLEURA, OR DIAPHRAGM BIOPSY (NON-ENDOSCOPIC)",121,OTHER RESPIRATORY & CHEST PROCEDURES,04,DISEASES AND DISORDERS OF THE RESPIRATORY SYSTEM,1,Minor,Minor,Surgical,Private Health Insurance,Medicare,,,,false,43961,9739.54
Finger Lakes,Monroe,2701005,000413,Strong Memorial Hospital,70 or Older,133,F,Other Race,Unknown,3,Elective,Home or Self Care,2018,NEO022,RESPIRATORY CANCERS,RES002,"LUNG, PLEURA, OR DIAPHRAGM BIOPSY (NON-ENDOSCOPIC)",121,OTHER RESPIRATORY & CHEST PROCEDURES,04,DISEASES AND DISORDERS OF THE RESPIRATORY SYSTEM,3,Major,Major,Surgical,Medicare,,,,,false,37098.9,16495.56
New York City,Richmond,7004003,001740,Staten Island University Hosp-North,70 or Older,103,M,White,Not Span/Hispanic,21,Emergency,Home w/ Home Health Services,2018,NEO022,RESPIRATORY CANCERS,RES002,"LUNG, PLEURA, OR DIAPHRAGM BIOPSY (NON-ENDOSCOPIC)",121,OTHER RESPIRATORY & CHEST PROCEDURES,04,DISEASES AND DISORDERS OF THE RESPIRATORY SYSTEM,4,Extreme,Extreme,Surgical,Medicare,Medicare,,,,true,272969.08,69187.9
New York City,Manhattan,7002020,001453,Memorial Hospital for Cancer and Allied Diseases,50 to 69,112,F,White,Not Span/Hispanic,2,Elective,Home or Self Care,2018,NEO022,RESPIRATORY CANCERS,RES008,"LUNG, PLEURA, OR DIAPHRAGM RESECTION (OPEN AND THORACOSCOPIC)",121,OTHER RESPIRATORY & CHEST PROCEDURES,04,DISEASES AND DISORDERS OF THE RESPIRATORY SYSTEM,2,Moderate,Moderate,Surgical,Private Health Insurance,Miscellaneous/Other,,,,false,78717.65,31098.91
Finger Lakes,Monroe,2701005,000413,Strong Memorial Hospital,50 to 69,131,M,White,Not Span/Hispanic,4,Elective,Home or Self Care,2018,NEO070,SECONDARY MALIGNANCIES,LYM001,LYMPH NODE BIOPSY,121,OTHER RESPIRATORY & CHEST PROCEDURES,04,DISEASES AND DISORDERS OF THE RESPIRATORY SYSTEM,1,Minor,Minor,Surgical,Blue Cross/Blue Shield,Self-Pay,,,,false,34559.3,16284.65
Long Island,Suffolk,5151001,000245,Stony Brook University Hospital,50 to 69,117,M,White,Not Span/Hispanic,16,Emergency,Home or Self Care,2018,INF003,BACTERIAL INFECTIONS,RES012,RELEASE OF LUNG AND PLEURA,121,OTHER RESPIRATORY & CHEST PROCEDURES,04,DISEASES AND DISORDERS OF THE RESPIRATORY SYSTEM,4,Extreme,Extreme,Surgical,Blue Cross/Blue Shield,Blue Cross/Blue Shield,,,,true,217651.12,74969.95
New York City,Manhattan,7002053,001463,NYU Langone Hospitals,18 to 29,112,M,Other Race,Not Span/Hispanic,4,Emergency,Home or Self Care,2018,RSP014,PNEUMOTHORAX,RES008,"LUNG, PLEURA, OR DIAPHRAGM RESECTION (OPEN AND THORACOSCOPIC)",121,OTHER RESPIRATORY & CHEST PROCEDURES,04,DISEASES AND DISORDERS OF THE RESPIRATORY SYSTEM,2,Moderate,Minor,Surgical,Private Health Insurance,,,,,true,80573.7,20536.79
Western NY,Erie,1401010,000216,Roswell Park Cancer Institute,50 to 69,140,M,White,Not Span/Hispanic,2,Urgent,Home or Self Care,2018,SYM013,RESPIRATORY SIGNS AND SYMPTOMS,RES009,BRONCHOSCOPIC EXCISION AND FULGURATION,121,OTHER RESPIRATORY & CHEST PROCEDURES,04,DISEASES AND DISORDERS OF THE RESPIRATORY SYSTEM,1,Minor,Minor,Surgical,Blue Cross/Blue Shield,,,,,false,14301.31,5851.14
Finger Lakes,Monroe,2701003,000411,Rochester General Hospital,30 to 49,148,M,White,Not Span/Hispanic,14,Emergency,Home or Self Care,2018,RSP016,OTHER SPECIFIED AND UNSPECIFIED LOWER RESPIRATORY DISEASE,RES002,"LUNG, PLEURA, OR DIAPHRAGM BIOPSY (NON-ENDOSCOPIC)",121,OTHER RESPIRATORY & CHEST PROCEDURES,04,DISEASES AND DISORDERS OF THE RESPIRATORY SYSTEM,3,Major,Moderate,Surgical,Blue Cross/Blue Shield,,,,,true,60235.33,29622.75
Capital/Adirond,Albany,0101004,000005,St. Peter's Hospital,70 or Older,124,M,White,Not Span/Hispanic,4,Elective,Home w/ Home Health Services,2018,RSP016,OTHER SPECIFIED AND UNSPECIFIED LOWER RESPIRATORY DISEASE,RES008,"LUNG, PLEURA, OR DIAPHRAGM RESECTION (OPEN AND THORACOSCOPIC)",121,OTHER RESPIRATORY & CHEST PROCEDURES,04,DISEASES AND DISORDERS OF THE RESPIRATORY SYSTEM,3,Major,Moderate,Surgical,Medicare,Private Health Insurance,,,,false,48790.55,17556.26
Finger Lakes,Monroe,2701003,000411,Rochester General Hospital,70 or Older,144,M,White,Not Span/Hispanic,1,Elective,Home w/ Home Health Services,2018,NEO022,RESPIRATORY CANCERS,RES002,"LUNG, PLEURA, OR DIAPHRAGM BIOPSY (NON-ENDOSCOPIC)",121,OTHER RESPIRATORY & CHEST PROCEDURES,04,DISEASES AND DISORDERS OF THE RESPIRATORY SYSTEM,3,Major,Moderate,Surgical,Medicare,,,,,false,12310.54,4722.44
Long Island,Nassau,2908000,000511,NYU Langone Hospital-Long Island,70 or Older,115,M,White,Not Span/Hispanic,1,Elective,Home or Self Care,2018,NEO022,RESPIRATORY CANCERS,RES008,"LUNG, PLEURA, OR DIAPHRAGM RESECTION (OPEN AND THORACOSCOPIC)",121,OTHER RESPIRATORY & CHEST PROCEDURES,04,DISEASES AND DISORDERS OF THE RESPIRATORY SYSTEM,1,Minor,Minor,Surgical,Medicare,Private Health Insurance,,,,false,109138.84,16130.51
Long Island,Nassau,2951001,000541,North Shore University Hospital,50 to 69,115,M,White,Not Span/Hispanic,27,Emergency,Inpatient Rehabilitation Facility,2018,RSP010,ASPIRATION PNEUMONITIS,RES012,RELEASE OF LUNG AND PLEURA,121,OTHER RESPIRATORY & CHEST PROCEDURES,04,DISEASES AND DISORDERS OF THE RESPIRATORY SYSTEM,4,Extreme,Major,Surgical,Blue Cross/Blue Shield,,,,,true,367717.19,68887.67
Hudson Valley,Orange,3523000,000699,Garnet Health Medical Center,50 to 69,109,F,White,Not Span/Hispanic,2,Elective,Home or Self Care,2018,NEO022,RESPIRATORY CANCERS,RES002,"LUNG, PLEURA, OR DIAPHRAGM BIOPSY (NON-ENDOSCOPIC)",121,OTHER RESPIRATORY & CHEST PROCEDURES,04,DISEASES AND DISORDERS OF THE RESPIRATORY SYSTEM,1,Minor,Minor,Surgical,Miscellaneous/Other,,,,,false,31254.7,10453.39
Long Island,Nassau,2908000,000511,NYU Langone Hospital-Long Island,70 or Older,115,M,White,Not Span/Hispanic,3,Emergency,Home w/ Home Health Services,2018,RSP011,"PLEURISY, PLEURAL EFFUSION AND PULMONARY COLLAPSE",RES002,"LUNG, PLEURA, OR DIAPHRAGM BIOPSY (NON-ENDOSCOPIC)",121,OTHER RESPIRATORY & CHEST PROCEDURES,04,DISEASES AND DISORDERS OF THE RESPIRATORY SYSTEM,2,Moderate,Moderate,Surgical,Medicare,Medicare,Private Health Insurance,,,true,78123.73,12329.71
New York City,Kings,7001021,001306,New York - Presbyterian Brooklyn Methodist Hospital,50 to 69,112,F,Black/African American,Not Span/Hispanic,2,Elective,Home w/ Home Health Services,2018,RSP016,OTHER SPECIFIED AND UNSPECIFIED LOWER RESPIRATORY DISEASE,RES002,"LUNG, PLEURA, OR DIAPHRAGM BIOPSY (NON-ENDOSCOPIC)",121,OTHER RESPIRATORY & CHEST PROCEDURES,04,DISEASES AND DISORDERS OF THE RESPIRATORY SYSTEM,2,Moderate,Minor,Surgical,"Managed Care, Unspecified",Medicaid,Self-Pay,,,false,33039.56,13754.21
Western NY,Erie,1401010,000216,Roswell Park Cancer Institute,70 or Older,142,F,White,Not Span/Hispanic,1,Elective,Home or Self Care,2018,NEO073,BENIGN NEOPLASMS,RES008,"LUNG, PLEURA, OR DIAPHRAGM RESECTION (OPEN AND THORACOSCOPIC)",121,OTHER RESPIRATORY & CHEST PROCEDURES,04,DISEASES AND DISORDERS OF THE RESPIRATORY SYSTEM,2,Moderate,Minor,Surgical,"Managed Care, Unspecified",,,,,false,27817.78,10219.09
Western NY,Erie,1401010,000216,Roswell Park Cancer Institute,50 to 69,147,M,White,Not Span/Hispanic,2,Elective,Home or Self Care,2018,NEO022,RESPIRATORY CANCERS,RES008,"LUNG, PLEURA, OR DIAPHRAGM RESECTION (OPEN AND THORACOSCOPIC)",121,OTHER RESPIRATORY & CHEST PROCEDURES,04,DISEASES AND DISORDERS OF THE RESPIRATORY SYSTEM,2,Moderate,Minor,Surgical,Medicare,,,,,false,47113.19,16617.89
Western NY,Erie,1401010,000216,Roswell Park Cancer Institute,70 or Older,140,F,White,Not Span/Hispanic,9,Urgent,Home w/ Home Health Services,2018,RSP012,RESPIRATORY FAILURE; INSUFFICIENCY; ARREST,RES010,TRACHEOSTOMY,121,OTHER RESPIRATORY & CHEST PROCEDURES,04,DISEASES AND DISORDERS OF THE RESPIRATORY SYSTEM,3,Major,Major,Surgical,"Managed Care, Unspecified",,,,,false,86155.49,26862.03
New York City,Manhattan,7002054,001464,New York-Presbyterian Hospital - Columbia Presbyterian Center,50 to 69,107,F,White,Spanish/Hispanic,2,Urgent,Skilled Nursing Home,2018,RSP007,OTHER SPECIFIED AND UNSPECIFIED UPPER RESPIRATORY DISEASE,RES014,"RESPIRATORY SYSTEM PROCEDURES, NEC",121,OTHER RESPIRATORY & CHEST PROCEDURES,04,DISEASES AND DISORDERS OF THE RESPIRATORY SYSTEM,1,Minor,Minor,Surgical,Medicaid,Self-Pay,,,,false,40616.6,12459.06
Long Island,Suffolk,5123000,000885,Long Island Community Hospital,70 or Older,117,F,White,Not Span/Hispanic,4,Elective,Home or Self Care,2018,NEO022,RESPIRATORY CANCERS,RES002,"LUNG, PLEURA, OR DIAPHRAGM BIOPSY (NON-ENDOSCOPIC)",121,OTHER RESPIRATORY & CHEST PROCEDURES,04,DISEASES AND DISORDERS OF THE RESPIRATORY SYSTEM,2,Moderate,Minor,Surgical,Medicare,Medicare,Private Health Insurance,,,false,65145.42,13631.71
Hudson Valley,Orange,3523000,000699,Garnet Health Medical Center,50 to 69,127,M,White,Not Span/Hispanic,15,Urgent,Home w/ Home Health Services,2018,RSP017,POSTPROCEDURAL OR POSTOPERATIVE RESPIRATORY SYSTEM COMPLICATION,RES008,"LUNG, PLEURA, OR DIAPHRAGM RESECTION (OPEN AND THORACOSCOPIC)",121,OTHER RESPIRATORY & CHEST PROCEDURES,04,DISEASES AND DISORDERS OF THE RESPIRATORY SYSTEM,3,Major,Moderate,Surgical,Medicaid,,,,,false,127811.53,38684.15
New York City,Manhattan,7002001,001438,Bellevue Hospital Center,70 or Older,100,M,Other Race,Not Span/Hispanic,14,Emergency,Skilled Nursing Home,2018,INJ010,"INTERNAL ORGAN INJURY, INITIAL ENCOUNTER",RES008,"LUNG, PLEURA, OR DIAPHRAGM RESECTION (OPEN AND THORACOSCOPIC)",121,OTHER RESPIRATORY & CHEST PROCEDURES,04,DISEASES AND DISORDERS OF THE RESPIRATORY SYSTEM,2,Moderate,Moderate,Surgical,Medicare,Private Health Insurance,,,,false,111446.19,74067.14
New York City,Manhattan,7002054,001464,New York-Presbyterian Hospital - Columbia Presbyterian Center,50 to 69,117,M,White,Not Span/Hispanic,1,Elective,Home or Self Care,2018,NEO022,RESPIRATORY CANCERS,RES008,"LUNG, PLEURA, OR DIAPHRAGM RESECTION (OPEN AND THORACOSCOPIC)",121,OTHER RESPIRATORY & CHEST PROCEDURES,04,DISEASES AND DISORDERS OF THE RESPIRATORY SYSTEM,2,Moderate,Minor,Surgical,Private Health Insurance,Self-Pay,,,,false,81508.29,21612.68