Hospital Service Area,Hospital County,Operating Certificate Number,Permanent Facility Id,Facility Name,Age Group,Zip Code - 3 digits,Gender,Race,Ethnicity,Length of Stay,Type of Admission,Patient Disposition,Discharge Year,CCS Diagnosis Code,CCS Diagnosis Description,CCS Procedure Code,CCS Procedure Description,APR DRG Code,APR DRG Description,APR MDC Code,APR MDC Description,APR Severity of Illness Code,APR Severity of Illness Description,APR Risk of Mortality,APR Medical Surgical Description,Payment Typology 1,Payment Typology 2,Payment Typology 3,Birth Weight,Abortion Edit Indicator,Emergency Department Indicator,Total Charges,Total Costs
New York City,Kings,7002053,001304,NYU Langone Hospital-Brooklyn,30 to 49,112,M,Black/African American,Not Span/Hispanic,2,Elective,Home or Self Care,2019,NEO073,BENIGN NEOPLASMS,RES008,"LUNG, PLEURA, OR DIAPHRAGM RESECTION (OPEN AND THORACOSCOPIC)",121,OTHER RESPIRATORY & CHEST PROCEDURES,04,DISEASES AND DISORDERS OF THE RESPIRATORY SYSTEM,2,Moderate,Minor,Surgical,Private Health Insurance,,,,,false,85704.06,16715.89
New York City,Kings,7002053,001304,NYU Langone Hospital-Brooklyn,50 to 69,112,M,Other Race,Not Span/Hispanic,22,Emergency,Home or Self Care,2019,NEO067,MESOTHELIOMA,RES012,RELEASE OF LUNG AND PLEURA,121,OTHER RESPIRATORY & CHEST PROCEDURES,04,DISEASES AND DISORDERS OF THE RESPIRATORY SYSTEM,4,Extreme,Extreme,Surgical,Private Health Insurance,,,,,true,477166.43,158296.73
New York City,Kings,7002053,001304,NYU Langone Hospital-Brooklyn,50 to 69,112,M,Other Race,Not Span/Hispanic,5,Emergency,Home or Self Care,2019,RSP008,CHRONIC OBSTRUCTIVE PULMONARY DISEASE AND BRONCHIECTASIS,RES008,"LUNG, PLEURA, OR DIAPHRAGM RESECTION (OPEN AND THORACOSCOPIC)",121,OTHER RESPIRATORY & CHEST PROCEDURES,04,DISEASES AND DISORDERS OF THE RESPIRATORY SYSTEM,2,Moderate,Minor,Surgical,Private Health Insurance,,,,,true,130298.89,35009.91
New York City,Kings,7002053,001304,NYU Langone Hospital-Brooklyn,50 to 69,112,F,Black/African American,Not Span/Hispanic,10,Emergency,Home w/ Home Health Services,2019,RSP017,POSTPROCEDURAL OR POSTOPERATIVE RESPIRATORY SYSTEM COMPLICATION,RES010,TRACHEOSTOMY,121,OTHER RESPIRATORY & CHEST PROCEDURES,04,DISEASES AND DISORDERS OF THE RESPIRATORY SYSTEM,4,Extreme,Extreme,Surgical,Medicare,Medicaid,,,,true,242951.99,91429.55
New York City,Kings,7002053,001304,NYU Langone Hospital-Brooklyn,18 to 29,112,M,White,Not Span/Hispanic,5,Emergency,Home or Self Care,2019,RSP011,"PLEURISY, PLEURAL EFFUSION AND PULMONARY COLLAPSE",RES008,"LUNG, PLEURA, OR DIAPHRAGM RESECTION (OPEN AND THORACOSCOPIC)",121,OTHER RESPIRATORY & CHEST PROCEDURES,04,DISEASES AND DISORDERS OF THE RESPIRATORY SYSTEM,1,Minor,Minor,Surgical,Private Health Insurance,,,,,true,108158.19,26737.84
New York City,Kings,7002053,001304,NYU Langone Hospital-Brooklyn,18 to 29,112,M,White,Spanish/Hispanic,11,Emergency,Home or Self Care,2019,RSP014,PNEUMOTHORAX,RES008,"LUNG, PLEURA, OR DIAPHRAGM RESECTION (OPEN AND THORACOSCOPIC)",121,OTHER RESPIRATORY & CHEST PROCEDURES,04,DISEASES AND DISORDERS OF THE RESPIRATORY SYSTEM,2,Moderate,Moderate,Surgical,Medicaid,,,,,true,132694.02,42429.28
New York City,Kings,7002053,001304,NYU Langone Hospital-Brooklyn,70 or Older,112,F,White,Not Span/Hispanic,3,Emergency,Home or Self Care,2019,NEO022,RESPIRATORY CANCERS,ADM015,ADMINISTRATION OF ANTIBIOTICS,121,OTHER RESPIRATORY & CHEST PROCEDURES,04,DISEASES AND DISORDERS OF THE RESPIRATORY SYSTEM,2,Moderate,Moderate,Surgical,Medicare,Medicaid,,,,true,75449.65,17643.79
New York City,Kings,7002053,001304,NYU Langone Hospital-Brooklyn,50 to 69,112,M,Other Race,Not Span/Hispanic,6,Emergency,Home or Self Care,2019,RSP014,PNEUMOTHORAX,RES008,"LUNG, PLEURA, OR DIAPHRAGM RESECTION (OPEN AND THORACOSCOPIC)",121,OTHER RESPIRATORY & CHEST PROCEDURES,04,DISEASES AND DISORDERS OF THE RESPIRATORY SYSTEM,2,Moderate,Minor,Surgical,Private Health Insurance,,,,,true,100043.59,27323.16
New York City,Kings,7002053,001304,NYU Langone Hospital-Brooklyn,70 or Older,112,M,Other Race,Spanish/Hispanic,4,Emergency,Home w/ Home Health Services,2019,NEO022,RESPIRATORY CANCERS,RES006,OPEN AND THORACOSCOPIC PLEURAL DRAINAGE,121,OTHER RESPIRATORY & CHEST PROCEDURES,04,DISEASES AND DISORDERS OF THE RESPIRATORY SYSTEM,3,Major,Major,Surgical,Medicare,,,,,true,87814,21351.53
New York City,Kings,7002053,001304,NYU Langone Hospital-Brooklyn,30 to 49,112,M,Other Race,Spanish/Hispanic,9,Emergency,Home or Self Care,2019,RSP011,"PLEURISY, PLEURAL EFFUSION AND PULMONARY COLLAPSE",RES012,RELEASE OF LUNG AND PLEURA,121,OTHER RESPIRATORY & CHEST PROCEDURES,04,DISEASES AND DISORDERS OF THE RESPIRATORY SYSTEM,2,Moderate,Minor,Surgical,Private Health Insurance,Medicaid,,,,true,183505.79,44694.11
New York City,Kings,7002053,001304,NYU Langone Hospital-Brooklyn,70 or Older,112,F,White,Not Span/Hispanic,4,Emergency,Home or Self Care,2019,NEO022,RESPIRATORY CANCERS,RES009,BRONCHOSCOPIC EXCISION AND FULGURATION,121,OTHER RESPIRATORY & CHEST PROCEDURES,04,DISEASES AND DISORDERS OF THE RESPIRATORY SYSTEM,1,Minor,Minor,Surgical,Medicare,Medicaid,,,,true,110857.52,25465.28
New York City,Kings,7002053,001304,NYU Langone Hospital-Brooklyn,0 to 17,112,M,Other Race,Not Span/Hispanic,4,Trauma,Home or Self Care,2019,INJ013,"OPEN WOUNDS OF TRUNK, INITIAL ENCOUNTER",GNR005,CONTROL OF BLEEDING (NON-ENDOSCOPIC),121,OTHER RESPIRATORY & CHEST PROCEDURES,04,DISEASES AND DISORDERS OF THE RESPIRATORY SYSTEM,1,Minor,Minor,Surgical,Private Health Insurance,,,,,true,99912.99,31001.78
New York City,Kings,7002053,001304,NYU Langone Hospital-Brooklyn,18 to 29,112,M,Other Race,Not Span/Hispanic,4,Emergency,Home or Self Care,2019,RSP011,"PLEURISY, PLEURAL EFFUSION AND PULMONARY COLLAPSE",RES006,OPEN AND THORACOSCOPIC PLEURAL DRAINAGE,121,OTHER RESPIRATORY & CHEST PROCEDURES,04,DISEASES AND DISORDERS OF THE RESPIRATORY SYSTEM,3,Major,Minor,Surgical,Private Health Insurance,,,,,true,102004.2,22016.43
New York City,Kings,7002053,001304,NYU Langone Hospital-Brooklyn,70 or Older,112,F,White,Not Span/Hispanic,2,Elective,Home w/ Home Health Services,2019,NEO070,SECONDARY MALIGNANCIES,RES002,"LUNG, PLEURA, OR DIAPHRAGM BIOPSY (NON-ENDOSCOPIC)",121,OTHER RESPIRATORY & CHEST PROCEDURES,04,DISEASES AND DISORDERS OF THE RESPIRATORY SYSTEM,2,Moderate,Major,Surgical,Medicare,Medicaid,,,,false,71374.97,14041.25
New York City,Kings,7002053,001304,NYU Langone Hospital-Brooklyn,70 or Older,112,F,White,Not Span/Hispanic,2,Elective,Home or Self Care,2019,NEO022,RESPIRATORY CANCERS,RES008,"LUNG, PLEURA, OR DIAPHRAGM RESECTION (OPEN AND THORACOSCOPIC)",121,OTHER RESPIRATORY & CHEST PROCEDURES,04,DISEASES AND DISORDERS OF THE RESPIRATORY SYSTEM,2,Moderate,Major,Surgical,Medicare,Blue Cross/Blue Shield,,,,false,159067.43,30862.12
New York City,Kings,7002053,001304,NYU Langone Hospital-Brooklyn,18 to 29,112,M,Other Race,Not Span/Hispanic,6,Emergency,Home or Self Care,2019,RSP014,PNEUMOTHORAX,RES005,CHEST TUBE PLACEMENT AND THERAPEUTIC THORACENTESIS,121,OTHER RESPIRATORY & CHEST PROCEDURES,04,DISEASES AND DISORDERS OF THE RESPIRATORY SYSTEM,2,Moderate,Minor,Surgical,Private Health Insurance,,,,,true,101902.95,26565.61
New York City,Kings,7002053,001304,NYU Langone Hospital-Brooklyn,30 to 49,112,F,White,Unknown,7,Emergency,Home or Self Care,2019,RSP014,PNEUMOTHORAX,RES008,"LUNG, PLEURA, OR DIAPHRAGM RESECTION (OPEN AND THORACOSCOPIC)",121,OTHER RESPIRATORY & CHEST PROCEDURES,04,DISEASES AND DISORDERS OF THE RESPIRATORY SYSTEM,3,Major,Moderate,Surgical,Medicaid,,,,,true,131781.93,33963.49
New York City,Kings,7002053,001304,NYU Langone Hospital-Brooklyn,50 to 69,112,F,Other Race,Spanish/Hispanic,9,Emergency,Home w/ Home Health Services,2019,NEO070,SECONDARY MALIGNANCIES,RES008,"LUNG, PLEURA, OR DIAPHRAGM RESECTION (OPEN AND THORACOSCOPIC)",121,OTHER RESPIRATORY & CHEST PROCEDURES,04,DISEASES AND DISORDERS OF THE RESPIRATORY SYSTEM,3,Major,Moderate,Surgical,Medicaid,,,,,true,149631.69,41650.38
New York City,Kings,7002053,001304,NYU Langone Hospital-Brooklyn,30 to 49,112,F,Other Race,Spanish/Hispanic,1,Emergency,Home or Self Care,2019,RSP016,OTHER SPECIFIED AND UNSPECIFIED LOWER RESPIRATORY DISEASE,RES008,"LUNG, PLEURA, OR DIAPHRAGM RESECTION (OPEN AND THORACOSCOPIC)",121,OTHER RESPIRATORY & CHEST PROCEDURES,04,DISEASES AND DISORDERS OF THE RESPIRATORY SYSTEM,1,Minor,Minor,Surgical,Medicaid,,,,,false,63128.26,11133.98
New York City,Kings,7002053,001304,NYU Langone Hospital-Brooklyn,70 or Older,112,M,Multi-racial,Not Span/Hispanic,8,Emergency,Home or Self Care,2019,RSP002,PNEUMONIA (EXCEPT THAT CAUSED BY TUBERCULOSIS),RES012,RELEASE OF LUNG AND PLEURA,121,OTHER RESPIRATORY & CHEST PROCEDURES,04,DISEASES AND DISORDERS OF THE RESPIRATORY SYSTEM,3,Major,Major,Surgical,Medicare,,,,,true,178084.91,36731.92
New York City,Kings,7002053,001304,NYU Langone Hospital-Brooklyn,50 to 69,112,M,Other Race,Spanish/Hispanic,1,Elective,Home or Self Care,2019,RSP016,OTHER SPECIFIED AND UNSPECIFIED LOWER RESPIRATORY DISEASE,RES002,"LUNG, PLEURA, OR DIAPHRAGM BIOPSY (NON-ENDOSCOPIC)",121,OTHER RESPIRATORY & CHEST PROCEDURES,04,DISEASES AND DISORDERS OF THE RESPIRATORY SYSTEM,1,Minor,Minor,Surgical,Medicaid,,,,,false,78411.77,15388.25
New York City,Kings,7002053,001304,NYU Langone Hospital-Brooklyn,70 or Older,112,F,White,Not Span/Hispanic,10,Elective,Home w/ Home Health Services,2019,NEO022,RESPIRATORY CANCERS,RES008,"LUNG, PLEURA, OR DIAPHRAGM RESECTION (OPEN AND THORACOSCOPIC)",121,OTHER RESPIRATORY & CHEST PROCEDURES,04,DISEASES AND DISORDERS OF THE RESPIRATORY SYSTEM,2,Moderate,Minor,Surgical,Medicare,Medicaid,,,,false,219520.9,52681.87
New York City,Kings,7002053,001304,NYU Langone Hospital-Brooklyn,70 or Older,112,M,White,Not Span/Hispanic,10,Emergency,Skilled Nursing Home,2019,RSP012,RESPIRATORY FAILURE; INSUFFICIENCY; ARREST,ESA003,MECHANICAL VENTILATION,121,OTHER RESPIRATORY & CHEST PROCEDURES,04,DISEASES AND DISORDERS OF THE RESPIRATORY SYSTEM,4,Extreme,Major,Surgical,Medicare,Medicaid,,,,true,210884.17,62625.22
New York City,Kings,7002053,001304,NYU Langone Hospital-Brooklyn,50 to 69,112,F,White,Not Span/Hispanic,6,Elective,Home or Self Care,2019,NEO022,RESPIRATORY CANCERS,RES008,"LUNG, PLEURA, OR DIAPHRAGM RESECTION (OPEN AND THORACOSCOPIC)",121,OTHER RESPIRATORY & CHEST PROCEDURES,04,DISEASES AND DISORDERS OF THE RESPIRATORY SYSTEM,3,Major,Minor,Surgical,Private Health Insurance,,,,,false,256401.78,53622.88
New York City,Kings,7002053,001304,NYU Langone Hospital-Brooklyn,50 to 69,112,M,White,Not Span/Hispanic,4,Elective,Home or Self Care,2019,NEO022,RESPIRATORY CANCERS,RES008,"LUNG, PLEURA, OR DIAPHRAGM RESECTION (OPEN AND THORACOSCOPIC)",121,OTHER RESPIRATORY & CHEST PROCEDURES,04,DISEASES AND DISORDERS OF THE RESPIRATORY SYSTEM,1,Minor,Minor,Surgical,Medicare,Blue Cross/Blue Shield,,,,false,193365.42,45551.23
New York City,Kings,7002053,001304,NYU Langone Hospital-Brooklyn,18 to 29,112,M,Other Race,Not Span/Hispanic,8,Elective,Home w/ Home Health Services,2019,RSP008,CHRONIC OBSTRUCTIVE PULMONARY DISEASE AND BRONCHIECTASIS,RES008,"LUNG, PLEURA, OR DIAPHRAGM RESECTION (OPEN AND THORACOSCOPIC)",121,OTHER RESPIRATORY & CHEST PROCEDURES,04,DISEASES AND DISORDERS OF THE RESPIRATORY SYSTEM,3,Major,Minor,Surgical,Medicaid,,,,,false,142846.6,36186.19
New York City,Kings,7002053,001304,NYU Langone Hospital-Brooklyn,30 to 49,112,M,White,Not Span/Hispanic,5,Emergency,Home or Self Care,2019,RSP011,"PLEURISY, PLEURAL EFFUSION AND PULMONARY COLLAPSE",RES012,RELEASE OF LUNG AND PLEURA,121,OTHER RESPIRATORY & CHEST PROCEDURES,04,DISEASES AND DISORDERS OF THE RESPIRATORY SYSTEM,2,Moderate,Minor,Surgical,Private Health Insurance,,,,,true,117198.2,27468.84
New York City,Kings,7002053,001304,NYU Langone Hospital-Brooklyn,70 or Older,112,F,Black/African American,Not Span/Hispanic,7,Emergency,Home w/ Home Health Services,2019,NEO070,SECONDARY MALIGNANCIES,LYM001,LYMPH NODE BIOPSY,121,OTHER RESPIRATORY & CHEST PROCEDURES,04,DISEASES AND DISORDERS OF THE RESPIRATORY SYSTEM,3,Major,Moderate,Surgical,Medicare,,,,,true,122403.63,31007.15
New York City,Kings,7002053,001304,NYU Langone Hospital-Brooklyn,70 or Older,112,M,White,Not Span/Hispanic,2,Elective,Home w/ Home Health Services,2019,NEO022,RESPIRATORY CANCERS,RES008,"LUNG, PLEURA, OR DIAPHRAGM RESECTION (OPEN AND THORACOSCOPIC)",121,OTHER RESPIRATORY & CHEST PROCEDURES,04,DISEASES AND DISORDERS OF THE RESPIRATORY SYSTEM,2,Moderate,Moderate,Surgical,Medicare,Medicaid,,,,false,120004.98,25242.39
New York City,Kings,7002053,001304,NYU Langone Hospital-Brooklyn,70 or Older,112,M,White,Not Span/Hispanic,4,Elective,Home w/ Home Health Services,2019,NEO022,RESPIRATORY CANCERS,RES008,"LUNG, PLEURA, OR DIAPHRAGM RESECTION (OPEN AND THORACOSCOPIC)",121,OTHER RESPIRATORY & CHEST PROCEDURES,04,DISEASES AND DISORDERS OF THE RESPIRATORY SYSTEM,1,Minor,Minor,Surgical,Medicare,Medicaid,,,,false,166063.37,34245.9
New York City,Kings,7002053,001304,NYU Langone Hospital-Brooklyn,30 to 49,112,M,White,Not Span/Hispanic,2,Elective,Home or Self Care,2019,INJ010,"INTERNAL ORGAN INJURY, INITIAL ENCOUNTER",RES012,RELEASE OF LUNG AND PLEURA,121,OTHER RESPIRATORY & CHEST PROCEDURES,04,DISEASES AND DISORDERS OF THE RESPIRATORY SYSTEM,2,Moderate,Minor,Surgical,Private Health Insurance,,,,,false,115302.2,21199.17
New York City,Kings,7002053,001304,NYU Langone Hospital-Brooklyn,50 to 69,112,F,Other Race,Unknown,7,Emergency,Home w/ Home Health Services,2019,RSP011,"PLEURISY, PLEURAL EFFUSION AND PULMONARY COLLAPSE",RES012,RELEASE OF LUNG AND PLEURA,121,OTHER RESPIRATORY & CHEST PROCEDURES,04,DISEASES AND DISORDERS OF THE RESPIRATORY SYSTEM,4,Extreme,Extreme,Surgical,Medicaid,,,,,false,128454.5,40497.43
New York City,Kings,7002053,001304,NYU Langone Hospital-Brooklyn,50 to 69,112,F,White,Not Span/Hispanic,4,Elective,Home or Self Care,2019,RSP017,POSTPROCEDURAL OR POSTOPERATIVE RESPIRATORY SYSTEM COMPLICATION,RES008,"LUNG, PLEURA, OR DIAPHRAGM RESECTION (OPEN AND THORACOSCOPIC)",121,OTHER RESPIRATORY & CHEST PROCEDURES,04,DISEASES AND DISORDERS OF THE RESPIRATORY SYSTEM,3,Major,Minor,Surgical,Private Health Insurance,,,,,false,90943.28,23710.41
New York City,Kings,7002053,001304,NYU Langone Hospital-Brooklyn,70 or Older,112,F,White,Not Span/Hispanic,2,Elective,Home w/ Home Health Services,2019,NEO022,RESPIRATORY CANCERS,RES008,"LUNG, PLEURA, OR DIAPHRAGM RESECTION (OPEN AND THORACOSCOPIC)",121,OTHER RESPIRATORY & CHEST PROCEDURES,04,DISEASES AND DISORDERS OF THE RESPIRATORY SYSTEM,2,Moderate,Moderate,Surgical,Medicare,Medicaid,,,,false,145572.08,27462.94
New York City,Kings,7002053,001304,NYU Langone Hospital-Brooklyn,50 to 69,112,F,Other Race,Not Span/Hispanic,8,Elective,Inpatient Rehabilitation Facility,2019,RSP016,OTHER SPECIFIED AND UNSPECIFIED LOWER RESPIRATORY DISEASE,RES002,"LUNG, PLEURA, OR DIAPHRAGM BIOPSY (NON-ENDOSCOPIC)",121,OTHER RESPIRATORY & CHEST PROCEDURES,04,DISEASES AND DISORDERS OF THE RESPIRATORY SYSTEM,3,Major,Major,Surgical,Private Health Insurance,,,,,false,238469.41,60525.48
New York City,Kings,7002053,001304,NYU Langone Hospital-Brooklyn,50 to 69,112,M,White,Not Span/Hispanic,2,Elective,Home or Self Care,2019,NEO022,RESPIRATORY CANCERS,RES002,"LUNG, PLEURA, OR DIAPHRAGM BIOPSY (NON-ENDOSCOPIC)",121,OTHER RESPIRATORY & CHEST PROCEDURES,04,DISEASES AND DISORDERS OF THE RESPIRATORY SYSTEM,2,Moderate,Moderate,Surgical,Medicare,Blue Cross/Blue Shield,,,,false,83370.84,15255.41
New York City,Kings,7002053,001304,NYU Langone Hospital-Brooklyn,50 to 69,112,F,White,Not Span/Hispanic,11,Emergency,Home or Self Care,2019,NEO022,RESPIRATORY CANCERS,LYM001,LYMPH NODE BIOPSY,121,OTHER RESPIRATORY & CHEST PROCEDURES,04,DISEASES AND DISORDERS OF THE RESPIRATORY SYSTEM,3,Major,Moderate,Surgical,Medicaid,,,,,true,324755.51,51826.26
New York City,Kings,7002053,001304,NYU Langone Hospital-Brooklyn,70 or Older,112,F,Other Race,Not Span/Hispanic,7,Emergency,Home w/ Home Health Services,2019,CIR013,ACUTE PULMONARY EMBOLISM,LYM001,LYMPH NODE BIOPSY,121,OTHER RESPIRATORY & CHEST PROCEDURES,04,DISEASES AND DISORDERS OF THE RESPIRATORY SYSTEM,4,Extreme,Extreme,Surgical,Medicare,,,,,true,130339.29,33973.22
New York City,Kings,7002053,001304,NYU Langone Hospital-Brooklyn,50 to 69,112,M,White,Not Span/Hispanic,6,Emergency,Home or Self Care,2019,RSP002,PNEUMONIA (EXCEPT THAT CAUSED BY TUBERCULOSIS),RES001,BRONCHOSCOPY (DIAGNOSTIC),121,OTHER RESPIRATORY & CHEST PROCEDURES,04,DISEASES AND DISORDERS OF THE RESPIRATORY SYSTEM,3,Major,Moderate,Surgical,Medicare,,,,,true,131838.18,30360.42
New York City,Kings,7002053,001304,NYU Langone Hospital-Brooklyn,50 to 69,112,M,Other Race,Spanish/Hispanic,8,Emergency,Expired,2019,NEO022,RESPIRATORY CANCERS,RES009,BRONCHOSCOPIC EXCISION AND FULGURATION,121,OTHER RESPIRATORY & CHEST PROCEDURES,04,DISEASES AND DISORDERS OF THE RESPIRATORY SYSTEM,3,Major,Moderate,Surgical,Medicaid,,,,,true,159272.75,39446.05
