Hospital Service Area,Hospital County,Operating Certificate Number,Permanent Facility Id,Facility Name,Age Group,Zip Code - 3 digits,Gender,Race,Ethnicity,Length of Stay,Type of Admission,Patient Disposition,Discharge Year,CCS Diagnosis Code,CCS Diagnosis Description,CCS Procedure Code,CCS Procedure Description,APR DRG Code,APR DRG Description,APR MDC Code,APR MDC Description,APR Severity of Illness Code,APR Severity of Illness Description,APR Risk of Mortality,APR Medical Surgical Description,Payment Typology 1,Payment Typology 2,Payment Typology 3,Birth Weight,Abortion Edit Indicator,Emergency Department Indicator,Total Charges,Total Costs
New York City,Manhattan,7002001,001438,Bellevue Hospital Center,50 to 69,112,F,Other Race,Spanish/Hispanic,1,Elective,Home or Self Care,2020,SYM017,ABNORMAL FINDINGS WITHOUT DIAGNOSIS,RES008,"LUNG, PLEURA, OR DIAPHRAGM RESECTION (OPEN AND THORACOSCOPIC)",121,OTHER RESPIRATORY & CHEST PROCEDURES,04,DISEASES AND DISORDERS OF THE RESPIRATORY SYSTEM,1,Minor,Minor,Surgical,Medicaid,,,,,N,18913.99,10877.13
New York City,Manhattan,7002001,001438,Bellevue Hospital Center,70 or Older,100,M,Other Race,Spanish/Hispanic,3,Elective,Home or Self Care,2020,NEO022,RESPIRATORY CANCERS,RES006,OPEN AND THORACOSCOPIC PLEURAL DRAINAGE,121,OTHER RESPIRATORY & CHEST PROCEDURES,04,DISEASES AND DISORDERS OF THE RESPIRATORY SYSTEM,1,Minor,Minor,Surgical,Medicare,,,,,N,39932.46,22964.52
New York City,Manhattan,7002001,001438,Bellevue Hospital Center,50 to 69,112,F,White,Not Span/Hispanic,6,Urgent,Home or Self Care,2020,NEO022,RESPIRATORY CANCERS,RES002,"LUNG, PLEURA, OR DIAPHRAGM BIOPSY (NON-ENDOSCOPIC)",121,OTHER RESPIRATORY & CHEST PROCEDURES,04,DISEASES AND DISORDERS OF THE RESPIRATORY SYSTEM,2,Moderate,Minor,Surgical,Medicaid,,,,,N,53469.84,30749.65
New York City,Manhattan,7002001,001438,Bellevue Hospital Center,70 or Older,113,M,Other Race,Spanish/Hispanic,11,Elective,Home w/ Home Health Services,2020,NEO022,RESPIRATORY CANCERS,RES012,RELEASE OF LUNG AND PLEURA,121,OTHER RESPIRATORY & CHEST PROCEDURES,04,DISEASES AND DISORDERS OF THE RESPIRATORY SYSTEM,2,Moderate,Minor,Surgical,Medicare,,,,,N,171504.49,98629.49
New York City,Manhattan,7002001,001438,Bellevue Hospital Center,70 or Older,100,M,Other Race,Unknown,19,Emergency,Home or Self Care,2020,NEO070,SECONDARY MALIGNANCIES,RES002,"LUNG, PLEURA, OR DIAPHRAGM BIOPSY (NON-ENDOSCOPIC)",121,OTHER RESPIRATORY & CHEST PROCEDURES,04,DISEASES AND DISORDERS OF THE RESPIRATORY SYSTEM,3,Major,Major,Surgical,Medicaid,,,,,Y,135824.89,78110.72
New York City,Manhattan,7002001,001438,Bellevue Hospital Center,70 or Older,114,M,Other Race,Unknown,7,Urgent,Home or Self Care,2020,INJ003,"FRACTURE OF TORSO, INITIAL ENCOUNTER",MST012,BONE FIXATION (EXCLUDING EXTREMITIES),121,OTHER RESPIRATORY & CHEST PROCEDURES,04,DISEASES AND DISORDERS OF THE RESPIRATORY SYSTEM,3,Major,Moderate,Surgical,Medicare,Private Health Insurance,,,,N,130615.84,75115.08
New York City,Manhattan,7002001,001438,Bellevue Hospital Center,50 to 69,100,M,White,Not Span/Hispanic,2,Elective,Home or Self Care,2020,NEO022,RESPIRATORY CANCERS,RES002,"LUNG, PLEURA, OR DIAPHRAGM BIOPSY (NON-ENDOSCOPIC)",121,OTHER RESPIRATORY & CHEST PROCEDURES,04,DISEASES AND DISORDERS OF THE RESPIRATORY SYSTEM,2,Moderate,Minor,Surgical,Medicare,Medicaid,,,,N,86559.29,49778.86
New York City,Manhattan,7002001,001438,Bellevue Hospital Center,70 or Older,100,M,Other Race,Spanish/Hispanic,4,Elective,Home w/ Home Health Services,2020,NEO022,RESPIRATORY CANCERS,RES008,"LUNG, PLEURA, OR DIAPHRAGM RESECTION (OPEN AND THORACOSCOPIC)",121,OTHER RESPIRATORY & CHEST PROCEDURES,04,DISEASES AND DISORDERS OF THE RESPIRATORY SYSTEM,2,Moderate,Minor,Surgical,Medicare,Medicaid,,,,N,116996.12,67282.6
New York City,Manhattan,7002001,001438,Bellevue Hospital Center,50 to 69,104,F,Black/African American,Not Span/Hispanic,2,Elective,Home or Self Care,2020,SYM017,ABNORMAL FINDINGS WITHOUT DIAGNOSIS,RES008,"LUNG, PLEURA, OR DIAPHRAGM RESECTION (OPEN AND THORACOSCOPIC)",121,OTHER RESPIRATORY & CHEST PROCEDURES,04,DISEASES AND DISORDERS OF THE RESPIRATORY SYSTEM,1,Minor,Minor,Surgical,Medicaid,,,,,N,96705.53,55613.8
New York City,Manhattan,7002001,001438,Bellevue Hospital Center,30 to 49,112,F,Black/African American,Not Span/Hispanic,6,Emergency,Home or Self Care,2020,RSP014,PNEUMOTHORAX,RES008,"LUNG, PLEURA, OR DIAPHRAGM RESECTION (OPEN AND THORACOSCOPIC)",121,OTHER RESPIRATORY & CHEST PROCEDURES,04,DISEASES AND DISORDERS OF THE RESPIRATORY SYSTEM,2,Moderate,Minor,Surgical,Private Health Insurance,,,,,Y,85458.51,49145.82
New York City,Manhattan,7002001,001438,Bellevue Hospital Center,70 or Older,100,M,Other Race,Unknown,14,Emergency,Home or Self Care,2020,NEO022,RESPIRATORY CANCERS,RES009,BRONCHOSCOPIC EXCISION AND FULGURATION,121,OTHER RESPIRATORY & CHEST PROCEDURES,04,DISEASES AND DISORDERS OF THE RESPIRATORY SYSTEM,3,Major,Moderate,Surgical,Self-Pay,,,,,Y,99977.73,57495.59
New York City,Manhattan,7002001,001438,Bellevue Hospital Center,50 to 69,112,F,Other Race,Not Span/Hispanic,13,Elective,Home or Self Care,2020,INJ003,"FRACTURE OF TORSO, INITIAL ENCOUNTER",MST012,BONE FIXATION (EXCLUDING EXTREMITIES),121,OTHER RESPIRATORY & CHEST PROCEDURES,04,DISEASES AND DISORDERS OF THE RESPIRATORY SYSTEM,2,Moderate,Minor,Surgical,Medicaid,,,,,N,138435.01,79611.76
New York City,Manhattan,7002001,001438,Bellevue Hospital Center,50 to 69,112,M,Other Race,Spanish/Hispanic,10,Emergency,Skilled Nursing Home,2020,NEO022,RESPIRATORY CANCERS,RES005,CHEST TUBE PLACEMENT AND THERAPEUTIC THORACENTESIS,121,OTHER RESPIRATORY & CHEST PROCEDURES,04,DISEASES AND DISORDERS OF THE RESPIRATORY SYSTEM,3,Major,Major,Surgical,Medicare,,,,,Y,123832.13,71213.88
New York City,Manhattan,7002001,001438,Bellevue Hospital Center,70 or Older,112,M,Black/African American,Not Span/Hispanic,4,Elective,Home or Self Care,2020,NEO022,RESPIRATORY CANCERS,RES008,"LUNG, PLEURA, OR DIAPHRAGM RESECTION (OPEN AND THORACOSCOPIC)",121,OTHER RESPIRATORY & CHEST PROCEDURES,04,DISEASES AND DISORDERS OF THE RESPIRATORY SYSTEM,2,Moderate,Minor,Surgical,Medicaid,,,,,N,94383.1,54278.21
New York City,Manhattan,7002001,001438,Bellevue Hospital Center,50 to 69,100,M,Black/African American,Unknown,1,Elective,Home or Self Care,2020,NEO070,SECONDARY MALIGNANCIES,LYM001,LYMPH NODE BIOPSY,121,OTHER RESPIRATORY & CHEST PROCEDURES,04,DISEASES AND DISORDERS OF THE RESPIRATORY SYSTEM,1,Minor,Moderate,Surgical,Medicare,Medicaid,,,,N,61157.17,35170.51
New York City,Manhattan,7002001,001438,Bellevue Hospital Center,50 to 69,100,F,Black/African American,Not Span/Hispanic,29,Elective,Home or Self Care,2020,RSP011,"PLEURISY, PLEURAL EFFUSION AND PULMONARY COLLAPSE",RES010,TRACHEOSTOMY,121,OTHER RESPIRATORY & CHEST PROCEDURES,04,DISEASES AND DISORDERS OF THE RESPIRATORY SYSTEM,3,Major,Minor,Surgical,Medicaid,,,,,N,259804.65,149409.5
New York City,Manhattan,7002001,001438,Bellevue Hospital Center,18 to 29,100,M,Other Race,Not Span/Hispanic,6,Emergency,Home w/ Home Health Services,2020,RSP014,PNEUMOTHORAX,RES005,CHEST TUBE PLACEMENT AND THERAPEUTIC THORACENTESIS,121,OTHER RESPIRATORY & CHEST PROCEDURES,04,DISEASES AND DISORDERS OF THE RESPIRATORY SYSTEM,1,Minor,Minor,Surgical,Medicaid,,,,,Y,71605.66,41179.27
New York City,Manhattan,7002001,001438,Bellevue Hospital Center,30 to 49,112,M,Other Race,Unknown,8,Emergency,Home or Self Care,2020,INJ010,"INTERNAL ORGAN INJURY, INITIAL ENCOUNTER",MST012,BONE FIXATION (EXCLUDING EXTREMITIES),121,OTHER RESPIRATORY & CHEST PROCEDURES,04,DISEASES AND DISORDERS OF THE RESPIRATORY SYSTEM,3,Major,Moderate,Surgical,Miscellaneous/Other,Medicaid,,,,Y,111740.12,64259.96
New York City,Manhattan,7002001,001438,Bellevue Hospital Center,50 to 69,100,F,Other Race,Not Span/Hispanic,4,Elective,Home or Self Care,2020,SYM017,ABNORMAL FINDINGS WITHOUT DIAGNOSIS,RES002,"LUNG, PLEURA, OR DIAPHRAGM BIOPSY (NON-ENDOSCOPIC)",121,OTHER RESPIRATORY & CHEST PROCEDURES,04,DISEASES AND DISORDERS OF THE RESPIRATORY SYSTEM,2,Moderate,Minor,Surgical,Private Health Insurance,,,,,N,123666.17,71118.44
New York City,Manhattan,7002001,001438,Bellevue Hospital Center,30 to 49,113,M,White,Not Span/Hispanic,1,Emergency,Home or Self Care,2020,RSP007,OTHER SPECIFIED AND UNSPECIFIED UPPER RESPIRATORY DISEASE,RES014,"RESPIRATORY SYSTEM PROCEDURES, NEC",121,OTHER RESPIRATORY & CHEST PROCEDURES,04,DISEASES AND DISORDERS OF THE RESPIRATORY SYSTEM,1,Minor,Minor,Surgical,Medicaid,,,,,Y,15333.22,8817.89
New York City,Manhattan,7002001,001438,Bellevue Hospital Center,50 to 69,111,M,White,Not Span/Hispanic,4,Elective,Home or Self Care,2020,NEO022,RESPIRATORY CANCERS,RES008,"LUNG, PLEURA, OR DIAPHRAGM RESECTION (OPEN AND THORACOSCOPIC)",121,OTHER RESPIRATORY & CHEST PROCEDURES,04,DISEASES AND DISORDERS OF THE RESPIRATORY SYSTEM,2,Moderate,Minor,Surgical,Medicaid,,,,,N,43894.38,25242.96
New York City,Manhattan,7002001,001438,Bellevue Hospital Center,30 to 49,113,M,White,Not Span/Hispanic,6,Elective,Home or Self Care,2020,RSP007,OTHER SPECIFIED AND UNSPECIFIED UPPER RESPIRATORY DISEASE,RES008,"LUNG, PLEURA, OR DIAPHRAGM RESECTION (OPEN AND THORACOSCOPIC)",121,OTHER RESPIRATORY & CHEST PROCEDURES,04,DISEASES AND DISORDERS OF THE RESPIRATORY SYSTEM,1,Minor,Minor,Surgical,Medicaid,,,,,N,69628.7,40042.35
New York City,Manhattan,7002001,001438,Bellevue Hospital Center,50 to 69,113,F,Other Race,Not Span/Hispanic,4,Elective,Home or Self Care,2020,RSP016,OTHER SPECIFIED AND UNSPECIFIED LOWER RESPIRATORY DISEASE,RES008,"LUNG, PLEURA, OR DIAPHRAGM RESECTION (OPEN AND THORACOSCOPIC)",121,OTHER RESPIRATORY & CHEST PROCEDURES,04,DISEASES AND DISORDERS OF THE RESPIRATORY SYSTEM,3,Major,Major,Surgical,Medicaid,,,,,N,84292.79,48475.43
New York City,Manhattan,7002001,001438,Bellevue Hospital Center,30 to 49,113,M,Other Race,Not Span/Hispanic,2,Elective,Home or Self Care,2020,NEO022,RESPIRATORY CANCERS,RES009,BRONCHOSCOPIC EXCISION AND FULGURATION,121,OTHER RESPIRATORY & CHEST PROCEDURES,04,DISEASES AND DISORDERS OF THE RESPIRATORY SYSTEM,2,Moderate,Minor,Surgical,Medicaid,,,,,N,108492.77,62392.46
New York City,Manhattan,7002001,001438,Bellevue Hospital Center,70 or Older,100,F,Other Race,Spanish/Hispanic,47,Emergency,Expired,2020,INF012,CORONAVIRUS DISEASE 2019 (COVID-19),CAR024,VENOUS AND ARTERIAL CATHETER PLACEMENT,121,OTHER RESPIRATORY & CHEST PROCEDURES,04,DISEASES AND DISORDERS OF THE RESPIRATORY SYSTEM,4,Extreme,Extreme,Surgical,Medicaid,,,,,Y,496801.44,285702.56
New York City,Manhattan,7002001,001438,Bellevue Hospital Center,30 to 49,104,M,Other Race,Unknown,2,Elective,Home or Self Care,2020,RSP016,OTHER SPECIFIED AND UNSPECIFIED LOWER RESPIRATORY DISEASE,RES002,"LUNG, PLEURA, OR DIAPHRAGM BIOPSY (NON-ENDOSCOPIC)",121,OTHER RESPIRATORY & CHEST PROCEDURES,04,DISEASES AND DISORDERS OF THE RESPIRATORY SYSTEM,1,Minor,Minor,Surgical,Medicaid,,,,,N,57231.09,32912.68
New York City,Manhattan,7002001,001438,Bellevue Hospital Center,50 to 69,112,M,Other Race,Not Span/Hispanic,24,Emergency,Skilled Nursing Home,2020,RSP012,RESPIRATORY FAILURE; INSUFFICIENCY; ARREST,RES002,"LUNG, PLEURA, OR DIAPHRAGM BIOPSY (NON-ENDOSCOPIC)",121,OTHER RESPIRATORY & CHEST PROCEDURES,04,DISEASES AND DISORDERS OF THE RESPIRATORY SYSTEM,3,Major,Major,Surgical,Medicaid,,,,,Y,191896.36,110356.53
New York City,Manhattan,7002001,001438,Bellevue Hospital Center,50 to 69,,M,Other Race,Unknown,6,Urgent,Home or Self Care,2020,INJ010,"INTERNAL ORGAN INJURY, INITIAL ENCOUNTER",MST012,BONE FIXATION (EXCLUDING EXTREMITIES),121,OTHER RESPIRATORY & CHEST PROCEDURES,04,DISEASES AND DISORDERS OF THE RESPIRATORY SYSTEM,2,Moderate,Minor,Surgical,Private Health Insurance,,,,,N,99391.54,57158.48
New York City,Manhattan,7002001,001438,Bellevue Hospital Center,30 to 49,112,M,White,Not Span/Hispanic,6,Emergency,Home or Self Care,2020,RSP016,OTHER SPECIFIED AND UNSPECIFIED LOWER RESPIRATORY DISEASE,RES002,"LUNG, PLEURA, OR DIAPHRAGM BIOPSY (NON-ENDOSCOPIC)",121,OTHER RESPIRATORY & CHEST PROCEDURES,04,DISEASES AND DISORDERS OF THE RESPIRATORY SYSTEM,2,Moderate,Minor,Surgical,Private Health Insurance,,,,,Y,65017,37390.24
New York City,Manhattan,7002001,001438,Bellevue Hospital Center,50 to 69,114,M,Black/African American,Not Span/Hispanic,15,Urgent,Home or Self Care,2020,NEO022,RESPIRATORY CANCERS,CAR017,PERICARDIAL PROCEDURES,121,OTHER RESPIRATORY & CHEST PROCEDURES,04,DISEASES AND DISORDERS OF THE RESPIRATORY SYSTEM,4,Extreme,Extreme,Surgical,Medicaid,,,,,N,160094.11,92067.56
New York City,Manhattan,7002001,001438,Bellevue Hospital Center,70 or Older,104,F,Other Race,Spanish/Hispanic,2,Elective,Home or Self Care,2020,NEO022,RESPIRATORY CANCERS,RES008,"LUNG, PLEURA, OR DIAPHRAGM RESECTION (OPEN AND THORACOSCOPIC)",121,OTHER RESPIRATORY & CHEST PROCEDURES,04,DISEASES AND DISORDERS OF THE RESPIRATORY SYSTEM,1,Minor,Minor,Surgical,Medicare,,,,,N,90540.87,52068.61
New York City,Manhattan,7002001,001438,Bellevue Hospital Center,50 to 69,100,M,Other Race,Not Span/Hispanic,14,Emergency,Home or Self Care,2020,NEO022,RESPIRATORY CANCERS,RES009,BRONCHOSCOPIC EXCISION AND FULGURATION,121,OTHER RESPIRATORY & CHEST PROCEDURES,04,DISEASES AND DISORDERS OF THE RESPIRATORY SYSTEM,2,Moderate,Moderate,Surgical,Medicare,Medicaid,,,,Y,111424.27,64078.31
New York City,Manhattan,7002001,001438,Bellevue Hospital Center,50 to 69,104,M,Black/African American,Not Span/Hispanic,9,Emergency,Home or Self Care,2020,INJ003,"FRACTURE OF TORSO, INITIAL ENCOUNTER",RES002,"LUNG, PLEURA, OR DIAPHRAGM BIOPSY (NON-ENDOSCOPIC)",121,OTHER RESPIRATORY & CHEST PROCEDURES,04,DISEASES AND DISORDERS OF THE RESPIRATORY SYSTEM,2,Moderate,Minor,Surgical,Medicaid,,,,,Y,89432.64,51431.28
New York City,Manhattan,7002001,001438,Bellevue Hospital Center,30 to 49,114,M,Black/African American,Not Span/Hispanic,19,Urgent,Inpatient Rehabilitation Facility,2020,RSP011,"PLEURISY, PLEURAL EFFUSION AND PULMONARY COLLAPSE",RES006,OPEN AND THORACOSCOPIC PLEURAL DRAINAGE,121,OTHER RESPIRATORY & CHEST PROCEDURES,04,DISEASES AND DISORDERS OF THE RESPIRATORY SYSTEM,4,Extreme,Extreme,Surgical,Medicaid,,,,,N,186970.67,107523.84
New York City,Manhattan,7002001,001438,Bellevue Hospital Center,50 to 69,112,M,Black/African American,Unknown,1,Elective,Home or Self Care,2020,NEO070,SECONDARY MALIGNANCIES,RES002,"LUNG, PLEURA, OR DIAPHRAGM BIOPSY (NON-ENDOSCOPIC)",121,OTHER RESPIRATORY & CHEST PROCEDURES,04,DISEASES AND DISORDERS OF THE RESPIRATORY SYSTEM,1,Minor,Minor,Surgical,Medicaid,,,,,N,25864.31,14874.15
New York City,Manhattan,7002001,001438,Bellevue Hospital Center,70 or Older,104,F,Other Race,Spanish/Hispanic,9,Elective,Home or Self Care,2020,NEO022,RESPIRATORY CANCERS,RES008,"LUNG, PLEURA, OR DIAPHRAGM RESECTION (OPEN AND THORACOSCOPIC)",121,OTHER RESPIRATORY & CHEST PROCEDURES,04,DISEASES AND DISORDERS OF THE RESPIRATORY SYSTEM,3,Major,Moderate,Surgical,Medicare,,,,,N,131907.01,75857.61
New York City,Manhattan,7002001,001438,Bellevue Hospital Center,18 to 29,104,M,Black/African American,Unknown,2,Emergency,Home or Self Care,2020,INJ013,"OPEN WOUNDS OF TRUNK, INITIAL ENCOUNTER",GNR006,"CHEST WALL PROCEDURES, NEC",121,OTHER RESPIRATORY & CHEST PROCEDURES,04,DISEASES AND DISORDERS OF THE RESPIRATORY SYSTEM,3,Major,Major,Surgical,Medicaid,,,,,Y,45522.6,26179.32
New York City,Manhattan,7002001,001438,Bellevue Hospital Center,70 or Older,112,F,Other Race,Unknown,24,Emergency,Expired,2020,INF012,CORONAVIRUS DISEASE 2019 (COVID-19),ESA003,MECHANICAL VENTILATION,121,OTHER RESPIRATORY & CHEST PROCEDURES,04,DISEASES AND DISORDERS OF THE RESPIRATORY SYSTEM,4,Extreme,Extreme,Surgical,Medicare,,,,,Y,291927.11,167882.61
New York City,Manhattan,7002001,001438,Bellevue Hospital Center,18 to 29,117,M,White,Not Span/Hispanic,7,Emergency,Psychiatric Hospital or Unit of Hosp,2020,INJ013,"OPEN WOUNDS OF TRUNK, INITIAL ENCOUNTER",MST004,INCISION AND DRAINAGE OF MUSCULOSKELETAL TISSUE AND JOINTS,121,OTHER RESPIRATORY & CHEST PROCEDURES,04,DISEASES AND DISORDERS OF THE RESPIRATORY SYSTEM,4,Extreme,Extreme,Surgical,Private Health Insurance,,,,,Y,116354.12,66913.39
New York City,Manhattan,7002001,001438,Bellevue Hospital Center,70 or Older,113,F,Other Race,Not Span/Hispanic,22,Emergency,Hospice - Medical Facility,2020,NEO022,RESPIRATORY CANCERS,CAR017,PERICARDIAL PROCEDURES,121,OTHER RESPIRATORY & CHEST PROCEDURES,04,DISEASES AND DISORDERS OF THE RESPIRATORY SYSTEM,4,Extreme,Extreme,Surgical,Medicaid,,,,,Y,267490.01,153829.22
New York City,Manhattan,7002001,001438,Bellevue Hospital Center,50 to 69,100,M,Black/African American,Not Span/Hispanic,9,Emergency,Home or Self Care,2020,INJ013,"OPEN WOUNDS OF TRUNK, INITIAL ENCOUNTER",RES005,CHEST TUBE PLACEMENT AND THERAPEUTIC THORACENTESIS,121,OTHER RESPIRATORY & CHEST PROCEDURES,04,DISEASES AND DISORDERS OF THE RESPIRATORY SYSTEM,4,Extreme,Extreme,Surgical,Medicaid,,,,,Y,129692.54,74584.1
New York City,Manhattan,7002001,001438,Bellevue Hospital Center,50 to 69,112,M,Black/African American,Not Span/Hispanic,8,Urgent,Another Type Not Listed,2020,NEO022,RESPIRATORY CANCERS,RES002,"LUNG, PLEURA, OR DIAPHRAGM BIOPSY (NON-ENDOSCOPIC)",121,OTHER RESPIRATORY & CHEST PROCEDURES,04,DISEASES AND DISORDERS OF THE RESPIRATORY SYSTEM,3,Major,Major,Surgical,Medicaid,,,,,N,103749.71,59664.8
New York City,Manhattan,7002001,001438,Bellevue Hospital Center,70 or Older,100,M,Black/African American,Not Span/Hispanic,1,Elective,Home or Self Care,2020,NEO022,RESPIRATORY CANCERS,RES008,"LUNG, PLEURA, OR DIAPHRAGM RESECTION (OPEN AND THORACOSCOPIC)",121,OTHER RESPIRATORY & CHEST PROCEDURES,04,DISEASES AND DISORDERS OF THE RESPIRATORY SYSTEM,2,Moderate,Moderate,Surgical,Medicare,Federal/State/Local/VA,,,,N,55941.52,32171.07
New York City,Manhattan,7002001,001438,Bellevue Hospital Center,30 to 49,104,M,Other Race,Spanish/Hispanic,1,Elective,Home or Self Care,2020,NEO011,CARDIAC CANCERS,GNR007,"MEDIASTINAL PROCEDURES, NEC",121,OTHER RESPIRATORY & CHEST PROCEDURES,04,DISEASES AND DISORDERS OF THE RESPIRATORY SYSTEM,1,Minor,Minor,Surgical,Self-Pay,,,,,N,57266.1,32932.82
New York City,Manhattan,7002001,001438,Bellevue Hospital Center,30 to 49,112,M,Black/African American,Not Span/Hispanic,15,Emergency,Home or Self Care,2020,INJ010,"INTERNAL ORGAN INJURY, INITIAL ENCOUNTER",RES002,"LUNG, PLEURA, OR DIAPHRAGM BIOPSY (NON-ENDOSCOPIC)",121,OTHER RESPIRATORY & CHEST PROCEDURES,04,DISEASES AND DISORDERS OF THE RESPIRATORY SYSTEM,3,Major,Major,Surgical,Miscellaneous/Other,Medicaid,,,,Y,131829.34,75812.94
New York City,Manhattan,7002001,001438,Bellevue Hospital Center,18 to 29,112,M,Black/African American,Not Span/Hispanic,6,Emergency,Home or Self Care,2020,INJ010,"INTERNAL ORGAN INJURY, INITIAL ENCOUNTER",RES005,CHEST TUBE PLACEMENT AND THERAPEUTIC THORACENTESIS,121,OTHER RESPIRATORY & CHEST PROCEDURES,04,DISEASES AND DISORDERS OF THE RESPIRATORY SYSTEM,3,Major,Major,Surgical,Medicaid,,,,,Y,101799.68,58543.37
New York City,Manhattan,7002001,001438,Bellevue Hospital Center,70 or Older,114,M,Other Race,Not Span/Hispanic,6,Urgent,Expired,2020,NEO022,RESPIRATORY CANCERS,RES008,"LUNG, PLEURA, OR DIAPHRAGM RESECTION (OPEN AND THORACOSCOPIC)",121,OTHER RESPIRATORY & CHEST PROCEDURES,04,DISEASES AND DISORDERS OF THE RESPIRATORY SYSTEM,4,Extreme,Extreme,Surgical,Medicare,,,,,N,129467.98,74454.96
New York City,Manhattan,7002001,001438,Bellevue Hospital Center,18 to 29,100,M,Other Race,Not Span/Hispanic,2,Emergency,Home or Self Care,2020,RSP017,POSTPROCEDURAL OR POSTOPERATIVE RESPIRATORY SYSTEM COMPLICATION,ENT017,"ENT PROCEDURES, NEC",121,OTHER RESPIRATORY & CHEST PROCEDURES,04,DISEASES AND DISORDERS OF THE RESPIRATORY SYSTEM,1,Minor,Minor,Surgical,Miscellaneous/Other,,,,,Y,23613.82,13579.93
