Hospital Service Area,Hospital County,Operating Certificate Number,Permanent Facility Id,Facility Name,Age Group,Zip Code - 3 digits,Gender,Race,Ethnicity,Length of Stay,Type of Admission,Patient Disposition,Discharge Year,CCS Diagnosis Code,CCS Diagnosis Description,CCS Procedure Code,CCS Procedure Description,APR DRG Code,APR DRG Description,APR MDC Code,APR MDC Description,APR Severity of Illness Code,APR Severity of Illness Description,APR Risk of Mortality,APR Medical Surgical Description,Payment Typology 1,Payment Typology 2,Payment Typology 3,Birth Weight,Abortion Edit Indicator,Emergency Department Indicator,Total Charges,Total Costs
New York City,Manhattan,7002053,001463,NYU Langone Hospitals,50 to 69,100,F,White,Not Span/Hispanic,2,Elective,Home or Self Care,2020,SYM017,ABNORMAL FINDINGS WITHOUT DIAGNOSIS,RES002,"LUNG, PLEURA, OR DIAPHRAGM BIOPSY (NON-ENDOSCOPIC)",121,OTHER RESPIRATORY & CHEST PROCEDURES,04,DISEASES AND DISORDERS OF THE RESPIRATORY SYSTEM,1,Minor,Minor,Surgical,Private Health Insurance,,,,,N,161561.69,25802.68
New York City,Manhattan,7002053,001463,NYU Langone Hospitals,50 to 69,OOS,M,Other Race,Not Span/Hispanic,6,Emergency,Home w/ Home Health Services,2020,RSP012,RESPIRATORY FAILURE; INSUFFICIENCY; ARREST,RES010,TRACHEOSTOMY,121,OTHER RESPIRATORY & CHEST PROCEDURES,04,DISEASES AND DISORDERS OF THE RESPIRATORY SYSTEM,3,Major,Major,Surgical,Private Health Insurance,,,,,Y,153879.37,49866.77
New York City,Manhattan,7002053,001463,NYU Langone Hospitals,70 or Older,100,M,White,Not Span/Hispanic,31,Emergency,Skilled Nursing Home,2020,RSP017,POSTPROCEDURAL OR POSTOPERATIVE RESPIRATORY SYSTEM COMPLICATION,RES006,OPEN AND THORACOSCOPIC PLEURAL DRAINAGE,121,OTHER RESPIRATORY & CHEST PROCEDURES,04,DISEASES AND DISORDERS OF THE RESPIRATORY SYSTEM,4,Extreme,Extreme,Surgical,Medicare,,,,,Y,745784.77,206708.22
New York City,Manhattan,7002053,001463,NYU Langone Hospitals,50 to 69,112,M,Other Race,Not Span/Hispanic,1,Elective,Home or Self Care,2020,SYM017,ABNORMAL FINDINGS WITHOUT DIAGNOSIS,RES002,"LUNG, PLEURA, OR DIAPHRAGM BIOPSY (NON-ENDOSCOPIC)",121,OTHER RESPIRATORY & CHEST PROCEDURES,04,DISEASES AND DISORDERS OF THE RESPIRATORY SYSTEM,1,Minor,Minor,Surgical,Private Health Insurance,,,,,N,202802.24,29815.41
New York City,Manhattan,7002053,001463,NYU Langone Hospitals,50 to 69,105,F,Other Race,Not Span/Hispanic,3,Elective,Home or Self Care,2020,RSP007,OTHER SPECIFIED AND UNSPECIFIED UPPER RESPIRATORY DISEASE,RES008,"LUNG, PLEURA, OR DIAPHRAGM RESECTION (OPEN AND THORACOSCOPIC)",121,OTHER RESPIRATORY & CHEST PROCEDURES,04,DISEASES AND DISORDERS OF THE RESPIRATORY SYSTEM,2,Moderate,Moderate,Surgical,Blue Cross/Blue Shield,,,,,N,99124.23,23739.61
New York City,Manhattan,7002053,001463,NYU Langone Hospitals,70 or Older,100,F,White,Not Span/Hispanic,1,Elective,Home w/ Home Health Services,2020,NEO022,RESPIRATORY CANCERS,RES008,"LUNG, PLEURA, OR DIAPHRAGM RESECTION (OPEN AND THORACOSCOPIC)",121,OTHER RESPIRATORY & CHEST PROCEDURES,04,DISEASES AND DISORDERS OF THE RESPIRATORY SYSTEM,2,Moderate,Moderate,Surgical,Medicare,Medicare,,,,N,203702.69,29347.26
New York City,Manhattan,7002053,001463,NYU Langone Hospitals,50 to 69,112,M,White,Not Span/Hispanic,2,Elective,Home or Self Care,2020,BLD008,IMMUNITY DISORDERS,RES008,"LUNG, PLEURA, OR DIAPHRAGM RESECTION (OPEN AND THORACOSCOPIC)",121,OTHER RESPIRATORY & CHEST PROCEDURES,04,DISEASES AND DISORDERS OF THE RESPIRATORY SYSTEM,1,Minor,Moderate,Surgical,Miscellaneous/Other,,,,,N,96589.31,17070.27
New York City,Manhattan,7002053,001463,NYU Langone Hospitals,30 to 49,112,F,White,Not Span/Hispanic,3,Elective,Home or Self Care,2020,RSP016,OTHER SPECIFIED AND UNSPECIFIED LOWER RESPIRATORY DISEASE,RES008,"LUNG, PLEURA, OR DIAPHRAGM RESECTION (OPEN AND THORACOSCOPIC)",121,OTHER RESPIRATORY & CHEST PROCEDURES,04,DISEASES AND DISORDERS OF THE RESPIRATORY SYSTEM,2,Moderate,Minor,Surgical,Medicaid,,,,,N,221981.2,34950.4
New York City,Manhattan,7002053,001463,NYU Langone Hospitals,70 or Older,OOS,M,White,Not Span/Hispanic,1,Elective,Home or Self Care,2020,RSP017,POSTPROCEDURAL OR POSTOPERATIVE RESPIRATORY SYSTEM COMPLICATION,RES012,RELEASE OF LUNG AND PLEURA,121,OTHER RESPIRATORY & CHEST PROCEDURES,04,DISEASES AND DISORDERS OF THE RESPIRATORY SYSTEM,3,Major,Extreme,Surgical,Medicare,,,,,N,89960.49,13909.02
New York City,Manhattan,7002053,001463,NYU Langone Hospitals,70 or Older,112,F,Black/African American,Unknown,8,Emergency,Home w/ Home Health Services,2020,RSP017,POSTPROCEDURAL OR POSTOPERATIVE RESPIRATORY SYSTEM COMPLICATION,ENT001,LARYNGOSCOPY (DIAGNOSTIC),121,OTHER RESPIRATORY & CHEST PROCEDURES,04,DISEASES AND DISORDERS OF THE RESPIRATORY SYSTEM,3,Major,Extreme,Surgical,Medicaid,,,,,N,194844.4,59878.83
New York City,Manhattan,7002053,001463,NYU Langone Hospitals,50 to 69,OOS,F,White,Not Span/Hispanic,1,Elective,Home or Self Care,2020,NEO066,MALIGNANT NEUROENDOCRINE TUMORS,LYM001,LYMPH NODE BIOPSY,121,OTHER RESPIRATORY & CHEST PROCEDURES,04,DISEASES AND DISORDERS OF THE RESPIRATORY SYSTEM,1,Minor,Minor,Surgical,Private Health Insurance,,,,,N,184008.14,26765.18
New York City,Manhattan,7002053,001463,NYU Langone Hospitals,50 to 69,100,F,White,Not Span/Hispanic,3,Elective,Home or Self Care,2020,NEO022,RESPIRATORY CANCERS,RES008,"LUNG, PLEURA, OR DIAPHRAGM RESECTION (OPEN AND THORACOSCOPIC)",121,OTHER RESPIRATORY & CHEST PROCEDURES,04,DISEASES AND DISORDERS OF THE RESPIRATORY SYSTEM,1,Minor,Minor,Surgical,Private Health Insurance,,,,,N,120129.52,22453.54
New York City,Manhattan,7002053,001463,NYU Langone Hospitals,50 to 69,100,M,White,Not Span/Hispanic,4,Elective,Home or Self Care,2020,RSP014,PNEUMOTHORAX,RES008,"LUNG, PLEURA, OR DIAPHRAGM RESECTION (OPEN AND THORACOSCOPIC)",121,OTHER RESPIRATORY & CHEST PROCEDURES,04,DISEASES AND DISORDERS OF THE RESPIRATORY SYSTEM,2,Moderate,Minor,Surgical,Medicare,Private Health Insurance,,,,N,88374.56,19723.68
New York City,Manhattan,7002053,001463,NYU Langone Hospitals,70 or Older,103,F,White,Not Span/Hispanic,7,Emergency,Home w/ Home Health Services,2020,NEO070,SECONDARY MALIGNANCIES,RES009,BRONCHOSCOPIC EXCISION AND FULGURATION,121,OTHER RESPIRATORY & CHEST PROCEDURES,04,DISEASES AND DISORDERS OF THE RESPIRATORY SYSTEM,1,Minor,Moderate,Surgical,Medicare,Blue Cross/Blue Shield,,,,Y,153544.98,35198.89
New York City,Manhattan,7002053,001463,NYU Langone Hospitals,70 or Older,100,F,White,Not Span/Hispanic,1,Elective,Home w/ Home Health Services,2020,NEO022,RESPIRATORY CANCERS,RES008,"LUNG, PLEURA, OR DIAPHRAGM RESECTION (OPEN AND THORACOSCOPIC)",121,OTHER RESPIRATORY & CHEST PROCEDURES,04,DISEASES AND DISORDERS OF THE RESPIRATORY SYSTEM,1,Minor,Moderate,Surgical,Medicare,Blue Cross/Blue Shield,,,,N,132001.3,19958.83
New York City,Manhattan,7002053,001463,NYU Langone Hospitals,50 to 69,125,M,White,Not Span/Hispanic,2,Elective,Home or Self Care,2020,RSP016,OTHER SPECIFIED AND UNSPECIFIED LOWER RESPIRATORY DISEASE,RES002,"LUNG, PLEURA, OR DIAPHRAGM BIOPSY (NON-ENDOSCOPIC)",121,OTHER RESPIRATORY & CHEST PROCEDURES,04,DISEASES AND DISORDERS OF THE RESPIRATORY SYSTEM,1,Minor,Minor,Surgical,Miscellaneous/Other,,,,,N,113000.09,19349.73
New York City,Manhattan,7002053,001463,NYU Langone Hospitals,30 to 49,100,M,White,Not Span/Hispanic,1,Elective,Home or Self Care,2020,BLD008,IMMUNITY DISORDERS,RES008,"LUNG, PLEURA, OR DIAPHRAGM RESECTION (OPEN AND THORACOSCOPIC)",121,OTHER RESPIRATORY & CHEST PROCEDURES,04,DISEASES AND DISORDERS OF THE RESPIRATORY SYSTEM,1,Minor,Minor,Surgical,Blue Cross/Blue Shield,,,,,N,132798.93,19548.71
New York City,Manhattan,7002053,001463,NYU Langone Hospitals,18 to 29,103,F,Other Race,Not Span/Hispanic,3,Emergency,Home or Self Care,2020,RSP014,PNEUMOTHORAX,RES008,"LUNG, PLEURA, OR DIAPHRAGM RESECTION (OPEN AND THORACOSCOPIC)",121,OTHER RESPIRATORY & CHEST PROCEDURES,04,DISEASES AND DISORDERS OF THE RESPIRATORY SYSTEM,1,Minor,Minor,Surgical,Private Health Insurance,,,,,Y,75676.72,16295
New York City,Manhattan,7002053,001463,NYU Langone Hospitals,50 to 69,104,M,Other Race,Spanish/Hispanic,8,Emergency,Home w/ Home Health Services,2020,NEO070,SECONDARY MALIGNANCIES,RES006,OPEN AND THORACOSCOPIC PLEURAL DRAINAGE,121,OTHER RESPIRATORY & CHEST PROCEDURES,04,DISEASES AND DISORDERS OF THE RESPIRATORY SYSTEM,3,Major,Moderate,Surgical,Medicare,Medicaid,,,,Y,146139.61,35837.24
New York City,Manhattan,7002053,001463,NYU Langone Hospitals,50 to 69,112,M,Other Race,Not Span/Hispanic,2,Elective,Home or Self Care,2020,SYM017,ABNORMAL FINDINGS WITHOUT DIAGNOSIS,RES008,"LUNG, PLEURA, OR DIAPHRAGM RESECTION (OPEN AND THORACOSCOPIC)",121,OTHER RESPIRATORY & CHEST PROCEDURES,04,DISEASES AND DISORDERS OF THE RESPIRATORY SYSTEM,1,Minor,Minor,Surgical,Medicaid,,,,,N,150593.3,23836.93
New York City,Manhattan,7002053,001463,NYU Langone Hospitals,70 or Older,114,F,White,Not Span/Hispanic,1,Elective,Home or Self Care,2020,NEO022,RESPIRATORY CANCERS,RES008,"LUNG, PLEURA, OR DIAPHRAGM RESECTION (OPEN AND THORACOSCOPIC)",121,OTHER RESPIRATORY & CHEST PROCEDURES,04,DISEASES AND DISORDERS OF THE RESPIRATORY SYSTEM,1,Minor,Minor,Surgical,Medicare,Medicaid,,,,N,181166.5,26523.59
New York City,Manhattan,7002053,001463,NYU Langone Hospitals,70 or Older,119,M,White,Not Span/Hispanic,3,Elective,Home or Self Care,2020,NEO022,RESPIRATORY CANCERS,RES008,"LUNG, PLEURA, OR DIAPHRAGM RESECTION (OPEN AND THORACOSCOPIC)",121,OTHER RESPIRATORY & CHEST PROCEDURES,04,DISEASES AND DISORDERS OF THE RESPIRATORY SYSTEM,1,Minor,Minor,Surgical,Medicare,Medicare,,,,N,156395.75,27243.54
New York City,Manhattan,7002053,001463,NYU Langone Hospitals,70 or Older,100,F,White,Not Span/Hispanic,6,Elective,Home or Self Care,2020,NEO022,RESPIRATORY CANCERS,RES008,"LUNG, PLEURA, OR DIAPHRAGM RESECTION (OPEN AND THORACOSCOPIC)",121,OTHER RESPIRATORY & CHEST PROCEDURES,04,DISEASES AND DISORDERS OF THE RESPIRATORY SYSTEM,2,Moderate,Minor,Surgical,Medicare,Medicare,,,,N,215330.01,41757.91
New York City,Manhattan,7002053,001463,NYU Langone Hospitals,70 or Older,112,M,White,Not Span/Hispanic,1,Elective,Home or Self Care,2020,RSP016,OTHER SPECIFIED AND UNSPECIFIED LOWER RESPIRATORY DISEASE,RES002,"LUNG, PLEURA, OR DIAPHRAGM BIOPSY (NON-ENDOSCOPIC)",121,OTHER RESPIRATORY & CHEST PROCEDURES,04,DISEASES AND DISORDERS OF THE RESPIRATORY SYSTEM,1,Minor,Minor,Surgical,Medicare,Medicaid,,,,N,117683.3,17793.82
New York City,Manhattan,7002053,001463,NYU Langone Hospitals,0 to 17,112,M,White,Not Span/Hispanic,18,Emergency,Home or Self Care,2020,RSP003,INFLUENZA,RES005,CHEST TUBE PLACEMENT AND THERAPEUTIC THORACENTESIS,121,OTHER RESPIRATORY & CHEST PROCEDURES,04,DISEASES AND DISORDERS OF THE RESPIRATORY SYSTEM,4,Extreme,Minor,Surgical,Medicaid,,,,,Y,333698.53,79513.84
New York City,Manhattan,7002053,001463,NYU Langone Hospitals,30 to 49,112,F,Other Race,Not Span/Hispanic,2,Elective,Home w/ Home Health Services,2020,NEO022,RESPIRATORY CANCERS,RES008,"LUNG, PLEURA, OR DIAPHRAGM RESECTION (OPEN AND THORACOSCOPIC)",121,OTHER RESPIRATORY & CHEST PROCEDURES,04,DISEASES AND DISORDERS OF THE RESPIRATORY SYSTEM,1,Minor,Moderate,Surgical,Medicaid,,,,,N,89383.62,15496.33
New York City,Manhattan,7002053,001463,NYU Langone Hospitals,50 to 69,OOS,F,White,Not Span/Hispanic,2,Elective,Home w/ Home Health Services,2020,RSP011,"PLEURISY, PLEURAL EFFUSION AND PULMONARY COLLAPSE",RES008,"LUNG, PLEURA, OR DIAPHRAGM RESECTION (OPEN AND THORACOSCOPIC)",121,OTHER RESPIRATORY & CHEST PROCEDURES,04,DISEASES AND DISORDERS OF THE RESPIRATORY SYSTEM,3,Major,Moderate,Surgical,Medicare,Blue Cross/Blue Shield,,,,N,71171.97,13353.52
New York City,Manhattan,7002053,001463,NYU Langone Hospitals,0 to 17,,M,White,Unknown,2,Elective,Medicare Cert Long Term Care Hospital,2020,RSP007,OTHER SPECIFIED AND UNSPECIFIED UPPER RESPIRATORY DISEASE,RES014,"RESPIRATORY SYSTEM PROCEDURES, NEC",121,OTHER RESPIRATORY & CHEST PROCEDURES,04,DISEASES AND DISORDERS OF THE RESPIRATORY SYSTEM,1,Minor,Moderate,Surgical,Medicaid,,,,,N,77454.31,16232.62
New York City,Manhattan,7002053,001463,NYU Langone Hospitals,50 to 69,111,F,White,Not Span/Hispanic,1,Elective,Home or Self Care,2020,NEO066,MALIGNANT NEUROENDOCRINE TUMORS,RES008,"LUNG, PLEURA, OR DIAPHRAGM RESECTION (OPEN AND THORACOSCOPIC)",121,OTHER RESPIRATORY & CHEST PROCEDURES,04,DISEASES AND DISORDERS OF THE RESPIRATORY SYSTEM,1,Minor,Minor,Surgical,Blue Cross/Blue Shield,,,,,N,112712.59,17296.87
New York City,Manhattan,7002053,001463,NYU Langone Hospitals,50 to 69,103,M,Other Race,Not Span/Hispanic,2,Elective,Home w/ Home Health Services,2020,NEO022,RESPIRATORY CANCERS,RES008,"LUNG, PLEURA, OR DIAPHRAGM RESECTION (OPEN AND THORACOSCOPIC)",121,OTHER RESPIRATORY & CHEST PROCEDURES,04,DISEASES AND DISORDERS OF THE RESPIRATORY SYSTEM,1,Minor,Minor,Surgical,Medicare,Medicare,,,,N,258048.54,38765.98
New York City,Manhattan,7002053,001463,NYU Langone Hospitals,70 or Older,113,F,White,Not Span/Hispanic,1,Elective,Home w/ Home Health Services,2020,NEO022,RESPIRATORY CANCERS,RES001,BRONCHOSCOPY (DIAGNOSTIC),121,OTHER RESPIRATORY & CHEST PROCEDURES,04,DISEASES AND DISORDERS OF THE RESPIRATORY SYSTEM,1,Minor,Moderate,Surgical,Medicare,Medicare,,,,N,175778.8,25500.27
New York City,Manhattan,7002053,001463,NYU Langone Hospitals,70 or Older,,M,Black/African American,Not Span/Hispanic,2,Elective,Home or Self Care,2020,RSP016,OTHER SPECIFIED AND UNSPECIFIED LOWER RESPIRATORY DISEASE,RES008,"LUNG, PLEURA, OR DIAPHRAGM RESECTION (OPEN AND THORACOSCOPIC)",121,OTHER RESPIRATORY & CHEST PROCEDURES,04,DISEASES AND DISORDERS OF THE RESPIRATORY SYSTEM,1,Minor,Minor,Surgical,Medicare,Medicare,,,,N,183292.43,28608.6
New York City,Manhattan,7002053,001463,NYU Langone Hospitals,30 to 49,100,M,White,Unknown,8,Emergency,Home or Self Care,2020,RSP002,PNEUMONIA (EXCEPT THAT CAUSED BY TUBERCULOSIS),RES014,"RESPIRATORY SYSTEM PROCEDURES, NEC",121,OTHER RESPIRATORY & CHEST PROCEDURES,04,DISEASES AND DISORDERS OF THE RESPIRATORY SYSTEM,3,Major,Major,Surgical,Blue Cross/Blue Shield,,,,,Y,214472.18,47056.82
New York City,Manhattan,7002053,001463,NYU Langone Hospitals,70 or Older,OOS,M,White,Not Span/Hispanic,1,Elective,Home or Self Care,2020,NEO022,RESPIRATORY CANCERS,RES008,"LUNG, PLEURA, OR DIAPHRAGM RESECTION (OPEN AND THORACOSCOPIC)",121,OTHER RESPIRATORY & CHEST PROCEDURES,04,DISEASES AND DISORDERS OF THE RESPIRATORY SYSTEM,2,Moderate,Moderate,Surgical,Private Health Insurance,,,,,N,186643.36,26416.77
New York City,Manhattan,7002053,001463,NYU Langone Hospitals,50 to 69,115,M,White,Not Span/Hispanic,1,Elective,Home or Self Care,2020,NEO022,RESPIRATORY CANCERS,RES008,"LUNG, PLEURA, OR DIAPHRAGM RESECTION (OPEN AND THORACOSCOPIC)",121,OTHER RESPIRATORY & CHEST PROCEDURES,04,DISEASES AND DISORDERS OF THE RESPIRATORY SYSTEM,1,Minor,Minor,Surgical,Blue Cross/Blue Shield,,,,,N,219828.46,31193.73
New York City,Manhattan,7002053,001463,NYU Langone Hospitals,70 or Older,100,M,Other Race,Not Span/Hispanic,1,Elective,Home or Self Care,2020,NEO022,RESPIRATORY CANCERS,RES009,BRONCHOSCOPIC EXCISION AND FULGURATION,121,OTHER RESPIRATORY & CHEST PROCEDURES,04,DISEASES AND DISORDERS OF THE RESPIRATORY SYSTEM,2,Moderate,Minor,Surgical,Medicare,,,,,N,164255.16,23467.87
New York City,Manhattan,7002053,001463,NYU Langone Hospitals,70 or Older,100,F,White,Not Span/Hispanic,2,Elective,Home or Self Care,2020,RSP016,OTHER SPECIFIED AND UNSPECIFIED LOWER RESPIRATORY DISEASE,RES008,"LUNG, PLEURA, OR DIAPHRAGM RESECTION (OPEN AND THORACOSCOPIC)",121,OTHER RESPIRATORY & CHEST PROCEDURES,04,DISEASES AND DISORDERS OF THE RESPIRATORY SYSTEM,1,Minor,Minor,Surgical,Medicare,Medicare,,,,N,102060.98,17351.72
New York City,Manhattan,7002053,001463,NYU Langone Hospitals,50 to 69,100,F,White,Not Span/Hispanic,3,Elective,Home or Self Care,2020,RSP016,OTHER SPECIFIED AND UNSPECIFIED LOWER RESPIRATORY DISEASE,RES002,"LUNG, PLEURA, OR DIAPHRAGM BIOPSY (NON-ENDOSCOPIC)",121,OTHER RESPIRATORY & CHEST PROCEDURES,04,DISEASES AND DISORDERS OF THE RESPIRATORY SYSTEM,2,Moderate,Minor,Surgical,Medicare,Medicare,,,,N,79125.08,16402.25
New York City,Manhattan,7002053,001463,NYU Langone Hospitals,18 to 29,113,F,Other Race,Not Span/Hispanic,5,Emergency,Home or Self Care,2020,RSP014,PNEUMOTHORAX,RES008,"LUNG, PLEURA, OR DIAPHRAGM RESECTION (OPEN AND THORACOSCOPIC)",121,OTHER RESPIRATORY & CHEST PROCEDURES,04,DISEASES AND DISORDERS OF THE RESPIRATORY SYSTEM,2,Moderate,Minor,Surgical,Medicaid,,,,,Y,108012.22,24682.43
New York City,Manhattan,7002053,001463,NYU Langone Hospitals,50 to 69,113,F,White,Not Span/Hispanic,3,Elective,Home or Self Care,2020,NEO022,RESPIRATORY CANCERS,RES008,"LUNG, PLEURA, OR DIAPHRAGM RESECTION (OPEN AND THORACOSCOPIC)",121,OTHER RESPIRATORY & CHEST PROCEDURES,04,DISEASES AND DISORDERS OF THE RESPIRATORY SYSTEM,1,Minor,Minor,Surgical,Private Health Insurance,,,,,N,155237.04,26527.89
New York City,Manhattan,7002053,001463,NYU Langone Hospitals,70 or Older,OOS,F,Other Race,Not Span/Hispanic,3,Elective,Home or Self Care,2020,NEO022,RESPIRATORY CANCERS,RES008,"LUNG, PLEURA, OR DIAPHRAGM RESECTION (OPEN AND THORACOSCOPIC)",121,OTHER RESPIRATORY & CHEST PROCEDURES,04,DISEASES AND DISORDERS OF THE RESPIRATORY SYSTEM,1,Minor,Minor,Surgical,Medicare,Private Health Insurance,,,,N,129158.1,23434.27
New York City,Manhattan,7002053,001463,NYU Langone Hospitals,50 to 69,100,M,White,Not Span/Hispanic,1,Elective,Home or Self Care,2020,NEO070,SECONDARY MALIGNANCIES,RES008,"LUNG, PLEURA, OR DIAPHRAGM RESECTION (OPEN AND THORACOSCOPIC)",121,OTHER RESPIRATORY & CHEST PROCEDURES,04,DISEASES AND DISORDERS OF THE RESPIRATORY SYSTEM,1,Minor,Minor,Surgical,Medicare,Private Health Insurance,,,,N,219606.41,31314.44
New York City,Manhattan,7002053,001463,NYU Langone Hospitals,50 to 69,100,M,White,Not Span/Hispanic,2,Elective,Home or Self Care,2020,RSP016,OTHER SPECIFIED AND UNSPECIFIED LOWER RESPIRATORY DISEASE,RES008,"LUNG, PLEURA, OR DIAPHRAGM RESECTION (OPEN AND THORACOSCOPIC)",121,OTHER RESPIRATORY & CHEST PROCEDURES,04,DISEASES AND DISORDERS OF THE RESPIRATORY SYSTEM,2,Moderate,Minor,Surgical,Blue Cross/Blue Shield,,,,,N,117860.81,19694.46
New York City,Manhattan,7002053,001463,NYU Langone Hospitals,50 to 69,112,M,Multi-racial,Not Span/Hispanic,1,Elective,Home or Self Care,2020,NEO073,BENIGN NEOPLASMS,RES002,"LUNG, PLEURA, OR DIAPHRAGM BIOPSY (NON-ENDOSCOPIC)",121,OTHER RESPIRATORY & CHEST PROCEDURES,04,DISEASES AND DISORDERS OF THE RESPIRATORY SYSTEM,1,Minor,Minor,Surgical,Private Health Insurance,,,,,N,133884.63,19700.3
New York City,Manhattan,7002053,001463,NYU Langone Hospitals,70 or Older,OOS,M,White,Not Span/Hispanic,2,Elective,Home or Self Care,2020,SYM017,ABNORMAL FINDINGS WITHOUT DIAGNOSIS,RES008,"LUNG, PLEURA, OR DIAPHRAGM RESECTION (OPEN AND THORACOSCOPIC)",121,OTHER RESPIRATORY & CHEST PROCEDURES,04,DISEASES AND DISORDERS OF THE RESPIRATORY SYSTEM,2,Moderate,Minor,Surgical,Medicare,Medicare,,,,N,204077.23,31361.56
New York City,Manhattan,7002053,001463,NYU Langone Hospitals,70 or Older,112,F,Other Race,Spanish/Hispanic,1,Elective,Home or Self Care,2020,RSP016,OTHER SPECIFIED AND UNSPECIFIED LOWER RESPIRATORY DISEASE,RES008,"LUNG, PLEURA, OR DIAPHRAGM RESECTION (OPEN AND THORACOSCOPIC)",121,OTHER RESPIRATORY & CHEST PROCEDURES,04,DISEASES AND DISORDERS OF THE RESPIRATORY SYSTEM,2,Moderate,Minor,Surgical,Medicaid,,,,,N,126951.61,19433.55
New York City,Manhattan,7002053,001463,NYU Langone Hospitals,18 to 29,100,M,Other Race,Spanish/Hispanic,3,Emergency,Home or Self Care,2020,RSP016,OTHER SPECIFIED AND UNSPECIFIED LOWER RESPIRATORY DISEASE,RES002,"LUNG, PLEURA, OR DIAPHRAGM BIOPSY (NON-ENDOSCOPIC)",121,OTHER RESPIRATORY & CHEST PROCEDURES,04,DISEASES AND DISORDERS OF THE RESPIRATORY SYSTEM,1,Minor,Minor,Surgical,Blue Cross/Blue Shield,,,,,N,139801.23,24500.02
New York City,Manhattan,7002053,001463,NYU Langone Hospitals,50 to 69,111,F,White,Not Span/Hispanic,2,Elective,Home or Self Care,2020,NEO070,SECONDARY MALIGNANCIES,RES009,BRONCHOSCOPIC EXCISION AND FULGURATION,121,OTHER RESPIRATORY & CHEST PROCEDURES,04,DISEASES AND DISORDERS OF THE RESPIRATORY SYSTEM,2,Moderate,Minor,Surgical,Private Health Insurance,,,,,N,228529.45,35094.08
New York City,Manhattan,7002053,001463,NYU Langone Hospitals,70 or Older,115,F,White,Not Span/Hispanic,1,Elective,Home or Self Care,2020,NEO022,RESPIRATORY CANCERS,RES008,"LUNG, PLEURA, OR DIAPHRAGM RESECTION (OPEN AND THORACOSCOPIC)",121,OTHER RESPIRATORY & CHEST PROCEDURES,04,DISEASES AND DISORDERS OF THE RESPIRATORY SYSTEM,1,Minor,Minor,Surgical,Medicare,Medicare,,,,N,145429.79,21281
New York City,Manhattan,7002053,001463,NYU Langone Hospitals,30 to 49,112,F,White,Not Span/Hispanic,1,Elective,Home or Self Care,2020,NEO070,SECONDARY MALIGNANCIES,RES008,"LUNG, PLEURA, OR DIAPHRAGM RESECTION (OPEN AND THORACOSCOPIC)",121,OTHER RESPIRATORY & CHEST PROCEDURES,04,DISEASES AND DISORDERS OF THE RESPIRATORY SYSTEM,2,Moderate,Moderate,Surgical,Blue Cross/Blue Shield,,,,,N,128388.51,19224.7
New York City,Manhattan,7002053,001463,NYU Langone Hospitals,70 or Older,100,M,Other Race,Not Span/Hispanic,4,Elective,Home w/ Home Health Services,2020,NEO022,RESPIRATORY CANCERS,RES010,TRACHEOSTOMY,121,OTHER RESPIRATORY & CHEST PROCEDURES,04,DISEASES AND DISORDERS OF THE RESPIRATORY SYSTEM,2,Moderate,Moderate,Surgical,Medicare,Private Health Insurance,,,,N,73921.7,17182.71
New York City,Manhattan,7002053,001463,NYU Langone Hospitals,70 or Older,100,F,White,Not Span/Hispanic,5,Emergency,Home w/ Home Health Services,2020,RSP016,OTHER SPECIFIED AND UNSPECIFIED LOWER RESPIRATORY DISEASE,RES009,BRONCHOSCOPIC EXCISION AND FULGURATION,121,OTHER RESPIRATORY & CHEST PROCEDURES,04,DISEASES AND DISORDERS OF THE RESPIRATORY SYSTEM,3,Major,Major,Surgical,Medicare,,,,,N,108543.8,24837.04
New York City,Manhattan,7002053,001463,NYU Langone Hospitals,70 or Older,100,M,Black/African American,Not Span/Hispanic,1,Elective,Home or Self Care,2020,RSP008,CHRONIC OBSTRUCTIVE PULMONARY DISEASE AND BRONCHIECTASIS,RES012,RELEASE OF LUNG AND PLEURA,121,OTHER RESPIRATORY & CHEST PROCEDURES,04,DISEASES AND DISORDERS OF THE RESPIRATORY SYSTEM,1,Minor,Minor,Surgical,Medicare,,,,,N,127948.05,19408.22
New York City,Manhattan,7002053,001463,NYU Langone Hospitals,70 or Older,100,M,White,Not Span/Hispanic,1,Elective,Home or Self Care,2020,NEO022,RESPIRATORY CANCERS,RES008,"LUNG, PLEURA, OR DIAPHRAGM RESECTION (OPEN AND THORACOSCOPIC)",121,OTHER RESPIRATORY & CHEST PROCEDURES,04,DISEASES AND DISORDERS OF THE RESPIRATORY SYSTEM,1,Minor,Minor,Surgical,Medicare,,,,,N,159442.03,23313.98
New York City,Manhattan,7002053,001463,NYU Langone Hospitals,0 to 17,103,F,Black/African American,Not Span/Hispanic,13,Elective,Home w/ Home Health Services,2020,RSP011,"PLEURISY, PLEURAL EFFUSION AND PULMONARY COLLAPSE",RES005,CHEST TUBE PLACEMENT AND THERAPEUTIC THORACENTESIS,121,OTHER RESPIRATORY & CHEST PROCEDURES,04,DISEASES AND DISORDERS OF THE RESPIRATORY SYSTEM,3,Major,Major,Surgical,Medicaid,,,,,N,234684.66,51261.42
New York City,Manhattan,7002053,001463,NYU Langone Hospitals,50 to 69,100,F,Other Race,Not Span/Hispanic,2,Elective,Home or Self Care,2020,NEO022,RESPIRATORY CANCERS,RES008,"LUNG, PLEURA, OR DIAPHRAGM RESECTION (OPEN AND THORACOSCOPIC)",121,OTHER RESPIRATORY & CHEST PROCEDURES,04,DISEASES AND DISORDERS OF THE RESPIRATORY SYSTEM,2,Moderate,Minor,Surgical,Private Health Insurance,,,,,N,213794.59,32536.78
New York City,Manhattan,7002053,001463,NYU Langone Hospitals,50 to 69,112,M,Other Race,Not Span/Hispanic,1,Elective,Home or Self Care,2020,NEO073,BENIGN NEOPLASMS,RES008,"LUNG, PLEURA, OR DIAPHRAGM RESECTION (OPEN AND THORACOSCOPIC)",121,OTHER RESPIRATORY & CHEST PROCEDURES,04,DISEASES AND DISORDERS OF THE RESPIRATORY SYSTEM,2,Moderate,Moderate,Surgical,Medicaid,,,,,N,145141.37,21728.79