Hospital Service Area,Hospital County,Operating Certificate Number,Permanent Facility Id,Facility Name,Age Group,Zip Code - 3 digits,Gender,Race,Ethnicity,Length of Stay,Type of Admission,Patient Disposition,Discharge Year,CCS Diagnosis Code,CCS Diagnosis Description,CCS Procedure Code,CCS Procedure Description,APR DRG Code,APR DRG Description,APR MDC Code,APR MDC Description,APR Severity of Illness Code,APR Severity of Illness Description,APR Risk of Mortality,APR Medical Surgical Description,Payment Typology 1,Payment Typology 2,Payment Typology 3,Birth Weight,Abortion Edit Indicator,Emergency Department Indicator,Total Charges,Total Costs
New York City,Manhattan,7002053,001463,NYU Langone Hospitals,0 to 17,111,M,Other Race,Unknown,18,Elective,Home or Self Care,2020,RSP012,RESPIRATORY FAILURE; INSUFFICIENCY; ARREST,RES001,BRONCHOSCOPY (DIAGNOSTIC),130,RESPIRATORY SYSTEM DIAGNOSIS W VENTILATOR SUPPORT 96+ HOURS,04,DISEASES AND DISORDERS OF THE RESPIRATORY SYSTEM,3,Major,Moderate,Medical,Blue Cross/Blue Shield,,,,,N,509160.03,108153.52
New York City,Manhattan,7002053,001463,NYU Langone Hospitals,0 to 17,112,M,White,Not Span/Hispanic,18,Emergency,Home or Self Care,2020,RSP012,RESPIRATORY FAILURE; INSUFFICIENCY; ARREST,RES007,AIRWAY INTUBATION,130,RESPIRATORY SYSTEM DIAGNOSIS W VENTILATOR SUPPORT 96+ HOURS,04,DISEASES AND DISORDERS OF THE RESPIRATORY SYSTEM,3,Major,Moderate,Medical,Medicaid,,,,,Y,357318.99,96766.07
New York City,Manhattan,7002053,001463,NYU Langone Hospitals,50 to 69,112,M,Other Race,Not Span/Hispanic,39,Emergency,Skilled Nursing Home,2020,RSP002,PNEUMONIA (EXCEPT THAT CAUSED BY TUBERCULOSIS),ESA003,MECHANICAL VENTILATION,130,RESPIRATORY SYSTEM DIAGNOSIS W VENTILATOR SUPPORT 96+ HOURS,04,DISEASES AND DISORDERS OF THE RESPIRATORY SYSTEM,4,Extreme,Extreme,Medical,Medicare,Medicaid,,,,Y,468840.83,134536.57
New York City,Manhattan,7002053,001463,NYU Langone Hospitals,0 to 17,103,M,Other Race,Spanish/Hispanic,12,Elective,Home w/ Home Health Services,2020,RSP008,CHRONIC OBSTRUCTIVE PULMONARY DISEASE AND BRONCHIECTASIS,RES007,AIRWAY INTUBATION,130,RESPIRATORY SYSTEM DIAGNOSIS W VENTILATOR SUPPORT 96+ HOURS,04,DISEASES AND DISORDERS OF THE RESPIRATORY SYSTEM,2,Moderate,Major,Medical,Medicaid,,,,,N,253313.1,63149.94
New York City,Manhattan,7002053,001463,NYU Langone Hospitals,0 to 17,113,M,Other Race,Not Span/Hispanic,13,Emergency,Home or Self Care,2020,RSP012,RESPIRATORY FAILURE; INSUFFICIENCY; ARREST,RES007,AIRWAY INTUBATION,130,RESPIRATORY SYSTEM DIAGNOSIS W VENTILATOR SUPPORT 96+ HOURS,04,DISEASES AND DISORDERS OF THE RESPIRATORY SYSTEM,3,Major,Major,Medical,Medicaid,,,,,N,257835.2,64005.56
New York City,Manhattan,7002053,001463,NYU Langone Hospitals,70 or Older,113,M,White,Not Span/Hispanic,10,Emergency,Expired,2020,RSP002,PNEUMONIA (EXCEPT THAT CAUSED BY TUBERCULOSIS),RES007,AIRWAY INTUBATION,130,RESPIRATORY SYSTEM DIAGNOSIS W VENTILATOR SUPPORT 96+ HOURS,04,DISEASES AND DISORDERS OF THE RESPIRATORY SYSTEM,4,Extreme,Extreme,Medical,Medicare,Blue Cross/Blue Shield,,,,Y,219640.16,67165.98
New York City,Manhattan,7002053,001463,NYU Langone Hospitals,70 or Older,112,M,White,Not Span/Hispanic,13,Emergency,Expired,2020,RSP002,PNEUMONIA (EXCEPT THAT CAUSED BY TUBERCULOSIS),ESA004,NON-INVASIVE VENTILATION,130,RESPIRATORY SYSTEM DIAGNOSIS W VENTILATOR SUPPORT 96+ HOURS,04,DISEASES AND DISORDERS OF THE RESPIRATORY SYSTEM,4,Extreme,Extreme,Medical,Medicare,Private Health Insurance,,,,Y,390333.62,100611.25
New York City,Manhattan,7002053,001463,NYU Langone Hospitals,70 or Older,100,M,White,Not Span/Hispanic,18,Emergency,Expired,2020,INF012,CORONAVIRUS DISEASE 2019 (COVID-19),RES007,AIRWAY INTUBATION,130,RESPIRATORY SYSTEM DIAGNOSIS W VENTILATOR SUPPORT 96+ HOURS,04,DISEASES AND DISORDERS OF THE RESPIRATORY SYSTEM,4,Extreme,Extreme,Medical,Medicare,Private Health Insurance,,,,Y,476826.13,135629.81
New York City,Manhattan,7002053,001463,NYU Langone Hospitals,0 to 17,104,F,Other Race,Spanish/Hispanic,120 +,Elective,Home or Self Care,2020,RSP017,POSTPROCEDURAL OR POSTOPERATIVE RESPIRATORY SYSTEM COMPLICATION,ENT001,LARYNGOSCOPY (DIAGNOSTIC),130,RESPIRATORY SYSTEM DIAGNOSIS W VENTILATOR SUPPORT 96+ HOURS,04,DISEASES AND DISORDERS OF THE RESPIRATORY SYSTEM,3,Major,Major,Medical,Medicaid,,,,,N,3898256.76,783407.51
New York City,Manhattan,7002053,001463,NYU Langone Hospitals,50 to 69,112,M,White,Not Span/Hispanic,9,Emergency,Expired,2020,INF012,CORONAVIRUS DISEASE 2019 (COVID-19),OTR004,ISOLATION PROCEDURES,130,RESPIRATORY SYSTEM DIAGNOSIS W VENTILATOR SUPPORT 96+ HOURS,04,DISEASES AND DISORDERS OF THE RESPIRATORY SYSTEM,3,Major,Major,Medical,Medicare,Blue Cross/Blue Shield,,,,Y,224209.53,57958.36
New York City,Manhattan,7002053,001463,NYU Langone Hospitals,30 to 49,100,M,Other Race,Not Span/Hispanic,16,Emergency,Home or Self Care,2020,INF012,CORONAVIRUS DISEASE 2019 (COVID-19),RES007,AIRWAY INTUBATION,130,RESPIRATORY SYSTEM DIAGNOSIS W VENTILATOR SUPPORT 96+ HOURS,04,DISEASES AND DISORDERS OF THE RESPIRATORY SYSTEM,3,Major,Extreme,Medical,Private Health Insurance,,,,,Y,289043.7,87244.69
New York City,Manhattan,7002053,001463,NYU Langone Hospitals,70 or Older,112,M,White,Not Span/Hispanic,12,Emergency,Expired,2020,INF012,CORONAVIRUS DISEASE 2019 (COVID-19),RES007,AIRWAY INTUBATION,130,RESPIRATORY SYSTEM DIAGNOSIS W VENTILATOR SUPPORT 96+ HOURS,04,DISEASES AND DISORDERS OF THE RESPIRATORY SYSTEM,3,Major,Major,Medical,Medicare,Medicaid,,,,Y,319325.93,95968.02
New York City,Manhattan,7002053,001463,NYU Langone Hospitals,70 or Older,112,M,Other Race,Unknown,5,Emergency,Expired,2020,INF012,CORONAVIRUS DISEASE 2019 (COVID-19),ESA003,MECHANICAL VENTILATION,130,RESPIRATORY SYSTEM DIAGNOSIS W VENTILATOR SUPPORT 96+ HOURS,04,DISEASES AND DISORDERS OF THE RESPIRATORY SYSTEM,4,Extreme,Extreme,Medical,Medicare,Medicare,,,,Y,190578.09,44460.67
New York City,Manhattan,7002053,001463,NYU Langone Hospitals,50 to 69,100,F,Other Race,Spanish/Hispanic,16,Emergency,Skilled Nursing Home,2020,INF012,CORONAVIRUS DISEASE 2019 (COVID-19),RES007,AIRWAY INTUBATION,130,RESPIRATORY SYSTEM DIAGNOSIS W VENTILATOR SUPPORT 96+ HOURS,04,DISEASES AND DISORDERS OF THE RESPIRATORY SYSTEM,4,Extreme,Extreme,Medical,Medicare,,,,,Y,443421.41,109115.79
New York City,Manhattan,7002053,001463,NYU Langone Hospitals,50 to 69,113,M,Other Race,Not Span/Hispanic,10,Emergency,Expired,2020,RSP002,PNEUMONIA (EXCEPT THAT CAUSED BY TUBERCULOSIS),CAR024,VENOUS AND ARTERIAL CATHETER PLACEMENT,130,RESPIRATORY SYSTEM DIAGNOSIS W VENTILATOR SUPPORT 96+ HOURS,04,DISEASES AND DISORDERS OF THE RESPIRATORY SYSTEM,4,Extreme,Major,Medical,Medicare,Blue Cross/Blue Shield,,,,Y,277115.04,74233.45
New York City,Manhattan,7002053,001463,NYU Langone Hospitals,70 or Older,100,M,Other Race,Spanish/Hispanic,9,Emergency,Expired,2020,INF012,CORONAVIRUS DISEASE 2019 (COVID-19),RES007,AIRWAY INTUBATION,130,RESPIRATORY SYSTEM DIAGNOSIS W VENTILATOR SUPPORT 96+ HOURS,04,DISEASES AND DISORDERS OF THE RESPIRATORY SYSTEM,4,Extreme,Extreme,Medical,Medicare,,,,,Y,263531.39,72956.33
New York City,Manhattan,7002053,001463,NYU Langone Hospitals,70 or Older,113,F,Other Race,Unknown,24,Emergency,Expired,2020,INF012,CORONAVIRUS DISEASE 2019 (COVID-19),ESA003,MECHANICAL VENTILATION,130,RESPIRATORY SYSTEM DIAGNOSIS W VENTILATOR SUPPORT 96+ HOURS,04,DISEASES AND DISORDERS OF THE RESPIRATORY SYSTEM,4,Extreme,Extreme,Medical,Medicare,Blue Cross/Blue Shield,,,,Y,630301.26,186682.04
New York City,Manhattan,7002053,001463,NYU Langone Hospitals,70 or Older,112,M,White,Not Span/Hispanic,15,Emergency,Home w/ Home Health Services,2020,INF012,CORONAVIRUS DISEASE 2019 (COVID-19),OTR004,ISOLATION PROCEDURES,130,RESPIRATORY SYSTEM DIAGNOSIS W VENTILATOR SUPPORT 96+ HOURS,04,DISEASES AND DISORDERS OF THE RESPIRATORY SYSTEM,3,Major,Moderate,Medical,Medicare,Medicaid,,,,Y,229978.02,82961.43
New York City,Manhattan,7002053,001463,NYU Langone Hospitals,70 or Older,112,M,White,Not Span/Hispanic,20,Emergency,Expired,2020,INF012,CORONAVIRUS DISEASE 2019 (COVID-19),ESA003,MECHANICAL VENTILATION,130,RESPIRATORY SYSTEM DIAGNOSIS W VENTILATOR SUPPORT 96+ HOURS,04,DISEASES AND DISORDERS OF THE RESPIRATORY SYSTEM,4,Extreme,Extreme,Medical,Medicare,Medicaid,,,,Y,505465.18,157630.27
New York City,Manhattan,7002053,001463,NYU Langone Hospitals,50 to 69,112,M,White,Not Span/Hispanic,13,Emergency,Expired,2020,INF012,CORONAVIRUS DISEASE 2019 (COVID-19),ESA003,MECHANICAL VENTILATION,130,RESPIRATORY SYSTEM DIAGNOSIS W VENTILATOR SUPPORT 96+ HOURS,04,DISEASES AND DISORDERS OF THE RESPIRATORY SYSTEM,2,Moderate,Major,Medical,Medicare,,,,,Y,309510.11,94322.75
New York City,Manhattan,7002053,001463,NYU Langone Hospitals,50 to 69,112,M,White,Not Span/Hispanic,12,Emergency,Home or Self Care,2020,INF012,CORONAVIRUS DISEASE 2019 (COVID-19),ESA003,MECHANICAL VENTILATION,130,RESPIRATORY SYSTEM DIAGNOSIS W VENTILATOR SUPPORT 96+ HOURS,04,DISEASES AND DISORDERS OF THE RESPIRATORY SYSTEM,3,Major,Moderate,Medical,Medicaid,,,,,Y,277197.47,83987.47
New York City,Manhattan,7002053,001463,NYU Langone Hospitals,70 or Older,112,M,White,Not Span/Hispanic,9,Emergency,Expired,2020,INF012,CORONAVIRUS DISEASE 2019 (COVID-19),RES007,AIRWAY INTUBATION,130,RESPIRATORY SYSTEM DIAGNOSIS W VENTILATOR SUPPORT 96+ HOURS,04,DISEASES AND DISORDERS OF THE RESPIRATORY SYSTEM,4,Extreme,Extreme,Medical,Medicare,Medicare,,,,Y,307043.5,81722.31
New York City,Manhattan,7002053,001463,NYU Langone Hospitals,70 or Older,112,F,White,Not Span/Hispanic,5,Emergency,Expired,2020,INF012,CORONAVIRUS DISEASE 2019 (COVID-19),ESA003,MECHANICAL VENTILATION,130,RESPIRATORY SYSTEM DIAGNOSIS W VENTILATOR SUPPORT 96+ HOURS,04,DISEASES AND DISORDERS OF THE RESPIRATORY SYSTEM,2,Moderate,Moderate,Medical,Medicare,Medicaid,,,,Y,147008.38,42040.92
New York City,Manhattan,7002053,001463,NYU Langone Hospitals,70 or Older,112,M,White,Not Span/Hispanic,17,Emergency,Expired,2020,INF012,CORONAVIRUS DISEASE 2019 (COVID-19),ESA003,MECHANICAL VENTILATION,130,RESPIRATORY SYSTEM DIAGNOSIS W VENTILATOR SUPPORT 96+ HOURS,04,DISEASES AND DISORDERS OF THE RESPIRATORY SYSTEM,3,Major,Major,Medical,Medicare,Medicare,,,,Y,375347.71,128082.06
New York City,Manhattan,7002053,001463,NYU Langone Hospitals,50 to 69,112,M,White,Not Span/Hispanic,16,Emergency,Expired,2020,INF012,CORONAVIRUS DISEASE 2019 (COVID-19),ESA003,MECHANICAL VENTILATION,130,RESPIRATORY SYSTEM DIAGNOSIS W VENTILATOR SUPPORT 96+ HOURS,04,DISEASES AND DISORDERS OF THE RESPIRATORY SYSTEM,4,Extreme,Extreme,Medical,Medicare,Medicaid,,,,Y,373151.46,136019.92
New York City,Manhattan,7002053,001463,NYU Langone Hospitals,50 to 69,112,F,Black/African American,Not Span/Hispanic,8,Emergency,Expired,2020,INF012,CORONAVIRUS DISEASE 2019 (COVID-19),ESA003,MECHANICAL VENTILATION,130,RESPIRATORY SYSTEM DIAGNOSIS W VENTILATOR SUPPORT 96+ HOURS,04,DISEASES AND DISORDERS OF THE RESPIRATORY SYSTEM,4,Extreme,Major,Medical,Medicare,Medicaid,,,,Y,198260.33,54135.92
New York City,Manhattan,7002053,001463,NYU Langone Hospitals,70 or Older,112,M,White,Not Span/Hispanic,29,Emergency,Expired,2020,INF012,CORONAVIRUS DISEASE 2019 (COVID-19),RES007,AIRWAY INTUBATION,130,RESPIRATORY SYSTEM DIAGNOSIS W VENTILATOR SUPPORT 96+ HOURS,04,DISEASES AND DISORDERS OF THE RESPIRATORY SYSTEM,4,Extreme,Extreme,Medical,Medicare,Private Health Insurance,,,,Y,889628.99,243026.99
New York City,Manhattan,7002053,001463,NYU Langone Hospitals,50 to 69,112,F,White,Not Span/Hispanic,26,Emergency,Home w/ Home Health Services,2020,INF012,CORONAVIRUS DISEASE 2019 (COVID-19),ESA003,MECHANICAL VENTILATION,130,RESPIRATORY SYSTEM DIAGNOSIS W VENTILATOR SUPPORT 96+ HOURS,04,DISEASES AND DISORDERS OF THE RESPIRATORY SYSTEM,4,Extreme,Major,Medical,Medicaid,,,,,Y,521772.46,159464.36
New York City,Manhattan,7002053,001463,NYU Langone Hospitals,50 to 69,112,M,Black/African American,Not Span/Hispanic,33,Emergency,Skilled Nursing Home,2020,RSP010,ASPIRATION PNEUMONITIS,ESA003,MECHANICAL VENTILATION,130,RESPIRATORY SYSTEM DIAGNOSIS W VENTILATOR SUPPORT 96+ HOURS,04,DISEASES AND DISORDERS OF THE RESPIRATORY SYSTEM,3,Major,Extreme,Medical,Medicare,Private Health Insurance,,,,Y,464464.55,149981.91
New York City,Manhattan,7002053,001463,NYU Langone Hospitals,70 or Older,112,M,White,Not Span/Hispanic,7,Emergency,Expired,2020,INF012,CORONAVIRUS DISEASE 2019 (COVID-19),RES007,AIRWAY INTUBATION,130,RESPIRATORY SYSTEM DIAGNOSIS W VENTILATOR SUPPORT 96+ HOURS,04,DISEASES AND DISORDERS OF THE RESPIRATORY SYSTEM,4,Extreme,Extreme,Medical,Medicare,Medicaid,,,,Y,209176.67,50739.16
New York City,Manhattan,7002053,001463,NYU Langone Hospitals,50 to 69,114,M,Black/African American,Not Span/Hispanic,17,Emergency,Home or Self Care,2020,INF012,CORONAVIRUS DISEASE 2019 (COVID-19),OTR004,ISOLATION PROCEDURES,130,RESPIRATORY SYSTEM DIAGNOSIS W VENTILATOR SUPPORT 96+ HOURS,04,DISEASES AND DISORDERS OF THE RESPIRATORY SYSTEM,4,Extreme,Extreme,Medical,Private Health Insurance,,,,,Y,417617.27,120835.1
New York City,Manhattan,7002053,001463,NYU Langone Hospitals,50 to 69,114,F,White,Not Span/Hispanic,11,Emergency,Home or Self Care,2020,INF012,CORONAVIRUS DISEASE 2019 (COVID-19),ESA003,MECHANICAL VENTILATION,130,RESPIRATORY SYSTEM DIAGNOSIS W VENTILATOR SUPPORT 96+ HOURS,04,DISEASES AND DISORDERS OF THE RESPIRATORY SYSTEM,4,Extreme,Extreme,Medical,Medicare,,,,,Y,201192.84,68465.6
New York City,Manhattan,7002053,001463,NYU Langone Hospitals,18 to 29,113,M,Other Race,Unknown,29,Emergency,Home w/ Home Health Services,2020,INF012,CORONAVIRUS DISEASE 2019 (COVID-19),ESA003,MECHANICAL VENTILATION,130,RESPIRATORY SYSTEM DIAGNOSIS W VENTILATOR SUPPORT 96+ HOURS,04,DISEASES AND DISORDERS OF THE RESPIRATORY SYSTEM,4,Extreme,Major,Medical,Medicaid,,,,,Y,930049.58,203810.33
New York City,Manhattan,7002053,001463,NYU Langone Hospitals,50 to 69,112,M,Other Race,Not Span/Hispanic,26,Emergency,Expired,2020,INF012,CORONAVIRUS DISEASE 2019 (COVID-19),OTR004,ISOLATION PROCEDURES,130,RESPIRATORY SYSTEM DIAGNOSIS W VENTILATOR SUPPORT 96+ HOURS,04,DISEASES AND DISORDERS OF THE RESPIRATORY SYSTEM,4,Extreme,Extreme,Medical,Medicare,Medicaid,,,,Y,596719.13,202642.57
New York City,Manhattan,7002053,001463,NYU Langone Hospitals,50 to 69,112,M,White,Not Span/Hispanic,20,Emergency,Inpatient Rehabilitation Facility,2020,INF012,CORONAVIRUS DISEASE 2019 (COVID-19),RES007,AIRWAY INTUBATION,130,RESPIRATORY SYSTEM DIAGNOSIS W VENTILATOR SUPPORT 96+ HOURS,04,DISEASES AND DISORDERS OF THE RESPIRATORY SYSTEM,2,Moderate,Moderate,Medical,Private Health Insurance,,,,,Y,326126.34,97150.7
New York City,Manhattan,7002053,001463,NYU Langone Hospitals,50 to 69,112,F,Other Race,Unknown,22,Emergency,Home w/ Home Health Services,2020,INF012,CORONAVIRUS DISEASE 2019 (COVID-19),RES007,AIRWAY INTUBATION,130,RESPIRATORY SYSTEM DIAGNOSIS W VENTILATOR SUPPORT 96+ HOURS,04,DISEASES AND DISORDERS OF THE RESPIRATORY SYSTEM,3,Major,Extreme,Medical,Medicare,Medicaid,,,,Y,511195.38,140072.72
New York City,Manhattan,7002053,001463,NYU Langone Hospitals,30 to 49,112,F,White,Not Span/Hispanic,31,Emergency,Inpatient Rehabilitation Facility,2020,INF012,CORONAVIRUS DISEASE 2019 (COVID-19),RES007,AIRWAY INTUBATION,130,RESPIRATORY SYSTEM DIAGNOSIS W VENTILATOR SUPPORT 96+ HOURS,04,DISEASES AND DISORDERS OF THE RESPIRATORY SYSTEM,4,Extreme,Extreme,Medical,Blue Cross/Blue Shield,,,,,Y,660723.2,204550.77
New York City,Manhattan,7002053,001463,NYU Langone Hospitals,70 or Older,112,M,White,Not Span/Hispanic,31,Emergency,Expired,2020,INF012,CORONAVIRUS DISEASE 2019 (COVID-19),CAR024,VENOUS AND ARTERIAL CATHETER PLACEMENT,130,RESPIRATORY SYSTEM DIAGNOSIS W VENTILATOR SUPPORT 96+ HOURS,04,DISEASES AND DISORDERS OF THE RESPIRATORY SYSTEM,4,Extreme,Extreme,Medical,Medicare,Medicaid,,,,Y,539177.07,166360.38
New York City,Manhattan,7002053,001463,NYU Langone Hospitals,70 or Older,104,F,Black/African American,Spanish/Hispanic,15,Emergency,Expired,2020,INF012,CORONAVIRUS DISEASE 2019 (COVID-19),RES007,AIRWAY INTUBATION,130,RESPIRATORY SYSTEM DIAGNOSIS W VENTILATOR SUPPORT 96+ HOURS,04,DISEASES AND DISORDERS OF THE RESPIRATORY SYSTEM,3,Major,Major,Medical,Medicare,,,,,Y,358475.26,106264.93
New York City,Manhattan,7002053,001463,NYU Langone Hospitals,50 to 69,112,F,White,Unknown,39,Emergency,Inpatient Rehabilitation Facility,2020,INF012,CORONAVIRUS DISEASE 2019 (COVID-19),RES007,AIRWAY INTUBATION,130,RESPIRATORY SYSTEM DIAGNOSIS W VENTILATOR SUPPORT 96+ HOURS,04,DISEASES AND DISORDERS OF THE RESPIRATORY SYSTEM,3,Major,Major,Medical,Blue Cross/Blue Shield,Medicare,,,,Y,671579.39,182894.81
New York City,Manhattan,7002053,001463,NYU Langone Hospitals,70 or Older,112,M,Other Race,Spanish/Hispanic,46,Emergency,Skilled Nursing Home,2020,INF012,CORONAVIRUS DISEASE 2019 (COVID-19),RES007,AIRWAY INTUBATION,130,RESPIRATORY SYSTEM DIAGNOSIS W VENTILATOR SUPPORT 96+ HOURS,04,DISEASES AND DISORDERS OF THE RESPIRATORY SYSTEM,4,Extreme,Extreme,Medical,Medicare,Medicaid,,,,Y,558816.56,201159.64
New York City,Manhattan,7002053,001463,NYU Langone Hospitals,70 or Older,112,M,White,Not Span/Hispanic,8,Elective,Expired,2020,RSP012,RESPIRATORY FAILURE; INSUFFICIENCY; ARREST,ESA003,MECHANICAL VENTILATION,130,RESPIRATORY SYSTEM DIAGNOSIS W VENTILATOR SUPPORT 96+ HOURS,04,DISEASES AND DISORDERS OF THE RESPIRATORY SYSTEM,3,Major,Extreme,Medical,Medicare,,,,,N,293057.76,58724.16
New York City,Manhattan,7002053,001463,NYU Langone Hospitals,70 or Older,112,F,Black/African American,Not Span/Hispanic,50,Emergency,Skilled Nursing Home,2020,INF012,CORONAVIRUS DISEASE 2019 (COVID-19),ESA003,MECHANICAL VENTILATION,130,RESPIRATORY SYSTEM DIAGNOSIS W VENTILATOR SUPPORT 96+ HOURS,04,DISEASES AND DISORDERS OF THE RESPIRATORY SYSTEM,4,Extreme,Extreme,Medical,Medicare,Medicaid,,,,Y,1118514.83,346964.18
New York City,Manhattan,7002053,001463,NYU Langone Hospitals,30 to 49,112,F,White,Not Span/Hispanic,46,Emergency,Inpatient Rehabilitation Facility,2020,INF012,CORONAVIRUS DISEASE 2019 (COVID-19),ESA003,MECHANICAL VENTILATION,130,RESPIRATORY SYSTEM DIAGNOSIS W VENTILATOR SUPPORT 96+ HOURS,04,DISEASES AND DISORDERS OF THE RESPIRATORY SYSTEM,4,Extreme,Extreme,Medical,Private Health Insurance,Medicare,,,,Y,1313742.85,371279.41
New York City,Manhattan,7002053,001463,NYU Langone Hospitals,30 to 49,104,F,Black/African American,Not Span/Hispanic,3,Emergency,Expired,2020,INJ036,"COMPLICATION OF TRANSPLANTED ORGANS OR TISSUE, INITIAL ENCOUNTER",ADM002,TRANSFUSION OF PLASMA,130,RESPIRATORY SYSTEM DIAGNOSIS W VENTILATOR SUPPORT 96+ HOURS,04,DISEASES AND DISORDERS OF THE RESPIRATORY SYSTEM,4,Extreme,Extreme,Medical,Medicaid,,,,,N,153432.14,36814.77
New York City,Manhattan,7002053,001463,NYU Langone Hospitals,0 to 17,112,F,Other Race,Not Span/Hispanic,60,Emergency,Inpatient Rehabilitation Facility,2020,INF012,CORONAVIRUS DISEASE 2019 (COVID-19),LYM007,BONE MARROW BIOPSY,130,RESPIRATORY SYSTEM DIAGNOSIS W VENTILATOR SUPPORT 96+ HOURS,04,DISEASES AND DISORDERS OF THE RESPIRATORY SYSTEM,4,Extreme,Extreme,Medical,Medicaid,,,,,Y,2758139.39,351289.69
New York City,Manhattan,7002053,001463,NYU Langone Hospitals,0 to 17,112,F,Other Race,Spanish/Hispanic,14,Emergency,Expired,2020,RSP002,PNEUMONIA (EXCEPT THAT CAUSED BY TUBERCULOSIS),ADM017,ADMINISTRATION OF NUTRITIONAL AND ELECTROLYTIC SUBSTANCES,130,RESPIRATORY SYSTEM DIAGNOSIS W VENTILATOR SUPPORT 96+ HOURS,04,DISEASES AND DISORDERS OF THE RESPIRATORY SYSTEM,4,Extreme,Extreme,Medical,Medicaid,,,,,Y,559226.96,88492.98
New York City,Manhattan,7002053,001463,NYU Langone Hospitals,0 to 17,112,M,White,Not Span/Hispanic,15,Emergency,Home or Self Care,2020,RSP012,RESPIRATORY FAILURE; INSUFFICIENCY; ARREST,RES001,BRONCHOSCOPY (DIAGNOSTIC),130,RESPIRATORY SYSTEM DIAGNOSIS W VENTILATOR SUPPORT 96+ HOURS,04,DISEASES AND DISORDERS OF THE RESPIRATORY SYSTEM,3,Major,Major,Medical,Medicaid,,,,,Y,369149.59,91516.98
New York City,Manhattan,7002053,001463,NYU Langone Hospitals,70 or Older,112,M,White,Not Span/Hispanic,15,Emergency,Expired,2020,RSP002,PNEUMONIA (EXCEPT THAT CAUSED BY TUBERCULOSIS),CAR024,VENOUS AND ARTERIAL CATHETER PLACEMENT,130,RESPIRATORY SYSTEM DIAGNOSIS W VENTILATOR SUPPORT 96+ HOURS,04,DISEASES AND DISORDERS OF THE RESPIRATORY SYSTEM,4,Extreme,Extreme,Medical,Medicare,Medicaid,,,,Y,516388.08,156323.73
New York City,Manhattan,7002053,001463,NYU Langone Hospitals,30 to 49,104,F,Other Race,Not Span/Hispanic,14,Emergency,Medicare Cert Long Term Care Hospital,2020,RSP010,ASPIRATION PNEUMONITIS,ESA003,MECHANICAL VENTILATION,130,RESPIRATORY SYSTEM DIAGNOSIS W VENTILATOR SUPPORT 96+ HOURS,04,DISEASES AND DISORDERS OF THE RESPIRATORY SYSTEM,3,Major,Major,Medical,Medicaid,,,,,Y,346126.59,127124.54
New York City,Manhattan,7002053,001463,NYU Langone Hospitals,70 or Older,114,F,Black/African American,Not Span/Hispanic,38,Emergency,Hospice - Medical Facility,2020,RSP012,RESPIRATORY FAILURE; INSUFFICIENCY; ARREST,OTR004,ISOLATION PROCEDURES,130,RESPIRATORY SYSTEM DIAGNOSIS W VENTILATOR SUPPORT 96+ HOURS,04,DISEASES AND DISORDERS OF THE RESPIRATORY SYSTEM,3,Major,Major,Medical,Medicare,,,,,Y,1020859.07,288788.65
New York City,Manhattan,7002053,001463,NYU Langone Hospitals,30 to 49,113,F,Other Race,Not Span/Hispanic,15,Emergency,Expired,2020,RSP002,PNEUMONIA (EXCEPT THAT CAUSED BY TUBERCULOSIS),CAR024,VENOUS AND ARTERIAL CATHETER PLACEMENT,130,RESPIRATORY SYSTEM DIAGNOSIS W VENTILATOR SUPPORT 96+ HOURS,04,DISEASES AND DISORDERS OF THE RESPIRATORY SYSTEM,2,Moderate,Major,Medical,Medicaid,,,,,Y,497525.57,134998.12
New York City,Manhattan,7002053,001463,NYU Langone Hospitals,30 to 49,100,M,Other Race,Not Span/Hispanic,14,Emergency,Home or Self Care,2020,RSP009,ASTHMA,RES007,AIRWAY INTUBATION,130,RESPIRATORY SYSTEM DIAGNOSIS W VENTILATOR SUPPORT 96+ HOURS,04,DISEASES AND DISORDERS OF THE RESPIRATORY SYSTEM,3,Major,Major,Medical,Medicaid,,,,,Y,335125.43,105510.78
New York City,Manhattan,7002053,001463,NYU Langone Hospitals,50 to 69,113,M,White,Not Span/Hispanic,25,Emergency,Expired,2020,RSP012,RESPIRATORY FAILURE; INSUFFICIENCY; ARREST,ESA003,MECHANICAL VENTILATION,130,RESPIRATORY SYSTEM DIAGNOSIS W VENTILATOR SUPPORT 96+ HOURS,04,DISEASES AND DISORDERS OF THE RESPIRATORY SYSTEM,4,Extreme,Extreme,Medical,Medicare,Medicaid,,,,Y,733481.27,199125.45
New York City,Manhattan,7002053,001463,NYU Langone Hospitals,70 or Older,103,M,White,Not Span/Hispanic,19,Emergency,Expired,2020,INJ030,DRUG INDUCED OR TOXIC RELATED CONDITION,ESA003,MECHANICAL VENTILATION,130,RESPIRATORY SYSTEM DIAGNOSIS W VENTILATOR SUPPORT 96+ HOURS,04,DISEASES AND DISORDERS OF THE RESPIRATORY SYSTEM,4,Extreme,Extreme,Medical,Medicare,Blue Cross/Blue Shield,,,,N,422340.01,118383.98
New York City,Manhattan,7002053,001463,NYU Langone Hospitals,0 to 17,OOS,F,Other Race,Unknown,38,Urgent,Inpatient Rehabilitation Facility,2020,RSP017,POSTPROCEDURAL OR POSTOPERATIVE RESPIRATORY SYSTEM COMPLICATION,ENT001,LARYNGOSCOPY (DIAGNOSTIC),130,RESPIRATORY SYSTEM DIAGNOSIS W VENTILATOR SUPPORT 96+ HOURS,04,DISEASES AND DISORDERS OF THE RESPIRATORY SYSTEM,3,Major,Moderate,Medical,Medicaid,,,,,N,693797.36,203840.32
New York City,Manhattan,7002053,001463,NYU Langone Hospitals,50 to 69,112,F,Black/African American,Not Span/Hispanic,16,Emergency,Home w/ Home Health Services,2020,RSP012,RESPIRATORY FAILURE; INSUFFICIENCY; ARREST,ESA003,MECHANICAL VENTILATION,130,RESPIRATORY SYSTEM DIAGNOSIS W VENTILATOR SUPPORT 96+ HOURS,04,DISEASES AND DISORDERS OF THE RESPIRATORY SYSTEM,4,Extreme,Major,Medical,Medicare,Blue Cross/Blue Shield,Medicaid,,,Y,264027.5,84644.2
New York City,Manhattan,7002053,001463,NYU Langone Hospitals,70 or Older,112,F,Other Race,Not Span/Hispanic,29,Emergency,Skilled Nursing Home,2020,RSP012,RESPIRATORY FAILURE; INSUFFICIENCY; ARREST,RES005,CHEST TUBE PLACEMENT AND THERAPEUTIC THORACENTESIS,130,RESPIRATORY SYSTEM DIAGNOSIS W VENTILATOR SUPPORT 96+ HOURS,04,DISEASES AND DISORDERS OF THE RESPIRATORY SYSTEM,4,Extreme,Extreme,Medical,Medicare,Medicaid,,,,Y,727230.01,237202.93