Hospital Service Area,Hospital County,Operating Certificate Number,Permanent Facility Id,Facility Name,Age Group,Zip Code - 3 digits,Gender,Race,Ethnicity,Length of Stay,Type of Admission,Patient Disposition,Discharge Year,CCS Diagnosis Code,CCS Diagnosis Description,CCS Procedure Code,CCS Procedure Description,APR DRG Code,APR DRG Description,APR MDC Code,APR MDC Description,APR Severity of Illness Code,APR Severity of Illness Description,APR Risk of Mortality,APR Medical Surgical Description,Payment Typology 1,Payment Typology 2,Payment Typology 3,Birth Weight,Abortion Edit Indicator,Emergency Department Indicator,Total Charges,Total Costs
New York City,Bronx,7000006,001169,Montefiore Medical Center - Henry & Lucy Moses Div,50 to 69,104,M,Black/African American,Not Span/Hispanic,16,Emergency,Home w/ Home Health Services,2017,122,Pneumonia (except that caused by tuberculosis or sexually transmitted disease),231,OTHER THERAPEUTIC PRCS,131,Cystic fibrosis - pulmonary disease,04,Diseases and Disorders of the Respiratory System,3,Major,Major,Medical,Medicare,,,,N,Y,143627.54,31850.08
New York City,Manhattan,7002002,001439,Mount Sinai Beth Israel,30 to 49,OOS,F,White,Not Span/Hispanic,3,Urgent,Home or Self Care,2017,128,Asthma,222,BLOOD TRANSFUSION,131,Cystic fibrosis - pulmonary disease,04,Diseases and Disorders of the Respiratory System,2,Moderate,Minor,Medical,Blue Cross/Blue Shield,Medicare,Self-Pay,,N,N,100.00,8.82
New York City,Manhattan,7002002,001439,Mount Sinai Beth Israel,18 to 29,OOS,F,White,Not Span/Hispanic,7,Emergency,Home or Self Care,2017,056,Cystic fibrosis,183,ROUTINE CHEST X-RAY,131,Cystic fibrosis - pulmonary disease,04,Diseases and Disorders of the Respiratory System,2,Moderate,Minor,Medical,Private Health Insurance,Self-Pay,,,N,Y,60345.29,20448.84
New York City,Manhattan,7002002,001439,Mount Sinai Beth Israel,18 to 29,100,F,White,Not Span/Hispanic,8,Emergency,Home w/ Home Health Services,2017,056,Cystic fibrosis,231,OTHER THERAPEUTIC PRCS,131,Cystic fibrosis - pulmonary disease,04,Diseases and Disorders of the Respiratory System,3,Major,Major,Medical,Private Health Insurance,Self-Pay,,,N,Y,70974.73,22866.18
New York City,Manhattan,7002002,001439,Mount Sinai Beth Israel,18 to 29,OOS,M,White,Not Span/Hispanic,6,Urgent,Home w/ Home Health Services,2017,056,Cystic fibrosis,231,OTHER THERAPEUTIC PRCS,131,Cystic fibrosis - pulmonary disease,04,Diseases and Disorders of the Respiratory System,2,Moderate,Minor,Medical,Private Health Insurance,Self-Pay,,,N,N,52461.64,17552.68
New York City,Manhattan,7002002,001439,Mount Sinai Beth Israel,30 to 49,OOS,F,White,Not Span/Hispanic,2,Urgent,Home or Self Care,2017,056,Cystic fibrosis,231,OTHER THERAPEUTIC PRCS,131,Cystic fibrosis - pulmonary disease,04,Diseases and Disorders of the Respiratory System,1,Minor,Minor,Medical,Blue Cross/Blue Shield,Medicare,Self-Pay,,N,N,19822.02,6871.79
New York City,Manhattan,7002024,001456,Mount Sinai Hospital,0 to 17,113,F,Black/African American,Not Span/Hispanic,13,Elective,Home or Self Care,2017,056,Cystic fibrosis,041,OT NON-OR THER PRC RESP,131,Cystic fibrosis - pulmonary disease,04,Diseases and Disorders of the Respiratory System,3,Major,Moderate,Medical,Medicaid,Medicaid,Self-Pay,,N,N,120818.51,85090.17
New York City,Manhattan,7002002,001439,Mount Sinai Beth Israel,30 to 49,112,F,White,Not Span/Hispanic,14,Urgent,Home w/ Home Health Services,2017,056,Cystic fibrosis,231,OTHER THERAPEUTIC PRCS,131,Cystic fibrosis - pulmonary disease,04,Diseases and Disorders of the Respiratory System,3,Major,Moderate,Medical,Medicare,Self-Pay,,,N,N,129237.97,45798.92
New York City,Manhattan,7002024,001456,Mount Sinai Hospital,18 to 29,104,F,Black/African American,Not Span/Hispanic,14,Elective,Home or Self Care,2017,056,Cystic fibrosis,000,NO PROC,131,Cystic fibrosis - pulmonary disease,04,Diseases and Disorders of the Respiratory System,3,Major,Moderate,Medical,Medicaid,Medicaid,Self-Pay,,N,N,115011.82,85214.05
New York City,Manhattan,7002053,001463,NYU Langone Hospitals,18 to 29,112,M,Other Race,Spanish/Hispanic,2,Emergency,Home or Self Care,2017,056,Cystic fibrosis,000,NO PROC,131,Cystic fibrosis - pulmonary disease,04,Diseases and Disorders of the Respiratory System,2,Moderate,Minor,Medical,Medicaid,,,,N,Y,23076.20,8992.98
New York City,Kings,7001021,001306,New York - Presbyterian Brooklyn Methodist Hospital,70 or Older,OOS,F,White,Not Span/Hispanic,9,Emergency,Home or Self Care,2017,127,Chronic obstructive pulmonary disease and bronchiectasis,231,OTHER THERAPEUTIC PRCS,131,Cystic fibrosis - pulmonary disease,04,Diseases and Disorders of the Respiratory System,3,Major,Moderate,Medical,Medicare,Medicare,Self-Pay,,N,Y,55854.48,16188.95
New York City,Manhattan,7002054,001464,New York Presbyterian Hospital - Columbia Presbyterian Center,30 to 49,109,M,White,Not Span/Hispanic,15,Urgent,Home or Self Care,2017,122,Pneumonia (except that caused by tuberculosis or sexually transmitted disease),216,RESP INTUB/MECH VENTIL,131,Cystic fibrosis - pulmonary disease,04,Diseases and Disorders of the Respiratory System,4,Extreme,Moderate,Medical,Blue Cross/Blue Shield,Self-Pay,,,N,N,171567.22,47721.81
New York City,Manhattan,7002054,001464,New York Presbyterian Hospital - Columbia Presbyterian Center,30 to 49,115,M,White,Not Span/Hispanic,17,Urgent,Home w/ Home Health Services,2017,056,Cystic fibrosis,071,GASTROSTOMY; TEMP/PERM,131,Cystic fibrosis - pulmonary disease,04,Diseases and Disorders of the Respiratory System,4,Extreme,Major,Medical,Medicare,Blue Cross/Blue Shield,Self-Pay,,N,N,219470.59,68549.27
New York City,Manhattan,7002054,001464,New York Presbyterian Hospital - Columbia Presbyterian Center,18 to 29,OOS,F,Other Race,Not Span/Hispanic,7,Urgent,Home or Self Care,2017,127,Chronic obstructive pulmonary disease and bronchiectasis,222,BLOOD TRANSFUSION,131,Cystic fibrosis - pulmonary disease,04,Diseases and Disorders of the Respiratory System,1,Minor,Minor,Medical,Private Health Insurance,Self-Pay,,,N,N,98917.49,30056.85
New York City,Manhattan,7002054,001464,New York Presbyterian Hospital - Columbia Presbyterian Center,18 to 29,100,F,White,Not Span/Hispanic,4,Urgent,Home w/ Home Health Services,2017,122,Pneumonia (except that caused by tuberculosis or sexually transmitted disease),223,ENTERAL/PARENTERAL NUTR,131,Cystic fibrosis - pulmonary disease,04,Diseases and Disorders of the Respiratory System,4,Extreme,Moderate,Medical,Blue Cross/Blue Shield,Self-Pay,,,N,N,47306.03,13336.01
New York City,Manhattan,7002054,001464,New York Presbyterian Hospital - Columbia Presbyterian Center,0 to 17,117,M,White,Not Span/Hispanic,13,Elective,Home or Self Care,2017,056,Cystic fibrosis,000,NO PROC,131,Cystic fibrosis - pulmonary disease,04,Diseases and Disorders of the Respiratory System,3,Major,Moderate,Medical,Medicaid,Medicaid,Self-Pay,,N,N,135520.65,36842.14
New York City,Manhattan,7002054,001464,New York Presbyterian Hospital - Columbia Presbyterian Center,18 to 29,OOS,F,White,Not Span/Hispanic,6,Urgent,Home or Self Care,2017,056,Cystic fibrosis,000,NO PROC,131,Cystic fibrosis - pulmonary disease,04,Diseases and Disorders of the Respiratory System,3,Major,Moderate,Medical,Private Health Insurance,Self-Pay,,,N,N,88710.17,26590.17
New York City,Manhattan,7002054,001464,New York Presbyterian Hospital - Columbia Presbyterian Center,18 to 29,104,M,Multi-racial,Spanish/Hispanic,14,Emergency,Home or Self Care,2017,056,Cystic fibrosis,000,NO PROC,131,Cystic fibrosis - pulmonary disease,04,Diseases and Disorders of the Respiratory System,3,Major,Moderate,Medical,Medicaid,Medicaid,Self-Pay,,N,Y,168284.93,50069.12
New York City,Manhattan,7002054,001464,New York Presbyterian Hospital - Columbia Presbyterian Center,0 to 17,104,M,White,Multi-ethnic,8,Emergency,Home or Self Care,2017,056,Cystic fibrosis,000,NO PROC,131,Cystic fibrosis - pulmonary disease,04,Diseases and Disorders of the Respiratory System,2,Moderate,Minor,Medical,Private Health Insurance,Self-Pay,,,N,Y,99313.59,27703.05
New York City,Manhattan,7002054,001464,New York Presbyterian Hospital - Columbia Presbyterian Center,18 to 29,103,F,White,Not Span/Hispanic,6,Emergency,Home w/ Home Health Services,2017,056,Cystic fibrosis,000,NO PROC,131,Cystic fibrosis - pulmonary disease,04,Diseases and Disorders of the Respiratory System,2,Moderate,Minor,Medical,Medicare,Blue Cross/Blue Shield,Self-Pay,,N,Y,77079.97,21461.50
New York City,Manhattan,7002054,001464,New York Presbyterian Hospital - Columbia Presbyterian Center,0 to 17,104,F,Multi-racial,Multi-ethnic,16,Emergency,Home or Self Care,2017,056,Cystic fibrosis,223,ENTERAL/PARENTERAL NUTR,131,Cystic fibrosis - pulmonary disease,04,Diseases and Disorders of the Respiratory System,2,Moderate,Minor,Medical,Medicaid,Medicaid,Self-Pay,,N,Y,209749.01,58838.57
New York City,Manhattan,7002054,001464,New York Presbyterian Hospital - Columbia Presbyterian Center,0 to 17,107,M,White,Not Span/Hispanic,1,Emergency,Home or Self Care,2017,056,Cystic fibrosis,000,NO PROC,131,Cystic fibrosis - pulmonary disease,04,Diseases and Disorders of the Respiratory System,2,Moderate,Minor,Medical,Blue Cross/Blue Shield,Blue Cross/Blue Shield,Self-Pay,,N,Y,14367.97,3569.08
New York City,Manhattan,7002054,001464,New York Presbyterian Hospital - Columbia Presbyterian Center,30 to 49,105,F,Other Race,Not Span/Hispanic,7,Emergency,Home or Self Care,2017,056,Cystic fibrosis,054,OT VASC CATH; NOT HEART,131,Cystic fibrosis - pulmonary disease,04,Diseases and Disorders of the Respiratory System,3,Major,Moderate,Medical,Blue Cross/Blue Shield,Medicare,Self-Pay,,N,Y,90597.95,25366.29
New York City,Manhattan,7002053,001463,NYU Langone Hospitals,0 to 17,112,M,White,Not Span/Hispanic,11,Emergency,Home w/ Home Health Services,2017,056,Cystic fibrosis,054,OT VASC CATH; NOT HEART,131,Cystic fibrosis - pulmonary disease,04,Diseases and Disorders of the Respiratory System,1,Minor,Minor,Medical,Private Health Insurance,,,,N,Y,150360.03,35055.96
New York City,Manhattan,7002053,001463,NYU Langone Hospitals,18 to 29,112,F,Other Race,Spanish/Hispanic,5,Emergency,Home w/ Home Health Services,2017,056,Cystic fibrosis,216,RESP INTUB/MECH VENTIL,131,Cystic fibrosis - pulmonary disease,04,Diseases and Disorders of the Respiratory System,4,Extreme,Major,Medical,Medicaid,,,,N,Y,103104.61,44929.24
Long Island,Suffolk,5123000,000885,Brookhaven Memorial Hospital Medical Center Inc,18 to 29,117,F,White,Not Span/Hispanic,2,Emergency,Home or Self Care,2017,122,Pneumonia (except that caused by tuberculosis or sexually transmitted disease),000,NO PROC,131,Cystic fibrosis - pulmonary disease,04,Diseases and Disorders of the Respiratory System,2,Moderate,Moderate,Medical,Private Health Insurance,,,,N,Y,26463.92,3974.64
Western NY,Erie,1401014,000207,Buffalo General Medical Center,18 to 29,140,F,White,Not Span/Hispanic,14,Urgent,Home w/ Home Health Services,2017,056,Cystic fibrosis,000,NO PROC,131,Cystic fibrosis - pulmonary disease,04,Diseases and Disorders of the Respiratory System,3,Major,Minor,Medical,Medicaid,Self-Pay,,,N,N,50190.32,29977.13
Western NY,Erie,1401014,000207,Buffalo General Medical Center,18 to 29,142,F,White,Not Span/Hispanic,9,Urgent,Home or Self Care,2017,056,Cystic fibrosis,054,OT VASC CATH; NOT HEART,131,Cystic fibrosis - pulmonary disease,04,Diseases and Disorders of the Respiratory System,3,Major,Minor,Medical,Private Health Insurance,Self-Pay,,,N,N,43509.29,25247.10
Western NY,Erie,1401014,000207,Buffalo General Medical Center,18 to 29,140,F,White,Not Span/Hispanic,10,Urgent,Home or Self Care,2017,056,Cystic fibrosis,049,OTHER OR HEART PRCS,131,Cystic fibrosis - pulmonary disease,04,Diseases and Disorders of the Respiratory System,3,Major,Moderate,Medical,Blue Cross/Blue Shield,Self-Pay,,,N,N,56520.81,31318.76
Western NY,Erie,1401014,000207,Buffalo General Medical Center,18 to 29,142,F,White,Not Span/Hispanic,14,Urgent,Home or Self Care,2017,056,Cystic fibrosis,174,OT NON-OR THER PRC SKIN,131,Cystic fibrosis - pulmonary disease,04,Diseases and Disorders of the Respiratory System,3,Major,Minor,Medical,Medicaid,Self-Pay,,,N,N,76796.41,42323.78
Western NY,Erie,1401014,000207,Buffalo General Medical Center,30 to 49,141,M,White,Not Span/Hispanic,14,Urgent,Home or Self Care,2017,056,Cystic fibrosis,000,NO PROC,131,Cystic fibrosis - pulmonary disease,04,Diseases and Disorders of the Respiratory System,3,Major,Moderate,Medical,Blue Cross/Blue Shield,Self-Pay,,,N,N,48677.57,28249.16
Western NY,Erie,1401014,000207,Buffalo General Medical Center,18 to 29,143,F,White,Not Span/Hispanic,14,Urgent,Home or Self Care,2017,056,Cystic fibrosis,054,OT VASC CATH; NOT HEART,131,Cystic fibrosis - pulmonary disease,04,Diseases and Disorders of the Respiratory System,2,Moderate,Minor,Medical,Blue Cross/Blue Shield,Medicare,Medicaid,,N,N,65687.40,40458.31
Western NY,Erie,1401014,000207,Buffalo General Medical Center,30 to 49,140,M,White,Not Span/Hispanic,12,Urgent,Home or Self Care,2017,056,Cystic fibrosis,054,OT VASC CATH; NOT HEART,131,Cystic fibrosis - pulmonary disease,04,Diseases and Disorders of the Respiratory System,2,Moderate,Minor,Medical,Private Health Insurance,Self-Pay,,,N,N,44573.28,25216.48
Western NY,Erie,1401014,000207,Buffalo General Medical Center,18 to 29,148,F,White,Not Span/Hispanic,6,Urgent,Home or Self Care,2017,056,Cystic fibrosis,054,OT VASC CATH; NOT HEART,131,Cystic fibrosis - pulmonary disease,04,Diseases and Disorders of the Respiratory System,3,Major,Minor,Medical,Blue Cross/Blue Shield,Self-Pay,,,N,N,24651.19,13897.69
Western NY,Erie,1401014,000208,Women And Children's Hospital Of Buffalo,0 to 17,147,F,White,Not Span/Hispanic,13,Urgent,Home or Self Care,2017,127,Chronic obstructive pulmonary disease and bronchiectasis,054,OT VASC CATH; NOT HEART,131,Cystic fibrosis - pulmonary disease,04,Diseases and Disorders of the Respiratory System,2,Moderate,Moderate,Medical,Medicaid,Self-Pay,,,N,N,53318.15,23851.10
Western NY,Erie,1401014,000208,Women And Children's Hospital Of Buffalo,0 to 17,147,M,White,Not Span/Hispanic,11,Urgent,Home or Self Care,2017,056,Cystic fibrosis,054,OT VASC CATH; NOT HEART,131,Cystic fibrosis - pulmonary disease,04,Diseases and Disorders of the Respiratory System,2,Moderate,Minor,Medical,Medicaid,Self-Pay,,,N,N,51877.83,29983.17
Western NY,Erie,1401014,000208,Women And Children's Hospital Of Buffalo,0 to 17,147,M,White,Not Span/Hispanic,8,Urgent,Home or Self Care,2017,056,Cystic fibrosis,054,OT VASC CATH; NOT HEART,131,Cystic fibrosis - pulmonary disease,04,Diseases and Disorders of the Respiratory System,2,Moderate,Moderate,Medical,Private Health Insurance,Medicaid,Self-Pay,,N,N,44732.44,23830.23
New York City,Manhattan,7002002,001439,Mount Sinai Beth Israel,30 to 49,112,F,White,Not Span/Hispanic,2,Urgent,Home or Self Care,2017,056,Cystic fibrosis,222,BLOOD TRANSFUSION,131,Cystic fibrosis - pulmonary disease,04,Diseases and Disorders of the Respiratory System,2,Moderate,Minor,Medical,Private Health Insurance,Self-Pay,,,N,N,17952.94,5682.53
New York City,Manhattan,7002002,001439,Mount Sinai Beth Israel,30 to 49,103,M,White,Not Span/Hispanic,4,Urgent,Home or Self Care,2017,056,Cystic fibrosis,054,OT VASC CATH; NOT HEART,131,Cystic fibrosis - pulmonary disease,04,Diseases and Disorders of the Respiratory System,3,Major,Minor,Medical,Medicaid,Medicaid,Self-Pay,,N,N,42966.86,14942.65
Central NY,Jefferson,2201000,000367,Samaritan Medical Center,50 to 69,136,F,White,Not Span/Hispanic,14,Emergency,Home or Self Care,2017,056,Cystic fibrosis,054,OT VASC CATH; NOT HEART,131,Cystic fibrosis - pulmonary disease,04,Diseases and Disorders of the Respiratory System,4,Extreme,Major,Medical,Medicare,Self-Pay,Self-Pay,,N,Y,61469.08,19694.60
Capital/Adirond,Schenectady,4601001,000829,Ellis Hospital,70 or Older,123,M,White,Not Span/Hispanic,4,Emergency,Expired,2017,129,Aspiration pneumonitis; food/vomitus,216,RESP INTUB/MECH VENTIL,131,Cystic fibrosis - pulmonary disease,04,Diseases and Disorders of the Respiratory System,4,Extreme,Extreme,Medical,Medicare,Medicare,,,N,N,35986.75,15362.47
New York City,Manhattan,7002002,001439,Mount Sinai Beth Israel,18 to 29,112,M,Black/African American,Unknown,6,Urgent,Home w/ Home Health Services,2017,056,Cystic fibrosis,183,ROUTINE CHEST X-RAY,131,Cystic fibrosis - pulmonary disease,04,Diseases and Disorders of the Respiratory System,2,Moderate,Minor,Medical,Medicare,Medicaid,Self-Pay,,N,N,56247.29,19436.79
New York City,Manhattan,7002053,001446,NYU Langone Orthopedic Hospital,0 to 17,112,F,White,Not Span/Hispanic,14,Emergency,Home w/ Home Health Services,2017,007,Viral infection,054,OT VASC CATH; NOT HEART,131,Cystic fibrosis - pulmonary disease,04,Diseases and Disorders of the Respiratory System,2,Moderate,Minor,Medical,Private Health Insurance,,,,N,Y,169625.00,49789.97
New York City,Manhattan,7002053,001463,NYU Langone Hospitals,0 to 17,107,M,White,Not Span/Hispanic,3,Elective,Home or Self Care,2017,056,Cystic fibrosis,231,OTHER THERAPEUTIC PRCS,131,Cystic fibrosis - pulmonary disease,04,Diseases and Disorders of the Respiratory System,3,Major,Minor,Medical,Federal/State/Local/VA,,,,N,N,24755.21,6717.51
Finger Lakes,Monroe,2701001,000409,Highland Hospital,18 to 29,148,M,White,Not Span/Hispanic,21,Urgent,Home or Self Care,2017,056,Cystic fibrosis,054,OT VASC CATH; NOT HEART,131,Cystic fibrosis - pulmonary disease,04,Diseases and Disorders of the Respiratory System,2,Moderate,Minor,Medical,Medicare,Medicaid,,,N,N,85047.76,28251.54
Finger Lakes,Monroe,2701001,000409,Highland Hospital,30 to 49,146,M,White,Not Span/Hispanic,16,Urgent,Home or Self Care,2017,056,Cystic fibrosis,054,OT VASC CATH; NOT HEART,131,Cystic fibrosis - pulmonary disease,04,Diseases and Disorders of the Respiratory System,2,Moderate,Minor,Medical,Medicaid,,,,N,N,59242.88,20820.10
Finger Lakes,Monroe,2701001,000409,Highland Hospital,18 to 29,130,M,White,Not Span/Hispanic,14,Urgent,Home or Self Care,2017,056,Cystic fibrosis,054,OT VASC CATH; NOT HEART,131,Cystic fibrosis - pulmonary disease,04,Diseases and Disorders of the Respiratory System,3,Major,Minor,Medical,Medicaid,Medicaid,,,N,N,54103.32,17982.56
Finger Lakes,Monroe,2701001,000409,Highland Hospital,18 to 29,146,F,Black/African American,Not Span/Hispanic,15,Emergency,Home or Self Care,2017,056,Cystic fibrosis,054,OT VASC CATH; NOT HEART,131,Cystic fibrosis - pulmonary disease,04,Diseases and Disorders of the Respiratory System,3,Major,Moderate,Medical,Medicare,Medicaid,,,N,Y,50958.37,17913.10
Finger Lakes,Monroe,2701001,000409,Highland Hospital,18 to 29,146,M,White,Not Span/Hispanic,14,Urgent,Home or Self Care,2017,056,Cystic fibrosis,000,NO PROC,131,Cystic fibrosis - pulmonary disease,04,Diseases and Disorders of the Respiratory System,3,Major,Minor,Medical,Medicare,Medicaid,,,N,N,45074.51,16188.99
Finger Lakes,Monroe,2701001,000409,Highland Hospital,30 to 49,145,F,White,Not Span/Hispanic,16,Emergency,Home or Self Care,2017,056,Cystic fibrosis,173,OT DX PRC SKIN/SUBCUTAN,131,Cystic fibrosis - pulmonary disease,04,Diseases and Disorders of the Respiratory System,1,Minor,Minor,Medical,Medicare,Medicaid,,,N,N,64340.24,22062.40
New York City,Kings,7001009,001294,Coney Island Hospital,70 or Older,112,F,White,Not Span/Hispanic,6,Emergency,Home w/ Home Health Services,2017,133,Other lower respiratory disease,037,DX BRONCHOSCOPY & BIOPS,131,Cystic fibrosis - pulmonary disease,04,Diseases and Disorders of the Respiratory System,3,Major,Extreme,Medical,Medicare,Medicare,Medicaid,,N,Y,35496.93,17424.41
New York City,Manhattan,7002002,001439,Mount Sinai Beth Israel,18 to 29,OOS,F,White,Not Span/Hispanic,5,Urgent,Home or Self Care,2017,056,Cystic fibrosis,054,OT VASC CATH; NOT HEART,131,Cystic fibrosis - pulmonary disease,04,Diseases and Disorders of the Respiratory System,3,Major,Moderate,Medical,Private Health Insurance,Self-Pay,,,N,N,42609.56,14679.05
New York City,Manhattan,7002053,001463,NYU Langone Hospitals,18 to 29,112,F,Other Race,Spanish/Hispanic,5,Emergency,Home w/ Home Health Services,2017,056,Cystic fibrosis,216,RESP INTUB/MECH VENTIL,131,Cystic fibrosis - pulmonary disease,04,Diseases and Disorders of the Respiratory System,4,Extreme,Major,Medical,Medicaid,,,,N,Y,103035.25,43689.79
New York City,Manhattan,7002054,001464,New York Presbyterian Hospital - Columbia Presbyterian Center,30 to 49,100,M,Multi-racial,Not Span/Hispanic,15,Urgent,Inpatient Rehabilitation Facility,2017,056,Cystic fibrosis,000,NO PROC,131,Cystic fibrosis - pulmonary disease,04,Diseases and Disorders of the Respiratory System,4,Extreme,Major,Medical,Medicare,Medicaid,Self-Pay,,N,N,184715.10,52874.07
New York City,Manhattan,7002054,001464,New York Presbyterian Hospital - Columbia Presbyterian Center,0 to 17,OOS,M,White,Not Span/Hispanic,17,Urgent,Home or Self Care,2017,131,Respiratory failure; insufficiency; arrest (adult),041,OT NON-OR THER PRC RESP,131,Cystic fibrosis - pulmonary disease,04,Diseases and Disorders of the Respiratory System,4,Extreme,Major,Medical,Blue Cross/Blue Shield,Self-Pay,,,N,N,272059.24,138763.60
New York City,Manhattan,7002054,001464,New York Presbyterian Hospital - Columbia Presbyterian Center,30 to 49,100,M,White,Not Span/Hispanic,9,Urgent,Home or Self Care,2017,122,Pneumonia (except that caused by tuberculosis or sexually transmitted disease),054,OT VASC CATH; NOT HEART,131,Cystic fibrosis - pulmonary disease,04,Diseases and Disorders of the Respiratory System,3,Major,Moderate,Medical,Private Health Insurance,Self-Pay,,,N,N,111066.24,31461.43
New York City,Manhattan,7002054,001464,New York Presbyterian Hospital - Columbia Presbyterian Center,30 to 49,100,M,White,Not Span/Hispanic,9,Urgent,Home or Self Care,2017,122,Pneumonia (except that caused by tuberculosis or sexually transmitted disease),054,OT VASC CATH; NOT HEART,131,Cystic fibrosis - pulmonary disease,04,Diseases and Disorders of the Respiratory System,4,Extreme,Moderate,Medical,Medicaid,Medicaid,Self-Pay,,N,N,101835.29,27926.51
New York City,Manhattan,7002054,001464,New York Presbyterian Hospital - Columbia Presbyterian Center,18 to 29,117,F,White,Not Span/Hispanic,4,Urgent,Home w/ Home Health Services,2017,056,Cystic fibrosis,000,NO PROC,131,Cystic fibrosis - pulmonary disease,04,Diseases and Disorders of the Respiratory System,4,Extreme,Moderate,Medical,Private Health Insurance,Self-Pay,,,N,N,48545.97,12983.82
New York City,Manhattan,7002054,001464,New York Presbyterian Hospital - Columbia Presbyterian Center,18 to 29,104,M,White,Spanish/Hispanic,13,Emergency,Home or Self Care,2017,056,Cystic fibrosis,000,NO PROC,131,Cystic fibrosis - pulmonary disease,04,Diseases and Disorders of the Respiratory System,2,Moderate,Minor,Medical,Medicaid,Medicaid,Self-Pay,,N,N,158767.07,57633.54
New York City,Manhattan,7002054,001464,New York Presbyterian Hospital - Columbia Presbyterian Center,0 to 17,107,M,White,Not Span/Hispanic,4,Emergency,Home or Self Care,2017,125,Acute bronchitis,231,OTHER THERAPEUTIC PRCS,131,Cystic fibrosis - pulmonary disease,04,Diseases and Disorders of the Respiratory System,2,Moderate,Minor,Medical,Blue Cross/Blue Shield,Blue Cross/Blue Shield,Self-Pay,,N,Y,47731.62,12106.89
New York City,Manhattan,7002054,001464,New York Presbyterian Hospital - Columbia Presbyterian Center,30 to 49,100,M,White,Not Span/Hispanic,10,Emergency,Home or Self Care,2017,123,Influenza,054,OT VASC CATH; NOT HEART,131,Cystic fibrosis - pulmonary disease,04,Diseases and Disorders of the Respiratory System,4,Extreme,Major,Medical,Blue Cross/Blue Shield,Self-Pay,,,N,Y,129686.17,36422.99
New York City,Manhattan,7002054,001464,New York Presbyterian Hospital - Columbia Presbyterian Center,18 to 29,OOS,F,White,Not Span/Hispanic,9,Emergency,Home or Self Care,2017,122,Pneumonia (except that caused by tuberculosis or sexually transmitted disease),000,NO PROC,131,Cystic fibrosis - pulmonary disease,04,Diseases and Disorders of the Respiratory System,4,Extreme,Extreme,Medical,Blue Cross/Blue Shield,Self-Pay,,,N,Y,105174.61,28893.98