Hospital Service Area,Hospital County,Operating Certificate Number,Permanent Facility Id,Facility Name,Age Group,Zip Code - 3 digits,Gender,Race,Ethnicity,Length of Stay,Type of Admission,Patient Disposition,Discharge Year,CCS Diagnosis Code,CCS Diagnosis Description,CCS Procedure Code,CCS Procedure Description,APR DRG Code,APR DRG Description,APR MDC Code,APR MDC Description,APR Severity of Illness Code,APR Severity of Illness Description,APR Risk of Mortality,APR Medical Surgical Description,Payment Typology 1,Payment Typology 2,Payment Typology 3,Birth Weight,Abortion Edit Indicator,Emergency Department Indicator,Total Charges,Total Costs
New York City,Manhattan,7002053,001463,NYU Langone Hospitals,0 to 17,112,M,Other Race,Not Span/Hispanic,17,Emergency,Home or Self Care,2020,RSP008,CHRONIC OBSTRUCTIVE PULMONARY DISEASE AND BRONCHIECTASIS,CAR024,VENOUS AND ARTERIAL CATHETER PLACEMENT,131,CYSTIC FIBROSIS - PULMONARY DISEASE,04,DISEASES AND DISORDERS OF THE RESPIRATORY SYSTEM,3,Major,Moderate,Medical,Medicaid,,,,,Y,240318.37,55884
New York City,Manhattan,7002053,001463,NYU Langone Hospitals,0 to 17,112,F,White,Not Span/Hispanic,3,Elective,Home or Self Care,2020,RSP008,CHRONIC OBSTRUCTIVE PULMONARY DISEASE AND BRONCHIECTASIS,CAR024,VENOUS AND ARTERIAL CATHETER PLACEMENT,131,CYSTIC FIBROSIS - PULMONARY DISEASE,04,DISEASES AND DISORDERS OF THE RESPIRATORY SYSTEM,2,Moderate,Minor,Medical,Medicaid,,,,,N,78189.93,13977.59
New York City,Manhattan,7002053,001463,NYU Langone Hospitals,18 to 29,112,M,White,Unknown,25,Emergency,Home w/ Home Health Services,2020,END012,CYSTIC FIBROSIS,CAR024,VENOUS AND ARTERIAL CATHETER PLACEMENT,131,CYSTIC FIBROSIS - PULMONARY DISEASE,04,DISEASES AND DISORDERS OF THE RESPIRATORY SYSTEM,3,Major,Major,Medical,Medicaid,,,,,N,439885.27,75227.46
New York City,Manhattan,7002053,001463,NYU Langone Hospitals,0 to 17,112,M,White,Not Span/Hispanic,2,Emergency,Home or Self Care,2020,RSP005,ACUTE BRONCHITIS,,,131,CYSTIC FIBROSIS - PULMONARY DISEASE,04,DISEASES AND DISORDERS OF THE RESPIRATORY SYSTEM,1,Minor,Minor,Medical,Medicaid,,,,,Y,21723.72,5551.61
New York City,Manhattan,7002053,001463,NYU Langone Hospitals,50 to 69,112,M,Black/African American,Not Span/Hispanic,7,Emergency,Home w/ Home Health Services,2020,RSP002,PNEUMONIA (EXCEPT THAT CAUSED BY TUBERCULOSIS),CAR024,VENOUS AND ARTERIAL CATHETER PLACEMENT,131,CYSTIC FIBROSIS - PULMONARY DISEASE,04,DISEASES AND DISORDERS OF THE RESPIRATORY SYSTEM,4,Extreme,Major,Medical,Medicare,,,,,Y,96593.99,26875.2
New York City,Manhattan,7002053,001463,NYU Langone Hospitals,0 to 17,112,F,Other Race,Not Span/Hispanic,6,Emergency,Home or Self Care,2020,END012,CYSTIC FIBROSIS,,,131,CYSTIC FIBROSIS - PULMONARY DISEASE,04,DISEASES AND DISORDERS OF THE RESPIRATORY SYSTEM,3,Major,Minor,Medical,Medicaid,,,,,N,65433.91,15722.05
New York City,Manhattan,7002053,001463,NYU Langone Hospitals,70 or Older,100,M,White,Not Span/Hispanic,22,Emergency,Inpatient Rehabilitation Facility,2020,INF012,CORONAVIRUS DISEASE 2019 (COVID-19),OTR004,ISOLATION PROCEDURES,131,CYSTIC FIBROSIS - PULMONARY DISEASE,04,DISEASES AND DISORDERS OF THE RESPIRATORY SYSTEM,4,Extreme,Extreme,Medical,Medicare,Medicare,,,,Y,235008.25,76710.42
New York City,Manhattan,7002053,001463,NYU Langone Hospitals,18 to 29,112,M,White,Not Span/Hispanic,15,Emergency,Home w/ Home Health Services,2020,END012,CYSTIC FIBROSIS,RES001,BRONCHOSCOPY (DIAGNOSTIC),131,CYSTIC FIBROSIS - PULMONARY DISEASE,04,DISEASES AND DISORDERS OF THE RESPIRATORY SYSTEM,4,Extreme,Major,Medical,Medicaid,,,,,N,248458.44,45269.93
New York City,Manhattan,7002053,001463,NYU Langone Hospitals,18 to 29,112,M,White,Not Span/Hispanic,9,Emergency,Short-term Hospital,2020,END012,CYSTIC FIBROSIS,ESA004,NON-INVASIVE VENTILATION,131,CYSTIC FIBROSIS - PULMONARY DISEASE,04,DISEASES AND DISORDERS OF THE RESPIRATORY SYSTEM,4,Extreme,Extreme,Medical,Medicaid,,,,,N,310040.05,54133.5
New York City,Manhattan,7002053,001463,NYU Langone Hospitals,30 to 49,112,M,White,Not Span/Hispanic,6,Emergency,Home w/ Home Health Services,2020,INJ036,"COMPLICATION OF TRANSPLANTED ORGANS OR TISSUE, INITIAL ENCOUNTER",ESA001,HEMODIALYSIS,131,CYSTIC FIBROSIS - PULMONARY DISEASE,04,DISEASES AND DISORDERS OF THE RESPIRATORY SYSTEM,4,Extreme,Extreme,Medical,Medicare,Blue Cross/Blue Shield,Medicaid,,,N,117152.2,40032.7
New York City,Manhattan,7002053,001463,NYU Langone Hospitals,18 to 29,112,F,Other Race,Spanish/Hispanic,8,Urgent,Home or Self Care,2020,END012,CYSTIC FIBROSIS,RES001,BRONCHOSCOPY (DIAGNOSTIC),131,CYSTIC FIBROSIS - PULMONARY DISEASE,04,DISEASES AND DISORDERS OF THE RESPIRATORY SYSTEM,2,Moderate,Minor,Medical,Medicaid,,,,,N,148982.27,33352.36
New York City,Manhattan,7002053,001463,NYU Langone Hospitals,30 to 49,103,M,White,Not Span/Hispanic,3,Emergency,Home w/ Home Health Services,2020,INJ036,"COMPLICATION OF TRANSPLANTED ORGANS OR TISSUE, INITIAL ENCOUNTER",CAR024,VENOUS AND ARTERIAL CATHETER PLACEMENT,131,CYSTIC FIBROSIS - PULMONARY DISEASE,04,DISEASES AND DISORDERS OF THE RESPIRATORY SYSTEM,2,Moderate,Major,Medical,Medicaid,,,,,N,70700.67,20972.54
New York City,Manhattan,7002053,001463,NYU Langone Hospitals,30 to 49,103,M,White,Not Span/Hispanic,2,Elective,Home w/ Home Health Services,2020,END012,CYSTIC FIBROSIS,,,131,CYSTIC FIBROSIS - PULMONARY DISEASE,04,DISEASES AND DISORDERS OF THE RESPIRATORY SYSTEM,2,Moderate,Minor,Medical,Private Health Insurance,,,,,N,43823.49,11576.5
New York City,Manhattan,7002053,001463,NYU Langone Hospitals,30 to 49,112,F,White,Not Span/Hispanic,2,Emergency,Home or Self Care,2020,END012,CYSTIC FIBROSIS,CAR024,VENOUS AND ARTERIAL CATHETER PLACEMENT,131,CYSTIC FIBROSIS - PULMONARY DISEASE,04,DISEASES AND DISORDERS OF THE RESPIRATORY SYSTEM,2,Moderate,Minor,Medical,Medicaid,,,,,N,68079.22,13679.5
New York City,Manhattan,7002053,001463,NYU Langone Hospitals,0 to 17,112,M,Other Race,Spanish/Hispanic,11,Emergency,Home w/ Home Health Services,2020,END012,CYSTIC FIBROSIS,CAR024,VENOUS AND ARTERIAL CATHETER PLACEMENT,131,CYSTIC FIBROSIS - PULMONARY DISEASE,04,DISEASES AND DISORDERS OF THE RESPIRATORY SYSTEM,3,Major,Minor,Medical,Medicaid,,,,,N,167986.92,41397.66
New York City,Manhattan,7002053,001463,NYU Langone Hospitals,0 to 17,112,F,White,Not Span/Hispanic,5,Emergency,Home w/ Home Health Services,2020,END012,CYSTIC FIBROSIS,MAM014,PULMONARY FUNCTION TESTS,131,CYSTIC FIBROSIS - PULMONARY DISEASE,04,DISEASES AND DISORDERS OF THE RESPIRATORY SYSTEM,1,Minor,Minor,Medical,Medicaid,,,,,Y,122297.96,23112.88
New York City,Manhattan,7002053,001463,NYU Langone Hospitals,70 or Older,117,F,White,Not Span/Hispanic,4,Emergency,Home w/ Home Health Services,2020,RSP017,POSTPROCEDURAL OR POSTOPERATIVE RESPIRATORY SYSTEM COMPLICATION,RES005,CHEST TUBE PLACEMENT AND THERAPEUTIC THORACENTESIS,131,CYSTIC FIBROSIS - PULMONARY DISEASE,04,DISEASES AND DISORDERS OF THE RESPIRATORY SYSTEM,2,Moderate,Minor,Medical,Medicare,Private Health Insurance,,,,N,68781.75,21562
New York City,Manhattan,7002053,001463,NYU Langone Hospitals,18 to 29,112,M,White,Not Span/Hispanic,10,Emergency,Home w/ Home Health Services,2020,END012,CYSTIC FIBROSIS,OTR004,ISOLATION PROCEDURES,131,CYSTIC FIBROSIS - PULMONARY DISEASE,04,DISEASES AND DISORDERS OF THE RESPIRATORY SYSTEM,4,Extreme,Major,Medical,Private Health Insurance,Medicaid,,,,N,201905.66,56331.39
New York City,Manhattan,7002053,001463,NYU Langone Hospitals,18 to 29,115,F,Other Race,Not Span/Hispanic,1,Emergency,Home or Self Care,2020,CIR013,ACUTE PULMONARY EMBOLISM,,,131,CYSTIC FIBROSIS - PULMONARY DISEASE,04,DISEASES AND DISORDERS OF THE RESPIRATORY SYSTEM,2,Moderate,Minor,Medical,Medicaid,,,,,Y,44501.57,8494.14
