Hospital Service Area,Hospital County,Operating Certificate Number,Permanent Facility Id,Facility Name,Age Group,Zip Code - 3 digits,Gender,Race,Ethnicity,Length of Stay,Type of Admission,Patient Disposition,Discharge Year,CCS Diagnosis Code,CCS Diagnosis Description,CCS Procedure Code,CCS Procedure Description,APR DRG Code,APR DRG Description,APR MDC Code,APR MDC Description,APR Severity of Illness Code,APR Severity of Illness Description,APR Risk of Mortality,APR Medical Surgical Description,Payment Typology 1,Payment Typology 2,Payment Typology 3,Birth Weight,Abortion Edit Indicator,Emergency Department Indicator,Total Charges,Total Costs
New York City,Manhattan,7002001,001438,Bellevue Hospital Center,50 to 69,100,F,Other Race,Not Span/Hispanic,11,Emergency,Home w/ Home Health Services,2017,131,Respiratory failure; insufficiency; arrest (adult),216,RESP INTUB/MECH VENTIL,133,Respiratory Failure,04,Diseases and Disorders of the Respiratory System,3,Major,Major,Medical,Medicaid,,,,N,Y,67806.10,43717.85
New York City,Manhattan,7002001,001438,Bellevue Hospital Center,70 or Older,100,F,White,Not Span/Hispanic,14,Emergency,Skilled Nursing Home,2017,131,Respiratory failure; insufficiency; arrest (adult),216,RESP INTUB/MECH VENTIL,133,Respiratory Failure,04,Diseases and Disorders of the Respiratory System,2,Moderate,Major,Medical,Medicare,Medicaid,,,N,Y,72452.05,46713.31
New York City,Manhattan,7002001,001438,Bellevue Hospital Center,50 to 69,104,M,Black/African American,Not Span/Hispanic,14,Emergency,Home w/ Home Health Services,2017,131,Respiratory failure; insufficiency; arrest (adult),193,DX ULTRASOUND HEART,133,Respiratory Failure,04,Diseases and Disorders of the Respiratory System,4,Extreme,Major,Medical,Medicare,Medicaid,,,N,N,79221.59,51077.96
New York City,Manhattan,7002001,001438,Bellevue Hospital Center,50 to 69,113,M,Other Race,Not Span/Hispanic,5,Emergency,Home w/ Home Health Services,2017,131,Respiratory failure; insufficiency; arrest (adult),041,OT NON-OR THER PRC RESP,133,Respiratory Failure,04,Diseases and Disorders of the Respiratory System,2,Moderate,Minor,Medical,Medicare,Medicaid,,,N,Y,31624.59,20389.89
New York City,Manhattan,7002001,001438,Bellevue Hospital Center,50 to 69,112,F,Black/African American,Not Span/Hispanic,3,Emergency,Home or Self Care,2017,131,Respiratory failure; insufficiency; arrest (adult),216,RESP INTUB/MECH VENTIL,133,Respiratory Failure,04,Diseases and Disorders of the Respiratory System,2,Moderate,Moderate,Medical,Medicaid,Medicaid,,,N,Y,22568.38,14550.92
New York City,Manhattan,7002001,001438,Bellevue Hospital Center,70 or Older,100,M,White,Not Span/Hispanic,5,Emergency,Home or Self Care,2017,131,Respiratory failure; insufficiency; arrest (adult),216,RESP INTUB/MECH VENTIL,133,Respiratory Failure,04,Diseases and Disorders of the Respiratory System,2,Moderate,Major,Medical,Medicare,Medicaid,,,N,Y,37200.31,23984.83
New York City,Manhattan,7002001,001438,Bellevue Hospital Center,70 or Older,100,M,White,Not Span/Hispanic,1,Emergency,Home or Self Care,2017,131,Respiratory failure; insufficiency; arrest (adult),216,RESP INTUB/MECH VENTIL,133,Respiratory Failure,04,Diseases and Disorders of the Respiratory System,2,Moderate,Major,Medical,Medicare,Medicaid,,,N,Y,8787.50,5665.72
New York City,Manhattan,7002001,001438,Bellevue Hospital Center,70 or Older,100,F,Other Race,Spanish/Hispanic,10,Emergency,Home w/ Home Health Services,2017,131,Respiratory failure; insufficiency; arrest (adult),041,OT NON-OR THER PRC RESP,133,Respiratory Failure,04,Diseases and Disorders of the Respiratory System,3,Major,Major,Medical,Medicare,Medicare,Medicaid,,N,Y,57393.53,37004.36
New York City,Manhattan,7002001,001438,Bellevue Hospital Center,70 or Older,100,F,Other Race,Spanish/Hispanic,14,Emergency,Home w/ Home Health Services,2017,131,Respiratory failure; insufficiency; arrest (adult),216,RESP INTUB/MECH VENTIL,133,Respiratory Failure,04,Diseases and Disorders of the Respiratory System,4,Extreme,Extreme,Medical,Medicare,Medicare,Medicaid,,N,N,75538.33,48703.19
New York City,Manhattan,7002001,001438,Bellevue Hospital Center,30 to 49,100,M,Black/African American,Not Span/Hispanic,22,Emergency,Left Against Medical Advice,2017,131,Respiratory failure; insufficiency; arrest (adult),041,OT NON-OR THER PRC RESP,133,Respiratory Failure,04,Diseases and Disorders of the Respiratory System,2,Moderate,Major,Medical,Medicaid,Medicaid,,,N,Y,107495.18,69307.30
New York City,Manhattan,7002001,001438,Bellevue Hospital Center,50 to 69,104,M,Other Race,Not Span/Hispanic,2,Emergency,Left Against Medical Advice,2017,131,Respiratory failure; insufficiency; arrest (adult),177,COMP AXIAL TOMOGR (CT),133,Respiratory Failure,04,Diseases and Disorders of the Respiratory System,2,Moderate,Moderate,Medical,Medicaid,Medicaid,,,N,Y,18452.16,11896.99
New York City,Manhattan,7002001,001438,Bellevue Hospital Center,70 or Older,100,F,Black/African American,Not Span/Hispanic,2,Emergency,Home or Self Care,2017,131,Respiratory failure; insufficiency; arrest (adult),216,RESP INTUB/MECH VENTIL,133,Respiratory Failure,04,Diseases and Disorders of the Respiratory System,4,Extreme,Major,Medical,Medicare,Medicare,Medicaid,,N,Y,14996.61,9669.03
New York City,Manhattan,7002001,001438,Bellevue Hospital Center,50 to 69,100,M,Other Race,Spanish/Hispanic,3,Emergency,Home or Self Care,2017,131,Respiratory failure; insufficiency; arrest (adult),216,RESP INTUB/MECH VENTIL,133,Respiratory Failure,04,Diseases and Disorders of the Respiratory System,4,Extreme,Major,Medical,Medicare,Medicare,Medicaid,,N,Y,21911.20,14127.20
New York City,Manhattan,7002001,001438,Bellevue Hospital Center,30 to 49,100,F,Black/African American,Not Span/Hispanic,25,Emergency,Home or Self Care,2017,131,Respiratory failure; insufficiency; arrest (adult),216,RESP INTUB/MECH VENTIL,133,Respiratory Failure,04,Diseases and Disorders of the Respiratory System,3,Major,Moderate,Medical,Medicaid,,,,N,Y,132061.85,85146.61
New York City,Manhattan,7002001,001438,Bellevue Hospital Center,50 to 69,100,M,Black/African American,Not Span/Hispanic,26,Emergency,Left Against Medical Advice,2017,131,Respiratory failure; insufficiency; arrest (adult),193,DX ULTRASOUND HEART,133,Respiratory Failure,04,Diseases and Disorders of the Respiratory System,3,Major,Major,Medical,Medicare,Medicare,Medicaid,,N,Y,148632.73,95830.66
New York City,Manhattan,7002001,001438,Bellevue Hospital Center,30 to 49,100,M,White,Not Span/Hispanic,33,Emergency,Skilled Nursing Home,2017,131,Respiratory failure; insufficiency; arrest (adult),216,RESP INTUB/MECH VENTIL,133,Respiratory Failure,04,Diseases and Disorders of the Respiratory System,4,Extreme,Extreme,Medical,Medicare,,,,N,Y,202172.75,130350.48
New York City,Manhattan,7002001,001438,Bellevue Hospital Center,50 to 69,100,M,White,Not Span/Hispanic,4,Emergency,Home or Self Care,2017,131,Respiratory failure; insufficiency; arrest (adult),216,RESP INTUB/MECH VENTIL,133,Respiratory Failure,04,Diseases and Disorders of the Respiratory System,4,Extreme,Major,Medical,Medicaid,Medicaid,,,N,Y,27913.64,17997.26
New York City,Manhattan,7002001,001438,Bellevue Hospital Center,70 or Older,100,F,Black/African American,Not Span/Hispanic,5,Emergency,Hospice - Medical Facility,2017,131,Respiratory failure; insufficiency; arrest (adult),216,RESP INTUB/MECH VENTIL,133,Respiratory Failure,04,Diseases and Disorders of the Respiratory System,3,Major,Major,Medical,Medicaid,,,,N,Y,31923.45,20582.58
New York City,Manhattan,7002001,001438,Bellevue Hospital Center,18 to 29,113,M,White,Not Span/Hispanic,1,Emergency,Left Against Medical Advice,2017,131,Respiratory failure; insufficiency; arrest (adult),216,RESP INTUB/MECH VENTIL,133,Respiratory Failure,04,Diseases and Disorders of the Respiratory System,2,Moderate,Minor,Medical,Medicaid,Medicaid,,,N,Y,9441.76,6087.56
New York City,Manhattan,7002001,001438,Bellevue Hospital Center,70 or Older,100,M,White,Not Span/Hispanic,61,Emergency,Home w/ Home Health Services,2017,131,Respiratory failure; insufficiency; arrest (adult),216,RESP INTUB/MECH VENTIL,133,Respiratory Failure,04,Diseases and Disorders of the Respiratory System,4,Extreme,Extreme,Medical,Medicare,Medicare,Medicaid,,N,N,332609.93,214449.59
New York City,Manhattan,7002001,001438,Bellevue Hospital Center,30 to 49,112,M,White,Not Span/Hispanic,16,Emergency,Home or Self Care,2017,131,Respiratory failure; insufficiency; arrest (adult),217,OTHER RESP THERAPY,133,Respiratory Failure,04,Diseases and Disorders of the Respiratory System,4,Extreme,Major,Medical,Medicaid,,,,N,Y,100893.19,65050.68
New York City,Manhattan,7002001,001438,Bellevue Hospital Center,30 to 49,112,M,White,Not Span/Hispanic,3,Emergency,Home or Self Care,2017,131,Respiratory failure; insufficiency; arrest (adult),041,OT NON-OR THER PRC RESP,133,Respiratory Failure,04,Diseases and Disorders of the Respiratory System,2,Moderate,Moderate,Medical,Medicaid,,,,N,Y,22978.80,14815.54
New York City,Manhattan,7002001,001438,Bellevue Hospital Center,50 to 69,101,M,White,Not Span/Hispanic,2,Emergency,Psychiatric Hospital or Unit of Hosp,2017,131,Respiratory failure; insufficiency; arrest (adult),217,OTHER RESP THERAPY,133,Respiratory Failure,04,Diseases and Disorders of the Respiratory System,2,Moderate,Minor,Medical,Medicare,,,,N,N,13229.26,8529.54
New York City,Manhattan,7002001,001438,Bellevue Hospital Center,0 to 17,100,M,Black/African American,Not Span/Hispanic,2,Emergency,Home or Self Care,2017,131,Respiratory failure; insufficiency; arrest (adult),216,RESP INTUB/MECH VENTIL,133,Respiratory Failure,04,Diseases and Disorders of the Respiratory System,3,Major,Major,Medical,Medicaid,Medicaid,,,N,Y,16221.99,10459.10
New York City,Manhattan,7002001,001438,Bellevue Hospital Center,50 to 69,100,F,White,Not Span/Hispanic,20,Emergency,Expired,2017,131,Respiratory failure; insufficiency; arrest (adult),216,RESP INTUB/MECH VENTIL,133,Respiratory Failure,04,Diseases and Disorders of the Respiratory System,4,Extreme,Extreme,Medical,Medicare,,,,N,N,112663.07,72639.29
New York City,Manhattan,7002001,001438,Bellevue Hospital Center,50 to 69,100,M,Other Race,Not Span/Hispanic,16,Emergency,Home or Self Care,2017,131,Respiratory failure; insufficiency; arrest (adult),216,RESP INTUB/MECH VENTIL,133,Respiratory Failure,04,Diseases and Disorders of the Respiratory System,3,Major,Major,Medical,Medicaid,,,,N,Y,102487.37,66078.53
New York City,Manhattan,7002001,001438,Bellevue Hospital Center,30 to 49,100,M,Other Race,Not Span/Hispanic,3,Emergency,Left Against Medical Advice,2017,131,Respiratory failure; insufficiency; arrest (adult),000,NO PROC,133,Respiratory Failure,04,Diseases and Disorders of the Respiratory System,2,Moderate,Minor,Medical,Self-Pay,,,,N,Y,25436.44,16400.09
New York City,Manhattan,7002001,001438,Bellevue Hospital Center,30 to 49,112,M,White,Not Span/Hispanic,1,Emergency,Home or Self Care,2017,131,Respiratory failure; insufficiency; arrest (adult),000,NO PROC,133,Respiratory Failure,04,Diseases and Disorders of the Respiratory System,2,Moderate,Moderate,Medical,Medicaid,,,,N,Y,7301.02,4707.32
New York City,Manhattan,7002001,001438,Bellevue Hospital Center,50 to 69,112,F,Other Race,Not Span/Hispanic,16,Emergency,Home w/ Home Health Services,2017,131,Respiratory failure; insufficiency; arrest (adult),058,HEMODIALYSIS,133,Respiratory Failure,04,Diseases and Disorders of the Respiratory System,3,Major,Major,Medical,Medicaid,,,,N,Y,96470.73,62199.31
New York City,Manhattan,7002001,001438,Bellevue Hospital Center,30 to 49,100,F,Black/African American,Not Span/Hispanic,22,Emergency,Skilled Nursing Home,2017,131,Respiratory failure; insufficiency; arrest (adult),041,OT NON-OR THER PRC RESP,133,Respiratory Failure,04,Diseases and Disorders of the Respiratory System,3,Major,Major,Medical,Medicare,,,,N,Y,121878.66,78581.02
New York City,Manhattan,7002001,001438,Bellevue Hospital Center,30 to 49,112,M,Other Race,Spanish/Hispanic,8,Emergency,Home or Self Care,2017,131,Respiratory failure; insufficiency; arrest (adult),216,RESP INTUB/MECH VENTIL,133,Respiratory Failure,04,Diseases and Disorders of the Respiratory System,3,Major,Moderate,Medical,Medicare,Medicare,,,N,Y,51054.60,32917.35
New York City,Manhattan,7002001,001438,Bellevue Hospital Center,18 to 29,104,M,Other Race,Not Span/Hispanic,9,Emergency,Home or Self Care,2017,131,Respiratory failure; insufficiency; arrest (adult),041,OT NON-OR THER PRC RESP,133,Respiratory Failure,04,Diseases and Disorders of the Respiratory System,3,Major,Minor,Medical,Medicaid,Medicaid,,,N,N,50224.43,32382.10
New York City,Manhattan,7002001,001438,Bellevue Hospital Center,30 to 49,100,M,Other Race,Not Span/Hispanic,1,Emergency,Left Against Medical Advice,2017,131,Respiratory failure; insufficiency; arrest (adult),216,RESP INTUB/MECH VENTIL,133,Respiratory Failure,04,Diseases and Disorders of the Respiratory System,2,Moderate,Major,Medical,Private Health Insurance,,,,N,Y,9971.13,6428.87
New York City,Manhattan,7002001,001438,Bellevue Hospital Center,50 to 69,100,F,Other Race,Spanish/Hispanic,17,Emergency,Home w/ Home Health Services,2017,131,Respiratory failure; insufficiency; arrest (adult),216,RESP INTUB/MECH VENTIL,133,Respiratory Failure,04,Diseases and Disorders of the Respiratory System,3,Major,Major,Medical,Medicare,Medicaid,,,N,Y,99376.47,64072.78
New York City,Manhattan,7002001,001438,Bellevue Hospital Center,30 to 49,100,F,Other Race,Not Span/Hispanic,19,Emergency,Left Against Medical Advice,2017,131,Respiratory failure; insufficiency; arrest (adult),216,RESP INTUB/MECH VENTIL,133,Respiratory Failure,04,Diseases and Disorders of the Respiratory System,4,Extreme,Major,Medical,Medicaid,,,,N,N,123384.79,79552.10
New York City,Manhattan,7002001,001438,Bellevue Hospital Center,50 to 69,104,F,Other Race,Spanish/Hispanic,20,Emergency,Expired,2017,131,Respiratory failure; insufficiency; arrest (adult),000,NO PROC,133,Respiratory Failure,04,Diseases and Disorders of the Respiratory System,2,Moderate,Moderate,Medical,Medicaid,,,,N,Y,115951.40,74759.43
New York City,Manhattan,7002001,001438,Bellevue Hospital Center,30 to 49,100,M,Black/African American,Not Span/Hispanic,12,Emergency,Home or Self Care,2017,131,Respiratory failure; insufficiency; arrest (adult),000,NO PROC,133,Respiratory Failure,04,Diseases and Disorders of the Respiratory System,2,Moderate,Moderate,Medical,Medicaid,Medicaid,,,N,Y,75056.87,48392.77
New York City,Manhattan,7002001,001438,Bellevue Hospital Center,30 to 49,104,M,Other Race,Spanish/Hispanic,1,Emergency,Home or Self Care,2017,131,Respiratory failure; insufficiency; arrest (adult),219,ALCO/DRUG REHAB/DETOX,133,Respiratory Failure,04,Diseases and Disorders of the Respiratory System,3,Major,Major,Medical,Self-Pay,,,,N,Y,7480.24,4822.87
New York City,Manhattan,7002001,001438,Bellevue Hospital Center,30 to 49,111,F,Other Race,Spanish/Hispanic,10,Emergency,Home w/ Home Health Services,2017,131,Respiratory failure; insufficiency; arrest (adult),000,NO PROC,133,Respiratory Failure,04,Diseases and Disorders of the Respiratory System,4,Extreme,Major,Medical,Blue Cross/Blue Shield,Medicaid,,,N,Y,62168.93,40083.29
New York City,Manhattan,7002001,001438,Bellevue Hospital Center,70 or Older,100,F,White,Not Span/Hispanic,2,Emergency,Home or Self Care,2017,131,Respiratory failure; insufficiency; arrest (adult),216,RESP INTUB/MECH VENTIL,133,Respiratory Failure,04,Diseases and Disorders of the Respiratory System,2,Moderate,Major,Medical,Medicare,Medicare,,,N,Y,17403.88,11221.12
New York City,Manhattan,7002001,001438,Bellevue Hospital Center,50 to 69,104,M,Black/African American,Not Span/Hispanic,3,Emergency,Home or Self Care,2017,131,Respiratory failure; insufficiency; arrest (adult),216,RESP INTUB/MECH VENTIL,133,Respiratory Failure,04,Diseases and Disorders of the Respiratory System,2,Moderate,Moderate,Medical,Medicaid,Medicaid,,,N,Y,19864.15,12807.37
New York City,Manhattan,7002001,001438,Bellevue Hospital Center,70 or Older,104,F,Other Race,Spanish/Hispanic,4,Emergency,Home or Self Care,2017,131,Respiratory failure; insufficiency; arrest (adult),000,NO PROC,133,Respiratory Failure,04,Diseases and Disorders of the Respiratory System,2,Moderate,Moderate,Medical,Medicaid,,,,N,Y,22979.12,14815.74
New York City,Manhattan,7002001,001438,Bellevue Hospital Center,70 or Older,104,F,Other Race,Not Span/Hispanic,5,Emergency,Home or Self Care,2017,131,Respiratory failure; insufficiency; arrest (adult),000,NO PROC,133,Respiratory Failure,04,Diseases and Disorders of the Respiratory System,2,Moderate,Moderate,Medical,Medicaid,,,,N,N,28327.07,18263.82
New York City,Manhattan,7002001,001438,Bellevue Hospital Center,30 to 49,112,M,Other Race,Not Span/Hispanic,2,Emergency,Home or Self Care,2017,131,Respiratory failure; insufficiency; arrest (adult),000,NO PROC,133,Respiratory Failure,04,Diseases and Disorders of the Respiratory System,2,Moderate,Moderate,Medical,Medicaid,Medicaid,,,N,Y,20146.90,12989.67
New York City,Manhattan,7002001,001438,Bellevue Hospital Center,70 or Older,104,F,Other Race,Not Span/Hispanic,15,Emergency,Home w/ Home Health Services,2017,131,Respiratory failure; insufficiency; arrest (adult),216,RESP INTUB/MECH VENTIL,133,Respiratory Failure,04,Diseases and Disorders of the Respiratory System,4,Extreme,Major,Medical,Medicare,Medicaid,,,N,N,94775.10,61106.06
New York City,Manhattan,7002001,001438,Bellevue Hospital Center,50 to 69,100,M,Other Race,Spanish/Hispanic,5,Emergency,Home or Self Care,2017,131,Respiratory failure; insufficiency; arrest (adult),000,NO PROC,133,Respiratory Failure,04,Diseases and Disorders of the Respiratory System,3,Major,Minor,Medical,"Managed Care, Unspecified",Medicaid,,,N,Y,27974.28,18036.36
New York City,Manhattan,7002001,001438,Bellevue Hospital Center,70 or Older,100,F,White,Not Span/Hispanic,3,Emergency,Expired,2017,131,Respiratory failure; insufficiency; arrest (adult),197,OTHER DX ULTRASOUND,133,Respiratory Failure,04,Diseases and Disorders of the Respiratory System,4,Extreme,Extreme,Medical,Medicare,Medicare,,,N,Y,19979.02,12881.43
New York City,Manhattan,7002001,001438,Bellevue Hospital Center,30 to 49,100,F,Other Race,Not Span/Hispanic,12,Emergency,Home or Self Care,2017,131,Respiratory failure; insufficiency; arrest (adult),216,RESP INTUB/MECH VENTIL,133,Respiratory Failure,04,Diseases and Disorders of the Respiratory System,3,Major,Moderate,Medical,Medicaid,Medicaid,,,N,Y,73725.73,47534.52
New York City,Manhattan,7002001,001438,Bellevue Hospital Center,50 to 69,113,M,Other Race,Not Span/Hispanic,4,Emergency,Home or Self Care,2017,131,Respiratory failure; insufficiency; arrest (adult),180,OTHER CT SCAN,133,Respiratory Failure,04,Diseases and Disorders of the Respiratory System,3,Major,Moderate,Medical,Medicaid,,,,N,Y,25557.04,16477.85
New York City,Manhattan,7002001,001438,Bellevue Hospital Center,50 to 69,100,M,Other Race,Not Span/Hispanic,3,Elective,Home or Self Care,2017,131,Respiratory failure; insufficiency; arrest (adult),216,RESP INTUB/MECH VENTIL,133,Respiratory Failure,04,Diseases and Disorders of the Respiratory System,4,Extreme,Major,Medical,Medicaid,,,,N,Y,26415.63,17031.42
New York City,Manhattan,7002001,001438,Bellevue Hospital Center,50 to 69,100,M,Other Race,Spanish/Hispanic,6,Emergency,Home or Self Care,2017,131,Respiratory failure; insufficiency; arrest (adult),000,NO PROC,133,Respiratory Failure,04,Diseases and Disorders of the Respiratory System,3,Major,Moderate,Medical,Medicare,,,,N,Y,33079.40,21327.88
New York City,Manhattan,7002001,001438,Bellevue Hospital Center,30 to 49,112,M,Black/African American,Not Span/Hispanic,3,Emergency,Home or Self Care,2017,131,Respiratory failure; insufficiency; arrest (adult),041,OT NON-OR THER PRC RESP,133,Respiratory Failure,04,Diseases and Disorders of the Respiratory System,2,Moderate,Moderate,Medical,Private Health Insurance,Medicaid,,,N,Y,19225.78,12395.78
New York City,Manhattan,7002001,001438,Bellevue Hospital Center,70 or Older,100,M,Black/African American,Not Span/Hispanic,3,Emergency,Home or Self Care,2017,131,Respiratory failure; insufficiency; arrest (adult),216,RESP INTUB/MECH VENTIL,133,Respiratory Failure,04,Diseases and Disorders of the Respiratory System,3,Major,Major,Medical,Medicare,Private Health Insurance,,,N,Y,22433.37,14463.87
New York City,Manhattan,7002001,001438,Bellevue Hospital Center,30 to 49,112,M,Black/African American,Not Span/Hispanic,1,Emergency,Expired,2017,131,Respiratory failure; insufficiency; arrest (adult),216,RESP INTUB/MECH VENTIL,133,Respiratory Failure,04,Diseases and Disorders of the Respiratory System,4,Extreme,Major,Medical,Medicaid,,,,N,N,7603.06,4902.06
New York City,Manhattan,7002001,001438,Bellevue Hospital Center,30 to 49,111,M,White,Not Span/Hispanic,1,Emergency,Short-term Hospital,2017,131,Respiratory failure; insufficiency; arrest (adult),180,OTHER CT SCAN,133,Respiratory Failure,04,Diseases and Disorders of the Respiratory System,2,Moderate,Moderate,Medical,Medicaid,,,,N,N,13906.23,8966.01
New York City,Manhattan,7002001,001438,Bellevue Hospital Center,70 or Older,112,F,Black/African American,Not Span/Hispanic,6,Emergency,Home or Self Care,2017,131,Respiratory failure; insufficiency; arrest (adult),216,RESP INTUB/MECH VENTIL,133,Respiratory Failure,04,Diseases and Disorders of the Respiratory System,2,Moderate,Major,Medical,Medicare,,,,N,Y,43322.90,27932.35
New York City,Manhattan,7002001,001438,Bellevue Hospital Center,50 to 69,OOS,M,Other Race,Spanish/Hispanic,3,Emergency,Left Against Medical Advice,2017,131,Respiratory failure; insufficiency; arrest (adult),216,RESP INTUB/MECH VENTIL,133,Respiratory Failure,04,Diseases and Disorders of the Respiratory System,3,Major,Major,Medical,Medicaid,,,,N,Y,28736.89,18528.05
New York City,Manhattan,7002001,001438,Bellevue Hospital Center,70 or Older,100,M,Other Race,Not Span/Hispanic,5,Emergency,Hospice - Home,2017,131,Respiratory failure; insufficiency; arrest (adult),000,NO PROC,133,Respiratory Failure,04,Diseases and Disorders of the Respiratory System,2,Moderate,Major,Medical,Medicare,Medicare,Medicaid,,N,Y,28662.64,18480.18
New York City,Manhattan,7002001,001438,Bellevue Hospital Center,18 to 29,100,F,Other Race,Not Span/Hispanic,8,Emergency,Home or Self Care,2017,131,Respiratory failure; insufficiency; arrest (adult),193,DX ULTRASOUND HEART,133,Respiratory Failure,04,Diseases and Disorders of the Respiratory System,4,Extreme,Major,Medical,Medicaid,Medicaid,,,N,Y,63723.65,41085.70
New York City,Manhattan,7002001,001438,Bellevue Hospital Center,0 to 17,103,M,Other Race,Not Span/Hispanic,9,Emergency,Home or Self Care,2017,131,Respiratory failure; insufficiency; arrest (adult),216,RESP INTUB/MECH VENTIL,133,Respiratory Failure,04,Diseases and Disorders of the Respiratory System,3,Major,Minor,Medical,Medicaid,,,,N,Y,57462.51,37048.84
New York City,Manhattan,7002001,001438,Bellevue Hospital Center,50 to 69,100,F,Other Race,Not Span/Hispanic,8,Emergency,Home or Self Care,2017,131,Respiratory failure; insufficiency; arrest (adult),216,RESP INTUB/MECH VENTIL,133,Respiratory Failure,04,Diseases and Disorders of the Respiratory System,3,Major,Minor,Medical,Medicaid,Medicaid,,,N,Y,52653.18,33948.03
