Hospital Service Area,Hospital County,Operating Certificate Number,Permanent Facility Id,Facility Name,Age Group,Zip Code - 3 digits,Gender,Race,Ethnicity,Length of Stay,Type of Admission,Patient Disposition,Discharge Year,CCS Diagnosis Code,CCS Diagnosis Description,CCS Procedure Code,CCS Procedure Description,APR DRG Code,APR DRG Description,APR MDC Code,APR MDC Description,APR Severity of Illness Code,APR Severity of Illness Description,APR Risk of Mortality,APR Medical Surgical Description,Payment Typology 1,Payment Typology 2,Payment Typology 3,Birth Weight,Abortion Edit Indicator,Emergency Department Indicator,Total Charges,Total Costs
New York City,Kings,7002053,001304,NYU Langone Hospital-Brooklyn,50 to 69,112,F,White,Not Span/Hispanic,5,Emergency,Home w/ Home Health Services,2019,RSP012,RESPIRATORY FAILURE; INSUFFICIENCY; ARREST,ESA004,NON-INVASIVE VENTILATION,133,RESPIRATORY FAILURE,04,DISEASES AND DISORDERS OF THE RESPIRATORY SYSTEM,3,Major,Moderate,Medical,Medicare,Medicaid,,,,true,87131.02,30725.97
New York City,Kings,7002053,001304,NYU Langone Hospital-Brooklyn,70 or Older,103,F,Other Race,Not Span/Hispanic,8,Elective,Short-term Hospital,2019,RSP012,RESPIRATORY FAILURE; INSUFFICIENCY; ARREST,RHB002,"PHYSICAL, OCCUPATIONAL, AND RESPIRATORY THERAPY TREATMENT",133,RESPIRATORY FAILURE,04,DISEASES AND DISORDERS OF THE RESPIRATORY SYSTEM,4,Extreme,Extreme,Medical,Medicare,Medicaid,,,,false,78585.81,27212.36
New York City,Kings,7002053,001304,NYU Langone Hospital-Brooklyn,50 to 69,112,F,White,Not Span/Hispanic,10,Emergency,Home w/ Home Health Services,2019,RSP012,RESPIRATORY FAILURE; INSUFFICIENCY; ARREST,ESA004,NON-INVASIVE VENTILATION,133,RESPIRATORY FAILURE,04,DISEASES AND DISORDERS OF THE RESPIRATORY SYSTEM,3,Major,Moderate,Medical,Medicare,Medicaid,,,,true,146243.62,39714.96
New York City,Kings,7002053,001304,NYU Langone Hospital-Brooklyn,50 to 69,112,M,White,Spanish/Hispanic,3,Emergency,Left Against Medical Advice,2019,RSP012,RESPIRATORY FAILURE; INSUFFICIENCY; ARREST,,,133,RESPIRATORY FAILURE,04,DISEASES AND DISORDERS OF THE RESPIRATORY SYSTEM,3,Major,Major,Medical,Medicaid,,,,,true,60173.98,13111.35
New York City,Kings,7002053,001304,NYU Langone Hospital-Brooklyn,50 to 69,112,F,Other Race,Spanish/Hispanic,3,Emergency,Home or Self Care,2019,RSP012,RESPIRATORY FAILURE; INSUFFICIENCY; ARREST,ESA004,NON-INVASIVE VENTILATION,133,RESPIRATORY FAILURE,04,DISEASES AND DISORDERS OF THE RESPIRATORY SYSTEM,3,Major,Minor,Medical,Medicaid,,,,,true,62335.89,19345.67
New York City,Kings,7002053,001304,NYU Langone Hospital-Brooklyn,70 or Older,112,M,Multi-racial,Not Span/Hispanic,5,Emergency,Home or Self Care,2019,RSP012,RESPIRATORY FAILURE; INSUFFICIENCY; ARREST,ESA001,HEMODIALYSIS,133,RESPIRATORY FAILURE,04,DISEASES AND DISORDERS OF THE RESPIRATORY SYSTEM,4,Extreme,Major,Medical,Medicare,,,,,true,102095.63,26523.07
New York City,Kings,7002053,001304,NYU Langone Hospital-Brooklyn,50 to 69,112,F,White,Spanish/Hispanic,6,Emergency,Home w/ Home Health Services,2019,RSP012,RESPIRATORY FAILURE; INSUFFICIENCY; ARREST,,,133,RESPIRATORY FAILURE,04,DISEASES AND DISORDERS OF THE RESPIRATORY SYSTEM,2,Moderate,Major,Medical,Medicaid,,,,,true,60735.44,21548.43
New York City,Kings,7002053,001304,NYU Langone Hospital-Brooklyn,70 or Older,112,M,Multi-racial,Not Span/Hispanic,3,Emergency,Home or Self Care,2019,RSP012,RESPIRATORY FAILURE; INSUFFICIENCY; ARREST,,,133,RESPIRATORY FAILURE,04,DISEASES AND DISORDERS OF THE RESPIRATORY SYSTEM,2,Moderate,Moderate,Medical,Medicare,Blue Cross/Blue Shield,,,,true,44421.57,12572.74
New York City,Kings,7002053,001304,NYU Langone Hospital-Brooklyn,70 or Older,112,F,White,Not Span/Hispanic,12,Emergency,Home w/ Home Health Services,2019,RSP012,RESPIRATORY FAILURE; INSUFFICIENCY; ARREST,,,133,RESPIRATORY FAILURE,04,DISEASES AND DISORDERS OF THE RESPIRATORY SYSTEM,3,Major,Major,Medical,Medicare,Medicaid,,,,true,130363.08,54648.03
New York City,Kings,7002053,001304,NYU Langone Hospital-Brooklyn,70 or Older,112,F,Black/African American,Not Span/Hispanic,6,Emergency,Home w/ Home Health Services,2019,RSP012,RESPIRATORY FAILURE; INSUFFICIENCY; ARREST,ESA004,NON-INVASIVE VENTILATION,133,RESPIRATORY FAILURE,04,DISEASES AND DISORDERS OF THE RESPIRATORY SYSTEM,3,Major,Major,Medical,Medicare,,,,,true,72076.33,27311.68
New York City,Kings,7002053,001304,NYU Langone Hospital-Brooklyn,70 or Older,112,M,White,Not Span/Hispanic,5,Emergency,Home or Self Care,2019,RSP012,RESPIRATORY FAILURE; INSUFFICIENCY; ARREST,ESA004,NON-INVASIVE VENTILATION,133,RESPIRATORY FAILURE,04,DISEASES AND DISORDERS OF THE RESPIRATORY SYSTEM,3,Major,Major,Medical,Medicare,Medicare,,,,true,71378.52,25612.71
New York City,Kings,7002053,001304,NYU Langone Hospital-Brooklyn,70 or Older,112,M,White,Not Span/Hispanic,7,Emergency,Expired,2019,RSP012,RESPIRATORY FAILURE; INSUFFICIENCY; ARREST,ESA004,NON-INVASIVE VENTILATION,133,RESPIRATORY FAILURE,04,DISEASES AND DISORDERS OF THE RESPIRATORY SYSTEM,3,Major,Extreme,Medical,Medicare,Blue Cross/Blue Shield,,,,true,172381.73,62269.95
New York City,Kings,7002053,001304,NYU Langone Hospital-Brooklyn,70 or Older,112,M,Black/African American,Not Span/Hispanic,1,Emergency,Home or Self Care,2019,RSP012,RESPIRATORY FAILURE; INSUFFICIENCY; ARREST,ADM021,"ADMINISTRATION OF THERAPEUTIC SUBSTANCES, NEC",133,RESPIRATORY FAILURE,04,DISEASES AND DISORDERS OF THE RESPIRATORY SYSTEM,2,Moderate,Major,Medical,Private Health Insurance,Medicare,,,,true,17680.13,4714.11
New York City,Kings,7002053,001304,NYU Langone Hospital-Brooklyn,50 to 69,112,F,White,Not Span/Hispanic,2,Emergency,Home w/ Home Health Services,2019,RSP012,RESPIRATORY FAILURE; INSUFFICIENCY; ARREST,,,133,RESPIRATORY FAILURE,04,DISEASES AND DISORDERS OF THE RESPIRATORY SYSTEM,3,Major,Major,Medical,Medicare,Medicaid,,,,true,26401.53,8308.52
New York City,Kings,7002053,001304,NYU Langone Hospital-Brooklyn,70 or Older,112,F,Black/African American,Not Span/Hispanic,5,Emergency,Skilled Nursing Home,2019,RSP012,RESPIRATORY FAILURE; INSUFFICIENCY; ARREST,ESA001,HEMODIALYSIS,133,RESPIRATORY FAILURE,04,DISEASES AND DISORDERS OF THE RESPIRATORY SYSTEM,3,Major,Major,Medical,Medicare,Medicaid,,,,true,82348.67,25689.59
New York City,Kings,7002053,001304,NYU Langone Hospital-Brooklyn,70 or Older,112,F,White,Not Span/Hispanic,5,Emergency,Home w/ Home Health Services,2019,RSP012,RESPIRATORY FAILURE; INSUFFICIENCY; ARREST,,,133,RESPIRATORY FAILURE,04,DISEASES AND DISORDERS OF THE RESPIRATORY SYSTEM,3,Major,Major,Medical,Medicare,Blue Cross/Blue Shield,,,,true,58272.82,19871.66
New York City,Kings,7002053,001304,NYU Langone Hospital-Brooklyn,70 or Older,112,F,White,Not Span/Hispanic,4,Emergency,Home w/ Home Health Services,2019,RSP012,RESPIRATORY FAILURE; INSUFFICIENCY; ARREST,ESA004,NON-INVASIVE VENTILATION,133,RESPIRATORY FAILURE,04,DISEASES AND DISORDERS OF THE RESPIRATORY SYSTEM,3,Major,Major,Medical,Medicare,,,,,true,43684.92,15001.48
New York City,Kings,7002053,001304,NYU Langone Hospital-Brooklyn,70 or Older,112,M,White,Not Span/Hispanic,7,Emergency,Home w/ Home Health Services,2019,RSP012,RESPIRATORY FAILURE; INSUFFICIENCY; ARREST,,,133,RESPIRATORY FAILURE,04,DISEASES AND DISORDERS OF THE RESPIRATORY SYSTEM,3,Major,Major,Medical,Private Health Insurance,Medicaid,,,,true,72764.06,25592.33
New York City,Kings,7002053,001304,NYU Langone Hospital-Brooklyn,70 or Older,112,F,Other Race,Spanish/Hispanic,2,Emergency,Home w/ Home Health Services,2019,RSP012,RESPIRATORY FAILURE; INSUFFICIENCY; ARREST,ADM021,"ADMINISTRATION OF THERAPEUTIC SUBSTANCES, NEC",133,RESPIRATORY FAILURE,04,DISEASES AND DISORDERS OF THE RESPIRATORY SYSTEM,3,Major,Major,Medical,Private Health Insurance,Medicaid,,,,true,29754.7,8562.08
New York City,Kings,7002053,001304,NYU Langone Hospital-Brooklyn,70 or Older,112,F,White,Not Span/Hispanic,12,Emergency,Skilled Nursing Home,2019,RSP012,RESPIRATORY FAILURE; INSUFFICIENCY; ARREST,ADM021,"ADMINISTRATION OF THERAPEUTIC SUBSTANCES, NEC",133,RESPIRATORY FAILURE,04,DISEASES AND DISORDERS OF THE RESPIRATORY SYSTEM,4,Extreme,Major,Medical,Medicare,Medicare,,,,true,178829.1,59031.57
New York City,Kings,7002053,001304,NYU Langone Hospital-Brooklyn,50 to 69,112,M,Other Race,Spanish/Hispanic,2,Emergency,Home or Self Care,2019,RSP012,RESPIRATORY FAILURE; INSUFFICIENCY; ARREST,,,133,RESPIRATORY FAILURE,04,DISEASES AND DISORDERS OF THE RESPIRATORY SYSTEM,2,Moderate,Moderate,Medical,Blue Cross/Blue Shield,,,,,true,32985.56,9360.96
New York City,Kings,7002053,001304,NYU Langone Hospital-Brooklyn,50 to 69,112,F,White,Not Span/Hispanic,3,Emergency,Home or Self Care,2019,RSP012,RESPIRATORY FAILURE; INSUFFICIENCY; ARREST,,,133,RESPIRATORY FAILURE,04,DISEASES AND DISORDERS OF THE RESPIRATORY SYSTEM,3,Major,Moderate,Medical,Medicare,,,,,true,42515.47,12299.3
New York City,Kings,7002053,001304,NYU Langone Hospital-Brooklyn,50 to 69,112,M,White,Not Span/Hispanic,3,Emergency,Home or Self Care,2019,RSP012,RESPIRATORY FAILURE; INSUFFICIENCY; ARREST,,,133,RESPIRATORY FAILURE,04,DISEASES AND DISORDERS OF THE RESPIRATORY SYSTEM,2,Moderate,Moderate,Medical,Medicare,Medicaid,,,,true,42387.43,12536.23
New York City,Kings,7002053,001304,NYU Langone Hospital-Brooklyn,70 or Older,112,F,White,Not Span/Hispanic,3,Emergency,Home or Self Care,2019,RSP012,RESPIRATORY FAILURE; INSUFFICIENCY; ARREST,,,133,RESPIRATORY FAILURE,04,DISEASES AND DISORDERS OF THE RESPIRATORY SYSTEM,3,Major,Major,Medical,Private Health Insurance,,,,,true,38511.9,11301.4
New York City,Kings,7002053,001304,NYU Langone Hospital-Brooklyn,50 to 69,112,F,Black/African American,Not Span/Hispanic,4,Emergency,Home or Self Care,2019,RSP012,RESPIRATORY FAILURE; INSUFFICIENCY; ARREST,,,133,RESPIRATORY FAILURE,04,DISEASES AND DISORDERS OF THE RESPIRATORY SYSTEM,2,Moderate,Moderate,Medical,Medicare,,,,,true,44562.79,15262.85
New York City,Kings,7002053,001304,NYU Langone Hospital-Brooklyn,50 to 69,112,M,White,Not Span/Hispanic,3,Emergency,Hospice - Medical Facility,2019,RSP012,RESPIRATORY FAILURE; INSUFFICIENCY; ARREST,RES007,AIRWAY INTUBATION,133,RESPIRATORY FAILURE,04,DISEASES AND DISORDERS OF THE RESPIRATORY SYSTEM,4,Extreme,Extreme,Medical,Medicare,Private Health Insurance,,,,true,108246.9,33517.82
New York City,Kings,7002053,001304,NYU Langone Hospital-Brooklyn,50 to 69,112,F,White,Not Span/Hispanic,4,Emergency,Home or Self Care,2019,RSP012,RESPIRATORY FAILURE; INSUFFICIENCY; ARREST,,,133,RESPIRATORY FAILURE,04,DISEASES AND DISORDERS OF THE RESPIRATORY SYSTEM,2,Moderate,Moderate,Medical,Medicare,Medicare,,,,true,85825.93,25254.19
New York City,Kings,7002053,001304,NYU Langone Hospital-Brooklyn,70 or Older,112,F,Other Race,Spanish/Hispanic,6,Emergency,Home w/ Home Health Services,2019,RSP012,RESPIRATORY FAILURE; INSUFFICIENCY; ARREST,,,133,RESPIRATORY FAILURE,04,DISEASES AND DISORDERS OF THE RESPIRATORY SYSTEM,3,Major,Major,Medical,Medicaid,,,,,true,71628.29,22505.87
New York City,Kings,7002053,001304,NYU Langone Hospital-Brooklyn,50 to 69,112,F,Other Race,Spanish/Hispanic,7,Emergency,Skilled Nursing Home,2019,RSP012,RESPIRATORY FAILURE; INSUFFICIENCY; ARREST,ESA004,NON-INVASIVE VENTILATION,133,RESPIRATORY FAILURE,04,DISEASES AND DISORDERS OF THE RESPIRATORY SYSTEM,3,Major,Extreme,Medical,Medicare,Medicaid,,,,true,64702.7,25677.15
New York City,Kings,7002053,001304,NYU Langone Hospital-Brooklyn,50 to 69,112,M,Black/African American,Not Span/Hispanic,3,Emergency,Home or Self Care,2019,RSP012,RESPIRATORY FAILURE; INSUFFICIENCY; ARREST,,,133,RESPIRATORY FAILURE,04,DISEASES AND DISORDERS OF THE RESPIRATORY SYSTEM,2,Moderate,Moderate,Medical,Medicaid,,,,,true,42447.89,12707.74
New York City,Kings,7002053,001304,NYU Langone Hospital-Brooklyn,50 to 69,112,M,White,Not Span/Hispanic,13,Elective,Skilled Nursing Home,2019,RSP012,RESPIRATORY FAILURE; INSUFFICIENCY; ARREST,RHB002,"PHYSICAL, OCCUPATIONAL, AND RESPIRATORY THERAPY TREATMENT",133,RESPIRATORY FAILURE,04,DISEASES AND DISORDERS OF THE RESPIRATORY SYSTEM,2,Moderate,Moderate,Medical,Medicare,Private Health Insurance,,,,false,163503.26,42634.78
New York City,Kings,7002053,001304,NYU Langone Hospital-Brooklyn,70 or Older,112,M,Other Race,Not Span/Hispanic,1,Emergency,Home w/ Home Health Services,2019,RSP012,RESPIRATORY FAILURE; INSUFFICIENCY; ARREST,,,133,RESPIRATORY FAILURE,04,DISEASES AND DISORDERS OF THE RESPIRATORY SYSTEM,3,Major,Major,Medical,Medicare,Medicaid,,,,true,37372.53,7506.81
New York City,Kings,7002053,001304,NYU Langone Hospital-Brooklyn,50 to 69,112,M,White,Not Span/Hispanic,3,Emergency,Home or Self Care,2019,RSP012,RESPIRATORY FAILURE; INSUFFICIENCY; ARREST,ESA004,NON-INVASIVE VENTILATION,133,RESPIRATORY FAILURE,04,DISEASES AND DISORDERS OF THE RESPIRATORY SYSTEM,2,Moderate,Minor,Medical,Medicare,Blue Cross/Blue Shield,,,,true,71683.61,27902.62
New York City,Kings,7002053,001304,NYU Langone Hospital-Brooklyn,50 to 69,112,F,Other Race,Spanish/Hispanic,1,Emergency,Home or Self Care,2019,RSP012,RESPIRATORY FAILURE; INSUFFICIENCY; ARREST,ADM021,"ADMINISTRATION OF THERAPEUTIC SUBSTANCES, NEC",133,RESPIRATORY FAILURE,04,DISEASES AND DISORDERS OF THE RESPIRATORY SYSTEM,3,Major,Minor,Medical,Medicare,,,,,true,19171.15,5663.44
New York City,Kings,7002053,001304,NYU Langone Hospital-Brooklyn,50 to 69,112,M,White,Not Span/Hispanic,1,Emergency,Home or Self Care,2019,RSP012,RESPIRATORY FAILURE; INSUFFICIENCY; ARREST,,,133,RESPIRATORY FAILURE,04,DISEASES AND DISORDERS OF THE RESPIRATORY SYSTEM,2,Moderate,Minor,Medical,Private Health Insurance,Medicare,,,,true,24470.77,5980.26
New York City,Kings,7002053,001304,NYU Langone Hospital-Brooklyn,50 to 69,112,F,White,Not Span/Hispanic,2,Emergency,Home or Self Care,2019,RSP012,RESPIRATORY FAILURE; INSUFFICIENCY; ARREST,ADM021,"ADMINISTRATION OF THERAPEUTIC SUBSTANCES, NEC",133,RESPIRATORY FAILURE,04,DISEASES AND DISORDERS OF THE RESPIRATORY SYSTEM,3,Major,Major,Medical,Medicare,Blue Cross/Blue Shield,,,,true,23290.17,7874.36
New York City,Kings,7002053,001304,NYU Langone Hospital-Brooklyn,70 or Older,112,M,White,Unknown,3,Emergency,Home w/ Home Health Services,2019,RSP012,RESPIRATORY FAILURE; INSUFFICIENCY; ARREST,ESA004,NON-INVASIVE VENTILATION,133,RESPIRATORY FAILURE,04,DISEASES AND DISORDERS OF THE RESPIRATORY SYSTEM,4,Extreme,Major,Medical,Medicare,Medicaid,,,,true,65544.21,19113.99
New York City,Kings,7002053,001304,NYU Langone Hospital-Brooklyn,70 or Older,112,F,White,Not Span/Hispanic,3,Emergency,Skilled Nursing Home,2019,RSP012,RESPIRATORY FAILURE; INSUFFICIENCY; ARREST,ESA001,HEMODIALYSIS,133,RESPIRATORY FAILURE,04,DISEASES AND DISORDERS OF THE RESPIRATORY SYSTEM,3,Major,Major,Medical,Medicare,Medicare,,,,true,49161.3,14654.84
New York City,Kings,7002053,001304,NYU Langone Hospital-Brooklyn,30 to 49,112,F,White,Not Span/Hispanic,2,Emergency,Home or Self Care,2019,RSP012,RESPIRATORY FAILURE; INSUFFICIENCY; ARREST,,,133,RESPIRATORY FAILURE,04,DISEASES AND DISORDERS OF THE RESPIRATORY SYSTEM,2,Moderate,Minor,Medical,Private Health Insurance,,,,,true,36944.1,10109.83
New York City,Kings,7002053,001304,NYU Langone Hospital-Brooklyn,30 to 49,112,F,White,Not Span/Hispanic,16,Emergency,Home w/ Home Health Services,2019,RSP012,RESPIRATORY FAILURE; INSUFFICIENCY; ARREST,,,133,RESPIRATORY FAILURE,04,DISEASES AND DISORDERS OF THE RESPIRATORY SYSTEM,3,Major,Major,Medical,Medicaid,,,,,true,198012.08,72638.59
New York City,Kings,7002053,001304,NYU Langone Hospital-Brooklyn,70 or Older,112,M,Other Race,Not Span/Hispanic,7,Emergency,Home w/ Home Health Services,2019,RSP012,RESPIRATORY FAILURE; INSUFFICIENCY; ARREST,,,133,RESPIRATORY FAILURE,04,DISEASES AND DISORDERS OF THE RESPIRATORY SYSTEM,3,Major,Moderate,Medical,Medicare,Medicaid,,,,true,75812.05,24724.85
New York City,Kings,7002053,001304,NYU Langone Hospital-Brooklyn,70 or Older,112,F,White,Not Span/Hispanic,4,Emergency,Hospice - Home,2019,RSP012,RESPIRATORY FAILURE; INSUFFICIENCY; ARREST,,,133,RESPIRATORY FAILURE,04,DISEASES AND DISORDERS OF THE RESPIRATORY SYSTEM,3,Major,Major,Medical,Medicare,Medicaid,,,,true,57322.04,17384.15
New York City,Kings,7002053,001304,NYU Langone Hospital-Brooklyn,50 to 69,112,M,White,Not Span/Hispanic,1,Emergency,Left Against Medical Advice,2019,RSP012,RESPIRATORY FAILURE; INSUFFICIENCY; ARREST,ESA004,NON-INVASIVE VENTILATION,133,RESPIRATORY FAILURE,04,DISEASES AND DISORDERS OF THE RESPIRATORY SYSTEM,3,Major,Major,Medical,Private Health Insurance,,,,,true,22270.06,6268.37
New York City,Kings,7002053,001304,NYU Langone Hospital-Brooklyn,50 to 69,112,F,Other Race,Spanish/Hispanic,3,Emergency,Home or Self Care,2019,RSP012,RESPIRATORY FAILURE; INSUFFICIENCY; ARREST,,,133,RESPIRATORY FAILURE,04,DISEASES AND DISORDERS OF THE RESPIRATORY SYSTEM,3,Major,Major,Medical,Private Health Insurance,,,,,true,41136.91,12786.09
New York City,Kings,7002053,001304,NYU Langone Hospital-Brooklyn,70 or Older,112,M,Other Race,Not Span/Hispanic,10,Emergency,Home w/ Home Health Services,2019,RSP012,RESPIRATORY FAILURE; INSUFFICIENCY; ARREST,ESA004,NON-INVASIVE VENTILATION,133,RESPIRATORY FAILURE,04,DISEASES AND DISORDERS OF THE RESPIRATORY SYSTEM,2,Moderate,Moderate,Medical,Medicaid,,,,,true,117606.96,43915.03
New York City,Kings,7002053,001304,NYU Langone Hospital-Brooklyn,70 or Older,112,F,White,Spanish/Hispanic,4,Emergency,Home w/ Home Health Services,2019,RSP012,RESPIRATORY FAILURE; INSUFFICIENCY; ARREST,,,133,RESPIRATORY FAILURE,04,DISEASES AND DISORDERS OF THE RESPIRATORY SYSTEM,2,Moderate,Major,Medical,Medicare,Medicaid,,,,true,64101.55,15793.29
New York City,Kings,7002053,001304,NYU Langone Hospital-Brooklyn,70 or Older,112,F,White,Not Span/Hispanic,3,Emergency,Home w/ Home Health Services,2019,RSP012,RESPIRATORY FAILURE; INSUFFICIENCY; ARREST,ESA004,NON-INVASIVE VENTILATION,133,RESPIRATORY FAILURE,04,DISEASES AND DISORDERS OF THE RESPIRATORY SYSTEM,3,Major,Major,Medical,Medicare,Medicaid,,,,true,51228.78,17721.28
New York City,Kings,7002053,001304,NYU Langone Hospital-Brooklyn,70 or Older,112,F,Other Race,Spanish/Hispanic,1,Emergency,Home w/ Home Health Services,2019,RSP012,RESPIRATORY FAILURE; INSUFFICIENCY; ARREST,,,133,RESPIRATORY FAILURE,04,DISEASES AND DISORDERS OF THE RESPIRATORY SYSTEM,3,Major,Major,Medical,Medicare,Medicare,,,,true,34293.56,6471.81
New York City,Kings,7002053,001304,NYU Langone Hospital-Brooklyn,50 to 69,112,F,Other Race,Spanish/Hispanic,6,Emergency,Home or Self Care,2019,RSP012,RESPIRATORY FAILURE; INSUFFICIENCY; ARREST,RES007,AIRWAY INTUBATION,133,RESPIRATORY FAILURE,04,DISEASES AND DISORDERS OF THE RESPIRATORY SYSTEM,4,Extreme,Major,Medical,Medicare,,,,,true,101167.51,35966.54
New York City,Kings,7002053,001304,NYU Langone Hospital-Brooklyn,50 to 69,112,F,White,Not Span/Hispanic,2,Emergency,Home or Self Care,2019,RSP012,RESPIRATORY FAILURE; INSUFFICIENCY; ARREST,ADM016,ADMINISTRATION OF ANTI-INFLAMMATORY AGENTS,133,RESPIRATORY FAILURE,04,DISEASES AND DISORDERS OF THE RESPIRATORY SYSTEM,3,Major,Moderate,Medical,Medicaid,,,,,true,28780.15,8857.58
New York City,Kings,7002053,001304,NYU Langone Hospital-Brooklyn,50 to 69,112,F,White,Not Span/Hispanic,9,Emergency,Home or Self Care,2019,RSP012,RESPIRATORY FAILURE; INSUFFICIENCY; ARREST,OTR004,ISOLATION PROCEDURES,133,RESPIRATORY FAILURE,04,DISEASES AND DISORDERS OF THE RESPIRATORY SYSTEM,2,Moderate,Minor,Medical,Medicaid,,,,,true,139428.23,48418.51
New York City,Kings,7002053,001304,NYU Langone Hospital-Brooklyn,70 or Older,112,F,Other Race,Spanish/Hispanic,2,Emergency,Home or Self Care,2019,RSP012,RESPIRATORY FAILURE; INSUFFICIENCY; ARREST,,,133,RESPIRATORY FAILURE,04,DISEASES AND DISORDERS OF THE RESPIRATORY SYSTEM,2,Moderate,Major,Medical,Medicare,Blue Cross/Blue Shield,,,,true,60914.93,16026.74
New York City,Kings,7002053,001304,NYU Langone Hospital-Brooklyn,70 or Older,112,M,Other Race,Not Span/Hispanic,5,Emergency,Home w/ Home Health Services,2019,RSP012,RESPIRATORY FAILURE; INSUFFICIENCY; ARREST,,,133,RESPIRATORY FAILURE,04,DISEASES AND DISORDERS OF THE RESPIRATORY SYSTEM,2,Moderate,Moderate,Medical,Medicare,Medicaid,,,,true,50144.3,17853.17
New York City,Kings,7002053,001304,NYU Langone Hospital-Brooklyn,70 or Older,112,F,Other Race,Spanish/Hispanic,5,Emergency,Home w/ Home Health Services,2019,RSP012,RESPIRATORY FAILURE; INSUFFICIENCY; ARREST,ESA003,MECHANICAL VENTILATION,133,RESPIRATORY FAILURE,04,DISEASES AND DISORDERS OF THE RESPIRATORY SYSTEM,3,Major,Major,Medical,Medicare,Medicaid,,,,true,72915.53,24624.88
New York City,Kings,7002053,001304,NYU Langone Hospital-Brooklyn,50 to 69,112,M,Other Race,Not Span/Hispanic,16,Emergency,Skilled Nursing Home,2019,RSP012,RESPIRATORY FAILURE; INSUFFICIENCY; ARREST,ESA001,HEMODIALYSIS,133,RESPIRATORY FAILURE,04,DISEASES AND DISORDERS OF THE RESPIRATORY SYSTEM,3,Major,Major,Medical,Medicare,Medicaid,,,,true,177877.16,60467.03
New York City,Kings,7002053,001304,NYU Langone Hospital-Brooklyn,70 or Older,112,M,Other Race,Not Span/Hispanic,7,Emergency,Home w/ Home Health Services,2019,RSP012,RESPIRATORY FAILURE; INSUFFICIENCY; ARREST,,,133,RESPIRATORY FAILURE,04,DISEASES AND DISORDERS OF THE RESPIRATORY SYSTEM,3,Major,Major,Medical,Medicare,Medicaid,,,,true,72093.81,26631.31
New York City,Kings,7002053,001304,NYU Langone Hospital-Brooklyn,50 to 69,112,F,White,Not Span/Hispanic,3,Emergency,Home or Self Care,2019,RSP012,RESPIRATORY FAILURE; INSUFFICIENCY; ARREST,ESA004,NON-INVASIVE VENTILATION,133,RESPIRATORY FAILURE,04,DISEASES AND DISORDERS OF THE RESPIRATORY SYSTEM,2,Moderate,Minor,Medical,Medicaid,,,,,true,29446.05,11030.74
New York City,Kings,7002053,001304,NYU Langone Hospital-Brooklyn,30 to 49,112,F,Other Race,Spanish/Hispanic,9,Elective,Home w/ Home Health Services,2019,RSP012,RESPIRATORY FAILURE; INSUFFICIENCY; ARREST,RHB002,"PHYSICAL, OCCUPATIONAL, AND RESPIRATORY THERAPY TREATMENT",133,RESPIRATORY FAILURE,04,DISEASES AND DISORDERS OF THE RESPIRATORY SYSTEM,2,Moderate,Minor,Medical,Medicaid,,,,,false,129572.11,31152.8
New York City,Kings,7002053,001304,NYU Langone Hospital-Brooklyn,70 or Older,112,F,White,Not Span/Hispanic,7,Emergency,Home w/ Home Health Services,2019,RSP012,RESPIRATORY FAILURE; INSUFFICIENCY; ARREST,ESA003,MECHANICAL VENTILATION,133,RESPIRATORY FAILURE,04,DISEASES AND DISORDERS OF THE RESPIRATORY SYSTEM,4,Extreme,Major,Medical,Medicare,Medicaid,,,,true,128458.38,52052.26
New York City,Kings,7002053,001304,NYU Langone Hospital-Brooklyn,50 to 69,112,M,White,Spanish/Hispanic,2,Emergency,Home or Self Care,2019,RSP012,RESPIRATORY FAILURE; INSUFFICIENCY; ARREST,,,133,RESPIRATORY FAILURE,04,DISEASES AND DISORDERS OF THE RESPIRATORY SYSTEM,3,Major,Minor,Medical,Medicaid,,,,,true,25067.9,7920.32
New York City,Kings,7002053,001304,NYU Langone Hospital-Brooklyn,50 to 69,112,M,White,Spanish/Hispanic,10,Emergency,Home or Self Care,2019,RSP012,RESPIRATORY FAILURE; INSUFFICIENCY; ARREST,ESA003,MECHANICAL VENTILATION,133,RESPIRATORY FAILURE,04,DISEASES AND DISORDERS OF THE RESPIRATORY SYSTEM,4,Extreme,Major,Medical,Medicaid,,,,,true,118274.01,44241.07
New York City,Kings,7002053,001304,NYU Langone Hospital-Brooklyn,70 or Older,112,M,Other Race,Not Span/Hispanic,9,Emergency,Home w/ Home Health Services,2019,RSP012,RESPIRATORY FAILURE; INSUFFICIENCY; ARREST,OTR004,ISOLATION PROCEDURES,133,RESPIRATORY FAILURE,04,DISEASES AND DISORDERS OF THE RESPIRATORY SYSTEM,3,Major,Major,Medical,Medicare,,,,,true,121574.1,47627.33
New York City,Kings,7002053,001304,NYU Langone Hospital-Brooklyn,70 or Older,112,F,Black/African American,Not Span/Hispanic,5,Emergency,Skilled Nursing Home,2019,RSP012,RESPIRATORY FAILURE; INSUFFICIENCY; ARREST,ESA004,NON-INVASIVE VENTILATION,133,RESPIRATORY FAILURE,04,DISEASES AND DISORDERS OF THE RESPIRATORY SYSTEM,3,Major,Major,Medical,Medicare,Medicare,,,,true,83176.73,28335.37