Hospital Service Area,Hospital County,Operating Certificate Number,Permanent Facility Id,Facility Name,Age Group,Zip Code - 3 digits,Gender,Race,Ethnicity,Length of Stay,Type of Admission,Patient Disposition,Discharge Year,CCS Diagnosis Code,CCS Diagnosis Description,CCS Procedure Code,CCS Procedure Description,APR DRG Code,APR DRG Description,APR MDC Code,APR MDC Description,APR Severity of Illness Code,APR Severity of Illness Description,APR Risk of Mortality,APR Medical Surgical Description,Payment Typology 1,Payment Typology 2,Payment Typology 3,Birth Weight,Abortion Edit Indicator,Emergency Department Indicator,Total Charges,Total Costs
Long Island,Nassau,2908000,000511,NYU Winthrop Hospital,70 or Older,117,M,White,Not Span/Hispanic,3,Emergency,Home w/ Home Health Services,2017,103,Pulmonary heart disease,000,NO PROC,134,Pulmonary embolism,04,Diseases and Disorders of the Respiratory System,1,Minor,Minor,Medical,Medicare,Medicare,Blue Cross/Blue Shield,,N,Y,30883.40,6056.84
Long Island,Nassau,2908000,000511,NYU Winthrop Hospital,50 to 69,115,F,Black/African American,Not Span/Hispanic,8,Emergency,Home w/ Home Health Services,2017,103,Pulmonary heart disease,216,RESP INTUB/MECH VENTIL,134,Pulmonary embolism,04,Diseases and Disorders of the Respiratory System,3,Major,Major,Medical,Blue Cross/Blue Shield,Medicare,Medicare,,N,Y,144017.88,29278.91
Long Island,Nassau,2908000,000511,NYU Winthrop Hospital,50 to 69,115,F,White,Not Span/Hispanic,4,Emergency,Home w/ Home Health Services,2017,103,Pulmonary heart disease,061,OT OR PRCS VES NOT HEAD,134,Pulmonary embolism,04,Diseases and Disorders of the Respiratory System,3,Major,Major,Medical,Blue Cross/Blue Shield,,,,N,Y,123198.86,24924.86
Long Island,Nassau,2908000,000511,NYU Winthrop Hospital,70 or Older,115,M,White,Not Span/Hispanic,4,Emergency,Home w/ Home Health Services,2017,103,Pulmonary heart disease,000,NO PROC,134,Pulmonary embolism,04,Diseases and Disorders of the Respiratory System,3,Major,Major,Medical,Medicare,Medicare,Blue Cross/Blue Shield,,N,Y,64152.76,16135.26
Long Island,Nassau,2908000,000511,NYU Winthrop Hospital,50 to 69,117,F,White,Not Span/Hispanic,7,Emergency,Home or Self Care,2017,103,Pulmonary heart disease,000,NO PROC,134,Pulmonary embolism,04,Diseases and Disorders of the Respiratory System,1,Minor,Minor,Medical,Private Health Insurance,,,,N,Y,123013.46,25668.51
Long Island,Nassau,2908000,000511,NYU Winthrop Hospital,50 to 69,115,M,White,Spanish/Hispanic,3,Emergency,Home or Self Care,2017,103,Pulmonary heart disease,000,NO PROC,134,Pulmonary embolism,04,Diseases and Disorders of the Respiratory System,2,Moderate,Minor,Medical,Medicare,Medicare,Blue Cross/Blue Shield,,N,Y,71653.27,13869.53
Long Island,Nassau,2908000,000511,NYU Winthrop Hospital,70 or Older,115,M,White,Not Span/Hispanic,5,Emergency,Home or Self Care,2017,103,Pulmonary heart disease,000,NO PROC,134,Pulmonary embolism,04,Diseases and Disorders of the Respiratory System,2,Moderate,Major,Medical,Medicare,Medicare,,,N,Y,85841.16,20373.79
Long Island,Nassau,2908000,000511,NYU Winthrop Hospital,50 to 69,110,F,White,Not Span/Hispanic,9,Emergency,Home or Self Care,2017,103,Pulmonary heart disease,000,NO PROC,134,Pulmonary embolism,04,Diseases and Disorders of the Respiratory System,2,Moderate,Moderate,Medical,Private Health Insurance,,,,N,Y,111732.14,29762.98
Long Island,Nassau,2908000,000511,NYU Winthrop Hospital,18 to 29,OOS,M,White,Not Span/Hispanic,1,Emergency,Home or Self Care,2017,103,Pulmonary heart disease,000,NO PROC,134,Pulmonary embolism,04,Diseases and Disorders of the Respiratory System,1,Minor,Minor,Medical,Private Health Insurance,,,,N,Y,42318.16,7762.61
Long Island,Nassau,2908000,000511,NYU Winthrop Hospital,30 to 49,110,M,White,Not Span/Hispanic,1,Emergency,Home or Self Care,2017,103,Pulmonary heart disease,222,BLOOD TRANSFUSION,134,Pulmonary embolism,04,Diseases and Disorders of the Respiratory System,1,Minor,Minor,Medical,Medicare,Medicare,,,N,Y,34552.12,6365.42
Long Island,Nassau,2908000,000511,NYU Winthrop Hospital,70 or Older,115,M,White,Not Span/Hispanic,1,Emergency,Home w/ Home Health Services,2017,103,Pulmonary heart disease,061,OT OR PRCS VES NOT HEAD,134,Pulmonary embolism,04,Diseases and Disorders of the Respiratory System,1,Minor,Minor,Medical,Medicare,Medicare,Private Health Insurance,,N,Y,56638.98,12861.46
Long Island,Nassau,2908000,000511,NYU Winthrop Hospital,70 or Older,110,M,Other Race,Not Span/Hispanic,10,Emergency,Home w/ Home Health Services,2017,103,Pulmonary heart disease,171,SUTURE SKIN/SUBCUT TISS,134,Pulmonary embolism,04,Diseases and Disorders of the Respiratory System,2,Moderate,Major,Medical,Medicare,Medicare,Private Health Insurance,,N,Y,144779.57,35855.67
Long Island,Nassau,2908000,000511,NYU Winthrop Hospital,70 or Older,115,F,White,Not Span/Hispanic,4,Emergency,Home w/ Home Health Services,2017,103,Pulmonary heart disease,000,NO PROC,134,Pulmonary embolism,04,Diseases and Disorders of the Respiratory System,2,Moderate,Moderate,Medical,Blue Cross/Blue Shield,Medicare,,,N,Y,99834.80,21446.51
Long Island,Nassau,2908000,000511,NYU Winthrop Hospital,30 to 49,115,F,White,Spanish/Hispanic,6,Emergency,Home or Self Care,2017,103,Pulmonary heart disease,000,NO PROC,134,Pulmonary embolism,04,Diseases and Disorders of the Respiratory System,3,Major,Moderate,Medical,Private Health Insurance,Medicaid,,,N,Y,72855.52,14126.26
Long Island,Nassau,2908000,000511,NYU Winthrop Hospital,18 to 29,115,F,Black/African American,Not Span/Hispanic,12,Emergency,Home or Self Care,2017,103,Pulmonary heart disease,110,OT DX PRCS URINARY TRCT,134,Pulmonary embolism,04,Diseases and Disorders of the Respiratory System,2,Moderate,Moderate,Medical,Blue Cross/Blue Shield,,,,N,Y,120109.00,23692.17
Long Island,Nassau,2908000,000511,NYU Winthrop Hospital,50 to 69,115,F,White,Not Span/Hispanic,1,Emergency,Home or Self Care,2017,103,Pulmonary heart disease,000,NO PROC,134,Pulmonary embolism,04,Diseases and Disorders of the Respiratory System,2,Moderate,Minor,Medical,Blue Cross/Blue Shield,,,,N,Y,23340.22,5007.09
Long Island,Nassau,2908000,000511,NYU Winthrop Hospital,50 to 69,115,F,White,Not Span/Hispanic,1,Emergency,Home or Self Care,2017,103,Pulmonary heart disease,000,NO PROC,134,Pulmonary embolism,04,Diseases and Disorders of the Respiratory System,2,Moderate,Minor,Medical,Blue Cross/Blue Shield,,,,N,Y,32619.28,6214.73
Long Island,Nassau,2908000,000511,NYU Winthrop Hospital,18 to 29,117,F,White,Not Span/Hispanic,1,Emergency,Home or Self Care,2017,103,Pulmonary heart disease,000,NO PROC,134,Pulmonary embolism,04,Diseases and Disorders of the Respiratory System,1,Minor,Minor,Medical,Blue Cross/Blue Shield,,,,N,Y,29318.57,5826.54
Long Island,Nassau,2908000,000511,NYU Winthrop Hospital,50 to 69,115,F,Black/African American,Not Span/Hispanic,12,Emergency,Home or Self Care,2017,103,Pulmonary heart disease,000,NO PROC,134,Pulmonary embolism,04,Diseases and Disorders of the Respiratory System,2,Moderate,Minor,Medical,Medicare,Medicare,,,N,Y,154680.36,41421.23
Long Island,Nassau,2908000,000511,NYU Winthrop Hospital,50 to 69,115,M,White,Not Span/Hispanic,1,Emergency,Home w/ Home Health Services,2017,103,Pulmonary heart disease,000,NO PROC,134,Pulmonary embolism,04,Diseases and Disorders of the Respiratory System,2,Moderate,Moderate,Medical,Medicaid,Medicaid,,,N,Y,39870.87,7940.02
Long Island,Nassau,2908000,000511,NYU Winthrop Hospital,70 or Older,115,M,White,Not Span/Hispanic,3,Emergency,Home or Self Care,2017,103,Pulmonary heart disease,000,NO PROC,134,Pulmonary embolism,04,Diseases and Disorders of the Respiratory System,3,Major,Extreme,Medical,Private Health Insurance,Medicare,,,N,Y,59947.31,13187.55
Long Island,Nassau,2908000,000511,NYU Winthrop Hospital,50 to 69,110,F,White,Not Span/Hispanic,13,Emergency,Home w/ Home Health Services,2017,103,Pulmonary heart disease,216,RESP INTUB/MECH VENTIL,134,Pulmonary embolism,04,Diseases and Disorders of the Respiratory System,3,Major,Moderate,Medical,Medicaid,Medicaid,,,N,Y,115594.15,21665.56
Long Island,Nassau,2908000,000511,NYU Winthrop Hospital,50 to 69,115,F,White,Not Span/Hispanic,3,Emergency,Home or Self Care,2017,103,Pulmonary heart disease,000,NO PROC,134,Pulmonary embolism,04,Diseases and Disorders of the Respiratory System,1,Minor,Moderate,Medical,Medicare,Medicare,Blue Cross/Blue Shield,,N,Y,64073.35,14124.65
Long Island,Nassau,2908000,000511,NYU Winthrop Hospital,70 or Older,110,M,White,Not Span/Hispanic,1,Emergency,Home or Self Care,2017,103,Pulmonary heart disease,000,NO PROC,134,Pulmonary embolism,04,Diseases and Disorders of the Respiratory System,2,Moderate,Moderate,Medical,Medicare,Medicare,Private Health Insurance,,N,Y,21131.85,3976.34
Long Island,Nassau,2908000,000511,NYU Winthrop Hospital,50 to 69,115,F,White,Not Span/Hispanic,3,Emergency,Home or Self Care,2017,103,Pulmonary heart disease,000,NO PROC,134,Pulmonary embolism,04,Diseases and Disorders of the Respiratory System,2,Moderate,Moderate,Medical,Private Health Insurance,,,,N,Y,44488.40,11340.10
Long Island,Nassau,2908000,000511,NYU Winthrop Hospital,30 to 49,115,F,Black/African American,Not Span/Hispanic,12,Emergency,Home or Self Care,2017,103,Pulmonary heart disease,000,NO PROC,134,Pulmonary embolism,04,Diseases and Disorders of the Respiratory System,2,Moderate,Minor,Medical,Private Health Insurance,,,,N,Y,72680.10,15896.03
Long Island,Nassau,2908000,000511,NYU Winthrop Hospital,70 or Older,117,F,White,Not Span/Hispanic,4,Urgent,Home w/ Home Health Services,2017,103,Pulmonary heart disease,000,NO PROC,134,Pulmonary embolism,04,Diseases and Disorders of the Respiratory System,2,Moderate,Moderate,Medical,Medicare,Medicare,Private Health Insurance,,N,N,56959.37,12206.81
Long Island,Nassau,2908000,000511,NYU Winthrop Hospital,70 or Older,115,M,White,Not Span/Hispanic,2,Emergency,Home w/ Home Health Services,2017,103,Pulmonary heart disease,000,NO PROC,134,Pulmonary embolism,04,Diseases and Disorders of the Respiratory System,1,Minor,Minor,Medical,Medicare,Medicare,Private Health Insurance,,N,Y,46237.78,9565.63
Long Island,Nassau,2908000,000511,NYU Winthrop Hospital,50 to 69,110,M,White,Not Span/Hispanic,4,Emergency,Home or Self Care,2017,103,Pulmonary heart disease,039,INCISION OF PLEURA,134,Pulmonary embolism,04,Diseases and Disorders of the Respiratory System,2,Moderate,Moderate,Medical,Private Health Insurance,,,,N,Y,69417.47,16694.82
Long Island,Nassau,2908000,000511,NYU Winthrop Hospital,30 to 49,114,M,Black/African American,Not Span/Hispanic,3,Emergency,Home or Self Care,2017,103,Pulmonary heart disease,000,NO PROC,134,Pulmonary embolism,04,Diseases and Disorders of the Respiratory System,2,Moderate,Minor,Medical,Private Health Insurance,,,,N,Y,46996.42,8460.34
Long Island,Nassau,2908000,000511,NYU Winthrop Hospital,70 or Older,115,M,Black/African American,Not Span/Hispanic,5,Emergency,Skilled Nursing Home,2017,103,Pulmonary heart disease,061,OT OR PRCS VES NOT HEAD,134,Pulmonary embolism,04,Diseases and Disorders of the Respiratory System,2,Moderate,Moderate,Medical,Medicare,Medicare,Blue Cross/Blue Shield,,N,Y,58946.88,14218.93
Long Island,Nassau,2908000,000511,NYU Winthrop Hospital,70 or Older,115,F,White,Not Span/Hispanic,11,Emergency,Skilled Nursing Home,2017,103,Pulmonary heart disease,061,OT OR PRCS VES NOT HEAD,134,Pulmonary embolism,04,Diseases and Disorders of the Respiratory System,3,Major,Major,Medical,Medicare,Medicare,Private Health Insurance,,N,Y,185802.60,46862.89
Long Island,Nassau,2908000,000511,NYU Winthrop Hospital,50 to 69,115,M,White,Not Span/Hispanic,3,Emergency,Home w/ Home Health Services,2017,103,Pulmonary heart disease,000,NO PROC,134,Pulmonary embolism,04,Diseases and Disorders of the Respiratory System,1,Minor,Minor,Medical,Private Health Insurance,,,,N,Y,54385.87,11450.00
Long Island,Nassau,2908000,000511,NYU Winthrop Hospital,18 to 29,103,M,Black/African American,Not Span/Hispanic,2,Emergency,Home or Self Care,2017,103,Pulmonary heart disease,000,NO PROC,134,Pulmonary embolism,04,Diseases and Disorders of the Respiratory System,1,Minor,Minor,Medical,Blue Cross/Blue Shield,,,,N,Y,44161.88,6721.95
Long Island,Nassau,2908000,000511,NYU Winthrop Hospital,50 to 69,115,M,White,Not Span/Hispanic,4,Emergency,Home or Self Care,2017,103,Pulmonary heart disease,000,NO PROC,134,Pulmonary embolism,04,Diseases and Disorders of the Respiratory System,2,Moderate,Minor,Medical,Medicare,Medicare,,,N,Y,63421.86,15156.15
Long Island,Nassau,2908000,000511,NYU Winthrop Hospital,70 or Older,115,F,White,Not Span/Hispanic,9,Emergency,Skilled Nursing Home,2017,103,Pulmonary heart disease,000,NO PROC,134,Pulmonary embolism,04,Diseases and Disorders of the Respiratory System,3,Major,Major,Medical,Medicare,Medicare,Blue Cross/Blue Shield,,N,Y,94470.46,17865.46
Long Island,Nassau,2908000,000511,NYU Winthrop Hospital,18 to 29,117,F,White,Not Span/Hispanic,4,Emergency,Home or Self Care,2017,103,Pulmonary heart disease,000,NO PROC,134,Pulmonary embolism,04,Diseases and Disorders of the Respiratory System,3,Major,Moderate,Medical,Private Health Insurance,,,,N,Y,78117.97,14690.12
Long Island,Nassau,2908000,000511,NYU Winthrop Hospital,30 to 49,116,F,Black/African American,Not Span/Hispanic,3,Urgent,Home or Self Care,2017,103,Pulmonary heart disease,000,NO PROC,134,Pulmonary embolism,04,Diseases and Disorders of the Respiratory System,2,Moderate,Minor,Medical,Private Health Insurance,,,,N,N,41303.94,9550.02
Long Island,Nassau,2908000,000511,NYU Winthrop Hospital,70 or Older,118,F,White,Not Span/Hispanic,4,Emergency,Home or Self Care,2017,103,Pulmonary heart disease,047,DX CARDIAC CATHETERIZTN,134,Pulmonary embolism,04,Diseases and Disorders of the Respiratory System,1,Minor,Moderate,Medical,Medicare,Medicare,Blue Cross/Blue Shield,,N,Y,96339.77,20887.42
Long Island,Nassau,2908000,000511,NYU Winthrop Hospital,30 to 49,OOS,M,White,Not Span/Hispanic,2,Emergency,Expired,2017,103,Pulmonary heart disease,216,RESP INTUB/MECH VENTIL,134,Pulmonary embolism,04,Diseases and Disorders of the Respiratory System,2,Moderate,Minor,Medical,Private Health Insurance,,,,N,Y,45493.45,8238.67
Long Island,Nassau,2908000,000511,NYU Winthrop Hospital,50 to 69,117,F,White,Not Span/Hispanic,2,Emergency,Home or Self Care,2017,103,Pulmonary heart disease,000,NO PROC,134,Pulmonary embolism,04,Diseases and Disorders of the Respiratory System,1,Minor,Minor,Medical,Private Health Insurance,,,,N,Y,33601.72,5529.81
Long Island,Nassau,2908000,000511,NYU Winthrop Hospital,18 to 29,117,F,White,Not Span/Hispanic,7,Emergency,Home or Self Care,2017,103,Pulmonary heart disease,000,NO PROC,134,Pulmonary embolism,04,Diseases and Disorders of the Respiratory System,2,Moderate,Minor,Medical,Private Health Insurance,,,,N,Y,45174.67,9745.12
Long Island,Nassau,2908000,000511,NYU Winthrop Hospital,70 or Older,115,F,White,Spanish/Hispanic,1,Emergency,Home or Self Care,2017,103,Pulmonary heart disease,000,NO PROC,134,Pulmonary embolism,04,Diseases and Disorders of the Respiratory System,2,Moderate,Moderate,Medical,Private Health Insurance,Medicaid,,,N,Y,27032.47,5145.58
Long Island,Nassau,2908000,000511,NYU Winthrop Hospital,70 or Older,117,F,White,Not Span/Hispanic,3,Emergency,Home w/ Home Health Services,2017,103,Pulmonary heart disease,054,OT VASC CATH; NOT HEART,134,Pulmonary embolism,04,Diseases and Disorders of the Respiratory System,3,Major,Major,Medical,Medicare,Medicare,Private Health Insurance,,N,Y,68167.83,16375.54
Long Island,Nassau,2908000,000511,NYU Winthrop Hospital,50 to 69,115,F,Black/African American,Not Span/Hispanic,2,Emergency,Home or Self Care,2017,103,Pulmonary heart disease,211,THERAPEUTIC RADIOLOGY,134,Pulmonary embolism,04,Diseases and Disorders of the Respiratory System,3,Major,Major,Medical,Medicare,Medicare,Medicaid,,N,Y,42467.36,6466.50
Long Island,Nassau,2908000,000511,NYU Winthrop Hospital,70 or Older,112,F,White,Not Span/Hispanic,4,Emergency,Home w/ Home Health Services,2017,103,Pulmonary heart disease,000,NO PROC,134,Pulmonary embolism,04,Diseases and Disorders of the Respiratory System,2,Moderate,Major,Medical,Medicare,Medicare,Private Health Insurance,,N,Y,83963.95,18960.94
Long Island,Nassau,2908000,000511,NYU Winthrop Hospital,70 or Older,115,M,White,Not Span/Hispanic,2,Emergency,Home or Self Care,2017,103,Pulmonary heart disease,000,NO PROC,134,Pulmonary embolism,04,Diseases and Disorders of the Respiratory System,2,Moderate,Minor,Medical,Medicare,Medicare,,,N,Y,58517.46,11425.38
Long Island,Nassau,2908000,000511,NYU Winthrop Hospital,50 to 69,115,M,White,Not Span/Hispanic,5,Emergency,Home or Self Care,2017,103,Pulmonary heart disease,000,NO PROC,134,Pulmonary embolism,04,Diseases and Disorders of the Respiratory System,3,Major,Major,Medical,Private Health Insurance,,,,N,Y,82252.67,15859.95
Long Island,Nassau,2908000,000511,NYU Winthrop Hospital,50 to 69,115,F,Black/African American,Not Span/Hispanic,7,Emergency,Home w/ Home Health Services,2017,103,Pulmonary heart disease,000,NO PROC,134,Pulmonary embolism,04,Diseases and Disorders of the Respiratory System,3,Major,Moderate,Medical,Private Health Insurance,,,,N,Y,101837.50,25660.06
Long Island,Nassau,2908000,000511,NYU Winthrop Hospital,50 to 69,117,M,White,Not Span/Hispanic,2,Emergency,Home or Self Care,2017,103,Pulmonary heart disease,000,NO PROC,134,Pulmonary embolism,04,Diseases and Disorders of the Respiratory System,2,Moderate,Minor,Medical,Private Health Insurance,,,,N,Y,41251.31,8846.88
Long Island,Nassau,2908000,000511,NYU Winthrop Hospital,50 to 69,115,F,White,Not Span/Hispanic,1,Emergency,Home or Self Care,2017,103,Pulmonary heart disease,000,NO PROC,134,Pulmonary embolism,04,Diseases and Disorders of the Respiratory System,1,Minor,Minor,Medical,Private Health Insurance,,,,N,N,9615.00,2924.36
Long Island,Nassau,2908000,000511,NYU Winthrop Hospital,70 or Older,110,F,White,Not Span/Hispanic,19,Emergency,Skilled Nursing Home,2017,103,Pulmonary heart disease,225,CONV OF CARDIAC RHYTHM,134,Pulmonary embolism,04,Diseases and Disorders of the Respiratory System,4,Extreme,Extreme,Medical,Medicare,Medicare,,,N,Y,317976.37,64746.75
Long Island,Nassau,2908000,000511,NYU Winthrop Hospital,50 to 69,115,F,White,Not Span/Hispanic,12,Emergency,Home w/ Home Health Services,2017,103,Pulmonary heart disease,216,RESP INTUB/MECH VENTIL,134,Pulmonary embolism,04,Diseases and Disorders of the Respiratory System,2,Moderate,Moderate,Medical,Medicaid,Medicaid,,,N,Y,143180.44,27442.28
Long Island,Nassau,2908000,000511,NYU Winthrop Hospital,50 to 69,110,F,White,Not Span/Hispanic,3,Emergency,Home or Self Care,2017,103,Pulmonary heart disease,000,NO PROC,134,Pulmonary embolism,04,Diseases and Disorders of the Respiratory System,3,Major,Moderate,Medical,Private Health Insurance,,,,N,Y,66182.40,10806.11
Long Island,Nassau,2908000,000511,NYU Winthrop Hospital,70 or Older,115,F,White,Not Span/Hispanic,1,Emergency,Home or Self Care,2017,103,Pulmonary heart disease,061,OT OR PRCS VES NOT HEAD,134,Pulmonary embolism,04,Diseases and Disorders of the Respiratory System,2,Moderate,Moderate,Medical,Medicare,Medicare,Self-Pay,,N,Y,32181.46,8513.04
Long Island,Nassau,2908000,000511,NYU Winthrop Hospital,70 or Older,115,F,White,Not Span/Hispanic,8,Emergency,Skilled Nursing Home,2017,103,Pulmonary heart disease,000,NO PROC,134,Pulmonary embolism,04,Diseases and Disorders of the Respiratory System,3,Major,Extreme,Medical,Medicare,Medicare,Private Health Insurance,,N,Y,61871.10,13367.13
Long Island,Nassau,2908000,000511,NYU Winthrop Hospital,70 or Older,115,F,Black/African American,Not Span/Hispanic,4,Emergency,Home w/ Home Health Services,2017,103,Pulmonary heart disease,000,NO PROC,134,Pulmonary embolism,04,Diseases and Disorders of the Respiratory System,3,Major,Major,Medical,Medicare,Medicare,,,N,Y,39351.28,7755.51
Long Island,Nassau,2908000,000511,NYU Winthrop Hospital,50 to 69,117,M,White,Not Span/Hispanic,4,Emergency,Home or Self Care,2017,103,Pulmonary heart disease,000,NO PROC,134,Pulmonary embolism,04,Diseases and Disorders of the Respiratory System,2,Moderate,Minor,Medical,Private Health Insurance,,,,N,Y,37201.13,7545.11
Long Island,Nassau,2908000,000511,NYU Winthrop Hospital,50 to 69,118,M,White,Not Span/Hispanic,2,Emergency,Home or Self Care,2017,103,Pulmonary heart disease,000,NO PROC,134,Pulmonary embolism,04,Diseases and Disorders of the Respiratory System,3,Major,Minor,Medical,Medicare,Medicare,Private Health Insurance,,N,Y,47322.74,9570.91
Long Island,Nassau,2908000,000511,NYU Winthrop Hospital,70 or Older,110,F,White,Not Span/Hispanic,4,Emergency,Home or Self Care,2017,103,Pulmonary heart disease,000,NO PROC,134,Pulmonary embolism,04,Diseases and Disorders of the Respiratory System,2,Moderate,Moderate,Medical,Blue Cross/Blue Shield,Medicare,,,N,Y,53129.31,14257.51
Long Island,Nassau,2908000,000511,NYU Winthrop Hospital,30 to 49,115,F,Black/African American,Not Span/Hispanic,3,Emergency,Home or Self Care,2017,103,Pulmonary heart disease,000,NO PROC,134,Pulmonary embolism,04,Diseases and Disorders of the Respiratory System,2,Moderate,Minor,Medical,Medicaid,Medicaid,,,N,Y,45128.86,6927.76
Long Island,Nassau,2908000,000511,NYU Winthrop Hospital,50 to 69,115,F,White,Not Span/Hispanic,5,Emergency,Home or Self Care,2017,103,Pulmonary heart disease,000,NO PROC,134,Pulmonary embolism,04,Diseases and Disorders of the Respiratory System,2,Moderate,Minor,Medical,Medicare,Medicare,Private Health Insurance,,N,Y,80178.67,18782.89
Long Island,Nassau,2908000,000511,NYU Winthrop Hospital,70 or Older,110,F,White,Not Span/Hispanic,7,Emergency,Home w/ Home Health Services,2017,103,Pulmonary heart disease,000,NO PROC,134,Pulmonary embolism,04,Diseases and Disorders of the Respiratory System,2,Moderate,Moderate,Medical,Medicare,Medicare,Private Health Insurance,,N,Y,108332.23,26019.58
Long Island,Nassau,2908000,000511,NYU Winthrop Hospital,50 to 69,117,M,White,Not Span/Hispanic,7,Emergency,Home or Self Care,2017,103,Pulmonary heart disease,000,NO PROC,134,Pulmonary embolism,04,Diseases and Disorders of the Respiratory System,3,Major,Major,Medical,Medicare,Private Health Insurance,,,N,Y,109085.86,25565.43
Long Island,Nassau,2908000,000511,NYU Winthrop Hospital,70 or Older,110,F,White,Not Span/Hispanic,6,Emergency,Home or Self Care,2017,103,Pulmonary heart disease,061,OT OR PRCS VES NOT HEAD,134,Pulmonary embolism,04,Diseases and Disorders of the Respiratory System,3,Major,Major,Medical,Medicare,Medicare,Medicaid,,N,Y,121558.63,30299.56
Long Island,Nassau,2908000,000511,NYU Winthrop Hospital,50 to 69,115,F,Black/African American,Not Span/Hispanic,2,Emergency,Home or Self Care,2017,103,Pulmonary heart disease,000,NO PROC,134,Pulmonary embolism,04,Diseases and Disorders of the Respiratory System,2,Moderate,Minor,Medical,Private Health Insurance,,,,N,Y,26522.86,4940.84
Long Island,Nassau,2908000,000511,NYU Winthrop Hospital,30 to 49,,F,Black/African American,Not Span/Hispanic,3,Emergency,Home or Self Care,2017,103,Pulmonary heart disease,000,NO PROC,134,Pulmonary embolism,04,Diseases and Disorders of the Respiratory System,1,Minor,Minor,Medical,Medicaid,Medicaid,,,N,Y,61532.22,13473.82
Long Island,Nassau,2908000,000511,NYU Winthrop Hospital,0 to 17,110,F,White,Not Span/Hispanic,3,Emergency,Home w/ Home Health Services,2017,103,Pulmonary heart disease,000,NO PROC,134,Pulmonary embolism,04,Diseases and Disorders of the Respiratory System,2,Moderate,Minor,Medical,Private Health Insurance,,,,N,Y,59962.29,9815.32
Long Island,Nassau,2908000,000511,NYU Winthrop Hospital,30 to 49,112,M,Black/African American,Not Span/Hispanic,1,Emergency,Home or Self Care,2017,103,Pulmonary heart disease,000,NO PROC,134,Pulmonary embolism,04,Diseases and Disorders of the Respiratory System,1,Minor,Minor,Medical,Blue Cross/Blue Shield,,,,N,Y,24968.26,5339.73