Hospital Service Area,Hospital County,Operating Certificate Number,Permanent Facility Id,Facility Name,Age Group,Zip Code - 3 digits,Gender,Race,Ethnicity,Length of Stay,Type of Admission,Patient Disposition,Discharge Year,CCS Diagnosis Code,CCS Diagnosis Description,CCS Procedure Code,CCS Procedure Description,APR DRG Code,APR DRG Description,APR MDC Code,APR MDC Description,APR Severity of Illness Code,APR Severity of Illness Description,APR Risk of Mortality,APR Medical Surgical Description,Payment Typology 1,Payment Typology 2,Payment Typology 3,Birth Weight,Abortion Edit Indicator,Emergency Department Indicator,Total Charges,Total Costs
Long Island,Suffolk,5151001,000245,Stony Brook University Hospital,50 to 69,117,F,White,Not Span/Hispanic,4,Emergency,Short-term Hospital,2018,CIR013,ACUTE PULMONARY EMBOLISM,,,134,PULMONARY EMBOLISM,04,DISEASES AND DISORDERS OF THE RESPIRATORY SYSTEM,4,Extreme,Major,Medical,Self-Pay,Medicare,,,,true,67552.82,16760.55
Long Island,Nassau,7003004,000518,Long Island Jewish Valley Stream,70 or Older,114,F,Black/African American,Not Span/Hispanic,10,Emergency,Home or Self Care,2018,CIR013,ACUTE PULMONARY EMBOLISM,,,134,PULMONARY EMBOLISM,04,DISEASES AND DISORDERS OF THE RESPIRATORY SYSTEM,2,Moderate,Major,Medical,Medicaid,,,,,true,118537.42,23121.46
New York City,Manhattan,7002054,001458,New York-Presbyterian Hospital - New York Weill Cornell Center,50 to 69,100,F,Black/African American,Not Span/Hispanic,6,Emergency,Home w/ Home Health Services,2018,CIR013,ACUTE PULMONARY EMBOLISM,LYM001,LYMPH NODE BIOPSY,134,PULMONARY EMBOLISM,04,DISEASES AND DISORDERS OF THE RESPIRATORY SYSTEM,3,Major,Major,Medical,Medicare,Blue Cross/Blue Shield,Self-Pay,,,true,146162.24,57789.7
New York City,Manhattan,7002032,001469,Mount Sinai Morningside,50 to 69,100,F,Black/African American,Unknown,1,Urgent,Home or Self Care,2018,CIR013,ACUTE PULMONARY EMBOLISM,IMG008,ULTRASONOGRAPHY,134,PULMONARY EMBOLISM,04,DISEASES AND DISORDERS OF THE RESPIRATORY SYSTEM,1,Minor,Minor,Medical,Medicare,Medicare,Medicaid,,,false,13378.99,3246.94
New York City,Manhattan,7002054,001464,New York-Presbyterian Hospital - Columbia Presbyterian Center,70 or Older,112,M,Other Race,Spanish/Hispanic,2,Emergency,Home w/ Home Health Services,2018,CIR013,ACUTE PULMONARY EMBOLISM,,,134,PULMONARY EMBOLISM,04,DISEASES AND DISORDERS OF THE RESPIRATORY SYSTEM,4,Extreme,Major,Medical,Medicare,Medicare,Medicaid,,,true,38361.27,8575.03
New York City,Kings,7001020,001305,Maimonides Medical Center,70 or Older,112,M,White,Not Span/Hispanic,17,Emergency,Hospice - Home,2018,CIR013,ACUTE PULMONARY EMBOLISM,CAR024,VENOUS AND ARTERIAL CATHETER PLACEMENT,134,PULMONARY EMBOLISM,04,DISEASES AND DISORDERS OF THE RESPIRATORY SYSTEM,4,Extreme,Extreme,Medical,Medicare,Private Health Insurance,Medicaid,,,true,176225.03,31872.78
Capital/Adirond,Albany,0101004,000005,St. Peter's Hospital,50 to 69,122,M,White,Not Span/Hispanic,10,Emergency,Home w/ Home Health Services,2018,CIR013,ACUTE PULMONARY EMBOLISM,RES005,CHEST TUBE PLACEMENT AND THERAPEUTIC THORACENTESIS,134,PULMONARY EMBOLISM,04,DISEASES AND DISORDERS OF THE RESPIRATORY SYSTEM,3,Major,Major,Medical,Blue Cross/Blue Shield,,,,,true,53230.35,18633.64
Western NY,Erie,1401005,000210,Erie County Medical Center,50 to 69,142,M,Black/African American,Not Span/Hispanic,4,Emergency,Psychiatric Hospital or Unit of Hosp,2018,CIR013,ACUTE PULMONARY EMBOLISM,ADM005,ADMINISTRATION OF THROMBOLYTICS AND PLATELET INHIBITORS,134,PULMONARY EMBOLISM,04,DISEASES AND DISORDERS OF THE RESPIRATORY SYSTEM,3,Major,Moderate,Medical,Medicare,Medicaid,,,,true,30043.65,12840.65
Long Island,Nassau,2950001,000527,Mount Sinai South Nassau,50 to 69,115,M,White,Not Span/Hispanic,4,Emergency,Home w/ Home Health Services,2018,CIR013,ACUTE PULMONARY EMBOLISM,ESA004,NON-INVASIVE VENTILATION,134,PULMONARY EMBOLISM,04,DISEASES AND DISORDERS OF THE RESPIRATORY SYSTEM,3,Major,Major,Medical,Blue Cross/Blue Shield,,,,,true,61559.56,8124.33
Long Island,Nassau,2951001,000541,North Shore University Hospital,50 to 69,114,M,Black/African American,Not Span/Hispanic,6,Emergency,Federal Health Care Facility,2018,CIR013,ACUTE PULMONARY EMBOLISM,,,134,PULMONARY EMBOLISM,04,DISEASES AND DISORDERS OF THE RESPIRATORY SYSTEM,2,Moderate,Moderate,Medical,Medicare,Medicaid,,,,true,74146.5,11814.27
Long Island,Suffolk,5154000,000924,South Shore University Hospital,30 to 49,117,F,White,Not Span/Hispanic,5,Emergency,Home w/ Home Health Services,2018,CIR013,ACUTE PULMONARY EMBOLISM,,,134,PULMONARY EMBOLISM,04,DISEASES AND DISORDERS OF THE RESPIRATORY SYSTEM,2,Moderate,Minor,Medical,Medicare,Medicare,Medicaid,,,true,54742.43,11158.31
Western NY,Erie,1401008,000213,Mercy Hospital of Buffalo,18 to 29,142,M,Black/African American,Not Span/Hispanic,4,Emergency,Home or Self Care,2018,CIR013,ACUTE PULMONARY EMBOLISM,,,134,PULMONARY EMBOLISM,04,DISEASES AND DISORDERS OF THE RESPIRATORY SYSTEM,2,Moderate,Minor,Medical,Miscellaneous/Other,Blue Cross/Blue Shield,Private Health Insurance,,,false,24386.92,8680.03
New York City,Manhattan,7002054,001464,New York-Presbyterian Hospital - Columbia Presbyterian Center,50 to 69,100,M,Other Race,Not Span/Hispanic,2,Emergency,Home or Self Care,2018,CIR013,ACUTE PULMONARY EMBOLISM,,,134,PULMONARY EMBOLISM,04,DISEASES AND DISORDERS OF THE RESPIRATORY SYSTEM,3,Major,Major,Medical,Private Health Insurance,Self-Pay,,,,false,50091.44,21773.27
Long Island,Nassau,2953000,000563,St. Francis Hospital & Heart Center,50 to 69,116,F,White,Not Span/Hispanic,9,Emergency,Home w/ Home Health Services,2018,CIR013,ACUTE PULMONARY EMBOLISM,,,134,PULMONARY EMBOLISM,04,DISEASES AND DISORDERS OF THE RESPIRATORY SYSTEM,3,Major,Moderate,Medical,Medicare,Medicaid,,,,false,58079,12781.57
Hudson Valley,Dutchess,5957001,000180,Mid-Hudson Valley Division of Westchester Medical Center,50 to 69,126,F,White,Not Span/Hispanic,2,Emergency,Home or Self Care,2018,CIR013,ACUTE PULMONARY EMBOLISM,,,134,PULMONARY EMBOLISM,04,DISEASES AND DISORDERS OF THE RESPIRATORY SYSTEM,2,Moderate,Minor,Medical,Private Health Insurance,,,,,true,47217.35,7926.83
Finger Lakes,Wayne,5820000,001028,Newark-Wayne Community Hospital,70 or Older,144,F,White,Not Span/Hispanic,5,Emergency,Skilled Nursing Home,2018,CIR013,ACUTE PULMONARY EMBOLISM,,,134,PULMONARY EMBOLISM,04,DISEASES AND DISORDERS OF THE RESPIRATORY SYSTEM,2,Moderate,Moderate,Medical,Medicare,Medicaid,,,,true,17126.21,5329.35
New York City,Bronx,7000002,001165,Jacobi Medical Center,70 or Older,104,F,Black/African American,Not Span/Hispanic,8,Emergency,Short-term Hospital,2018,CIR013,ACUTE PULMONARY EMBOLISM,CAR008,ANGIOPLASTY AND RELATED VESSEL PROCEDURES (ENDOVASCULAR; EXCLUDING CAROTID),134,PULMONARY EMBOLISM,04,DISEASES AND DISORDERS OF THE RESPIRATORY SYSTEM,2,Moderate,Moderate,Medical,Medicare,Medicare,,,,true,61978.25,36669.43
New York City,Bronx,7000001,001178,BronxCare Hospital Center,30 to 49,104,M,Black/African American,Not Span/Hispanic,1,Emergency,Short-term Hospital,2018,CIR013,ACUTE PULMONARY EMBOLISM,,,134,PULMONARY EMBOLISM,04,DISEASES AND DISORDERS OF THE RESPIRATORY SYSTEM,2,Moderate,Minor,Medical,Medicaid,,,,,true,10455.49,8707.09
Long Island,Suffolk,5154000,000924,South Shore University Hospital,70 or Older,117,F,White,Not Span/Hispanic,2,Emergency,Home or Self Care,2018,CIR013,ACUTE PULMONARY EMBOLISM,,,134,PULMONARY EMBOLISM,04,DISEASES AND DISORDERS OF THE RESPIRATORY SYSTEM,1,Minor,Moderate,Medical,Medicare,Medicare,,,,true,30863.45,5811.08
New York City,Kings,7001020,001305,Maimonides Medical Center,30 to 49,112,F,Black/African American,Not Span/Hispanic,3,Emergency,Home or Self Care,2018,CIR013,ACUTE PULMONARY EMBOLISM,,,134,PULMONARY EMBOLISM,04,DISEASES AND DISORDERS OF THE RESPIRATORY SYSTEM,1,Minor,Minor,Medical,Blue Cross/Blue Shield,Self-Pay,,,,false,35733,8866.93
Central NY,Onondaga,3301003,000630,St. Joseph's Hospital Health Center,70 or Older,130,M,Black/African American,Not Span/Hispanic,4,Emergency,Home w/ Home Health Services,2018,CIR013,ACUTE PULMONARY EMBOLISM,IMG008,ULTRASONOGRAPHY,134,PULMONARY EMBOLISM,04,DISEASES AND DISORDERS OF THE RESPIRATORY SYSTEM,3,Major,Major,Medical,Medicare,,,,,true,21718.28,7620.83
Long Island,Nassau,2951001,000541,North Shore University Hospital,70 or Older,113,M,White,Not Span/Hispanic,7,Urgent,Skilled Nursing Home,2018,CIR013,ACUTE PULMONARY EMBOLISM,CAR024,VENOUS AND ARTERIAL CATHETER PLACEMENT,134,PULMONARY EMBOLISM,04,DISEASES AND DISORDERS OF THE RESPIRATORY SYSTEM,3,Major,Extreme,Medical,Medicare,Private Health Insurance,,,,false,83525.92,13284.37
Long Island,Nassau,7003004,000518,Long Island Jewish Valley Stream,70 or Older,114,F,Black/African American,Not Span/Hispanic,1,Emergency,Home or Self Care,2018,CIR013,ACUTE PULMONARY EMBOLISM,,,134,PULMONARY EMBOLISM,04,DISEASES AND DISORDERS OF THE RESPIRATORY SYSTEM,2,Moderate,Moderate,Medical,Medicare,Private Health Insurance,,,,true,31456.06,4337.83
Long Island,Nassau,7003004,000518,Long Island Jewish Valley Stream,70 or Older,114,F,Black/African American,Not Span/Hispanic,2,Emergency,Home w/ Home Health Services,2018,CIR013,ACUTE PULMONARY EMBOLISM,,,134,PULMONARY EMBOLISM,04,DISEASES AND DISORDERS OF THE RESPIRATORY SYSTEM,1,Minor,Minor,Medical,Medicare,Private Health Insurance,,,,true,28952.58,5032.72
New York City,Queens,7001024,001635,St Johns Episcopal Hospital So Shore,30 to 49,116,F,Black/African American,Not Span/Hispanic,1,Emergency,Home or Self Care,2018,CIR013,ACUTE PULMONARY EMBOLISM,,,134,PULMONARY EMBOLISM,04,DISEASES AND DISORDERS OF THE RESPIRATORY SYSTEM,1,Minor,Minor,Medical,Medicaid,Medicaid,,,,true,10100.67,2578.66
Long Island,Suffolk,5151001,000245,Stony Brook University Hospital,50 to 69,117,F,White,Not Span/Hispanic,5,Emergency,Home or Self Care,2018,CIR013,ACUTE PULMONARY EMBOLISM,ESA004,NON-INVASIVE VENTILATION,134,PULMONARY EMBOLISM,04,DISEASES AND DISORDERS OF THE RESPIRATORY SYSTEM,3,Major,Major,Medical,Blue Cross/Blue Shield,Medicare,,,,true,72565.36,21577.37
New York City,Queens,7003004,001638,Long Island Jewish Forest Hills,30 to 49,113,M,Other Race,Spanish/Hispanic,1,Emergency,Home or Self Care,2018,CIR013,ACUTE PULMONARY EMBOLISM,,,134,PULMONARY EMBOLISM,04,DISEASES AND DISORDERS OF THE RESPIRATORY SYSTEM,1,Minor,Minor,Medical,Medicaid,Medicaid,,,,true,31563.26,4847.67
Long Island,Suffolk,5154000,000924,South Shore University Hospital,30 to 49,117,M,White,Not Span/Hispanic,8,Emergency,Home or Self Care,2018,CIR013,ACUTE PULMONARY EMBOLISM,,,134,PULMONARY EMBOLISM,04,DISEASES AND DISORDERS OF THE RESPIRATORY SYSTEM,3,Major,Moderate,Medical,Medicaid,Medicaid,,,,true,70530.38,14672.74
Long Island,Suffolk,5155000,000938,Peconic Bay Medical Center,70 or Older,119,F,White,Spanish/Hispanic,1,Emergency,Short-term Hospital,2018,CIR013,ACUTE PULMONARY EMBOLISM,,,134,PULMONARY EMBOLISM,04,DISEASES AND DISORDERS OF THE RESPIRATORY SYSTEM,2,Moderate,Minor,Medical,Medicare,Blue Cross/Blue Shield,,,,true,16988.37,2872.73
Western NY,Erie,1401014,003067,Millard Fillmore Suburban Hospital,50 to 69,140,F,White,Not Span/Hispanic,1,Emergency,Home or Self Care,2018,CIR013,ACUTE PULMONARY EMBOLISM,IMG008,ULTRASONOGRAPHY,134,PULMONARY EMBOLISM,04,DISEASES AND DISORDERS OF THE RESPIRATORY SYSTEM,2,Moderate,Minor,Medical,Blue Cross/Blue Shield,Self-Pay,,,,true,13433.88,3428.25
Long Island,Suffolk,5151001,000245,Stony Brook University Hospital,70 or Older,119,F,White,Not Span/Hispanic,5,Emergency,Expired,2018,CIR013,ACUTE PULMONARY EMBOLISM,ESA004,NON-INVASIVE VENTILATION,134,PULMONARY EMBOLISM,04,DISEASES AND DISORDERS OF THE RESPIRATORY SYSTEM,4,Extreme,Extreme,Medical,Medicare,Medicare,,,,true,70213.02,22095.81
Hudson Valley,Westchester,5902001,001045,White Plains Hospital Center,30 to 49,106,M,Other Race,Not Span/Hispanic,2,Emergency,Home or Self Care,2018,CIR013,ACUTE PULMONARY EMBOLISM,,,134,PULMONARY EMBOLISM,04,DISEASES AND DISORDERS OF THE RESPIRATORY SYSTEM,1,Minor,Minor,Medical,Miscellaneous/Other,Medicaid,,,,true,31623,6172.33
Finger Lakes,Monroe,2701005,000413,Strong Memorial Hospital,30 to 49,146,F,Other Race,Spanish/Hispanic,1,Emergency,Home or Self Care,2018,CIR013,ACUTE PULMONARY EMBOLISM,,,134,PULMONARY EMBOLISM,04,DISEASES AND DISORDERS OF THE RESPIRATORY SYSTEM,1,Minor,Minor,Medical,Blue Cross/Blue Shield,,,,,true,7007.31,2180.71
New York City,Bronx,7000006,001169,Montefiore Medical Center - Henry & Lucy Moses Div,50 to 69,104,F,Other Race,Spanish/Hispanic,1,Emergency,Home or Self Care,2018,CIR013,ACUTE PULMONARY EMBOLISM,ADM021,"ADMINISTRATION OF THERAPEUTIC SUBSTANCES, NEC",134,PULMONARY EMBOLISM,04,DISEASES AND DISORDERS OF THE RESPIRATORY SYSTEM,1,Minor,Minor,Medical,Private Health Insurance,,,,,true,25173.93,3303.46
Long Island,Nassau,2951001,000541,North Shore University Hospital,70 or Older,113,M,Other Race,Spanish/Hispanic,5,Emergency,Home or Self Care,2018,CIR013,ACUTE PULMONARY EMBOLISM,RHB003,SPEECH THERAPY EVALUATION,134,PULMONARY EMBOLISM,04,DISEASES AND DISORDERS OF THE RESPIRATORY SYSTEM,3,Major,Major,Medical,Medicare,Blue Cross/Blue Shield,,,,true,76274.99,11587.03
New York City,Kings,7001021,001306,New York - Presbyterian Brooklyn Methodist Hospital,70 or Older,112,F,Black/African American,Not Span/Hispanic,4,Emergency,Home w/ Home Health Services,2018,CIR013,ACUTE PULMONARY EMBOLISM,,,134,PULMONARY EMBOLISM,04,DISEASES AND DISORDERS OF THE RESPIRATORY SYSTEM,2,Moderate,Moderate,Medical,Medicare,Medicare,Self-Pay,,,true,39276.62,9173.17
New York City,Queens,7003004,001638,Long Island Jewish Forest Hills,50 to 69,113,F,Other Race,Not Span/Hispanic,4,Emergency,Skilled Nursing Home,2018,CIR013,ACUTE PULMONARY EMBOLISM,,,134,PULMONARY EMBOLISM,04,DISEASES AND DISORDERS OF THE RESPIRATORY SYSTEM,2,Moderate,Moderate,Medical,Medicare,Medicaid,,,,true,87227.99,16148.94
Central NY,Onondaga,3301007,000635,University Hospital SUNY Health Science Center,70 or Older,132,F,White,Not Span/Hispanic,5,Emergency,Home or Self Care,2018,CIR013,ACUTE PULMONARY EMBOLISM,IMG008,ULTRASONOGRAPHY,134,PULMONARY EMBOLISM,04,DISEASES AND DISORDERS OF THE RESPIRATORY SYSTEM,2,Moderate,Moderate,Medical,Medicare,,,,,true,36287.4,8264.35
Long Island,Nassau,2909000,000513,Mercy Hospital,18 to 29,115,F,White,Not Span/Hispanic,2,Emergency,Home or Self Care,2018,CIR013,ACUTE PULMONARY EMBOLISM,,,134,PULMONARY EMBOLISM,04,DISEASES AND DISORDERS OF THE RESPIRATORY SYSTEM,2,Moderate,Minor,Medical,Private Health Insurance,,,,,true,24315,4780.59
New York City,Richmond,7004003,001737,Staten Island University Hospital Prince's Bay,50 to 69,103,F,White,Not Span/Hispanic,1,Emergency,Home or Self Care,2018,CIR013,ACUTE PULMONARY EMBOLISM,ESA004,NON-INVASIVE VENTILATION,134,PULMONARY EMBOLISM,04,DISEASES AND DISORDERS OF THE RESPIRATORY SYSTEM,2,Moderate,Minor,Medical,Blue Cross/Blue Shield,,,,,true,15623.16,3786.25
Long Island,Nassau,2952005,000552,Plainview Hospital,70 or Older,117,M,White,Not Span/Hispanic,3,Emergency,Home or Self Care,2018,CIR013,ACUTE PULMONARY EMBOLISM,,,134,PULMONARY EMBOLISM,04,DISEASES AND DISORDERS OF THE RESPIRATORY SYSTEM,3,Major,Major,Medical,Medicare,Private Health Insurance,,,,true,31645.18,9131.66
New York City,Manhattan,7002032,001466,Mount Sinai West,70 or Older,100,F,White,Not Span/Hispanic,4,Urgent,Skilled Nursing Home,2018,CIR013,ACUTE PULMONARY EMBOLISM,IMG008,ULTRASONOGRAPHY,134,PULMONARY EMBOLISM,04,DISEASES AND DISORDERS OF THE RESPIRATORY SYSTEM,2,Moderate,Minor,Medical,Medicare,Medicare,Self-Pay,,,false,40197.65,10041.25
Central NY,Tompkins,5401001,000977,Cayuga Medical Center at Ithaca,70 or Older,130,M,White,Not Span/Hispanic,2,Emergency,Expired,2018,CIR013,ACUTE PULMONARY EMBOLISM,ESA003,MECHANICAL VENTILATION,134,PULMONARY EMBOLISM,04,DISEASES AND DISORDERS OF THE RESPIRATORY SYSTEM,4,Extreme,Extreme,Medical,Medicare,Self-Pay,Self-Pay,,,true,34833.04,14475.56
New York City,Queens,7003004,001630,Long Island Jewish Medical Center,70 or Older,113,F,Other Race,Spanish/Hispanic,2,Emergency,Home or Self Care,2018,CIR013,ACUTE PULMONARY EMBOLISM,,,134,PULMONARY EMBOLISM,04,DISEASES AND DISORDERS OF THE RESPIRATORY SYSTEM,2,Moderate,Moderate,Medical,Medicare,Medicare,Self-Pay,,,true,50099.67,13550.18
Long Island,Nassau,2951001,000541,North Shore University Hospital,70 or Older,115,F,White,Not Span/Hispanic,15,Emergency,Expired,2018,CIR013,ACUTE PULMONARY EMBOLISM,,,134,PULMONARY EMBOLISM,04,DISEASES AND DISORDERS OF THE RESPIRATORY SYSTEM,4,Extreme,Extreme,Medical,Medicare,Private Health Insurance,,,,true,269570.58,44054.6
Long Island,Nassau,2952005,000552,Plainview Hospital,30 to 49,117,M,White,Not Span/Hispanic,1,Emergency,Home or Self Care,2018,CIR013,ACUTE PULMONARY EMBOLISM,,,134,PULMONARY EMBOLISM,04,DISEASES AND DISORDERS OF THE RESPIRATORY SYSTEM,1,Minor,Minor,Medical,Blue Cross/Blue Shield,,,,,true,16862.38,3619.16
Long Island,Nassau,2908000,000511,NYU Langone Hospital-Long Island,70 or Older,117,M,White,Not Span/Hispanic,3,Emergency,Home or Self Care,2018,CIR013,ACUTE PULMONARY EMBOLISM,RAD001,BEAM RADIATION,134,PULMONARY EMBOLISM,04,DISEASES AND DISORDERS OF THE RESPIRATORY SYSTEM,2,Moderate,Major,Medical,Medicare,Medicare,Blue Cross/Blue Shield,,,true,69707.75,9060.37
Western NY,Erie,1401010,000216,Roswell Park Cancer Institute,30 to 49,140,F,White,Not Span/Hispanic,7,Elective,Home w/ Home Health Services,2018,CIR013,ACUTE PULMONARY EMBOLISM,IMG007,COMPUTERIZED TOMOGRAPHY (CT) WITHOUT CONTRAST,134,PULMONARY EMBOLISM,04,DISEASES AND DISORDERS OF THE RESPIRATORY SYSTEM,4,Extreme,Major,Medical,Blue Cross/Blue Shield,,,,,false,159633.97,64159.37
Capital/Adirond,Schenectady,4601001,000829,Ellis Hospital,50 to 69,123,M,White,Not Span/Hispanic,7,Emergency,Hospice - Medical Facility,2018,CIR013,ACUTE PULMONARY EMBOLISM,ADM017,ADMINISTRATION OF NUTRITIONAL AND ELECTROLYTIC SUBSTANCES,134,PULMONARY EMBOLISM,04,DISEASES AND DISORDERS OF THE RESPIRATORY SYSTEM,3,Major,Major,Medical,Private Health Insurance,,,,,true,45009.55,11673.47
Capital/Adirond,Schenectady,4601001,000829,Ellis Hospital,50 to 69,123,M,White,Not Span/Hispanic,9,Emergency,Home or Self Care,2018,CIR013,ACUTE PULMONARY EMBOLISM,ESA004,NON-INVASIVE VENTILATION,134,PULMONARY EMBOLISM,04,DISEASES AND DISORDERS OF THE RESPIRATORY SYSTEM,3,Major,Major,Medical,Blue Cross/Blue Shield,,,,,true,47759.15,18030.46
New York City,Kings,7001009,001294,Coney Island Hospital,30 to 49,112,F,Black/African American,Not Span/Hispanic,4,Emergency,Home or Self Care,2018,CIR013,ACUTE PULMONARY EMBOLISM,ADM021,"ADMINISTRATION OF THERAPEUTIC SUBSTANCES, NEC",134,PULMONARY EMBOLISM,04,DISEASES AND DISORDERS OF THE RESPIRATORY SYSTEM,2,Moderate,Minor,Medical,Medicaid,Medicaid,,,,true,28250.26,15812.49
New York City,Manhattan,7002032,001469,Mount Sinai Morningside,50 to 69,100,F,Black/African American,Not Span/Hispanic,5,Emergency,Court/Law Enforcement,2018,CIR013,ACUTE PULMONARY EMBOLISM,ADM021,"ADMINISTRATION OF THERAPEUTIC SUBSTANCES, NEC",134,PULMONARY EMBOLISM,04,DISEASES AND DISORDERS OF THE RESPIRATORY SYSTEM,3,Major,Moderate,Medical,Medicaid,Medicaid,Self-Pay,,,false,49827.28,12045.35
New York City,Manhattan,7002054,001464,New York-Presbyterian Hospital - Columbia Presbyterian Center,70 or Older,100,F,White,Not Span/Hispanic,1,Emergency,Expired,2018,CIR013,ACUTE PULMONARY EMBOLISM,,,134,PULMONARY EMBOLISM,04,DISEASES AND DISORDERS OF THE RESPIRATORY SYSTEM,4,Extreme,Extreme,Medical,Medicare,Medicaid,Self-Pay,,,true,15027.26,3463.72
Hudson Valley,Westchester,5957001,001139,Westchester Medical Center,70 or Older,105,F,White,Not Span/Hispanic,2,Emergency,Home or Self Care,2018,CIR014,PULMONARY HEART DISEASE,,,134,PULMONARY EMBOLISM,04,DISEASES AND DISORDERS OF THE RESPIRATORY SYSTEM,2,Moderate,Moderate,Medical,Medicare,Blue Cross/Blue Shield,,,,true,75564.33,12832.34
Western NY,Niagara,3101000,000565,Eastern Niagara Hospital - Lockport Division,30 to 49,140,M,White,Not Span/Hispanic,2,Emergency,Short-term Hospital,2018,CIR013,ACUTE PULMONARY EMBOLISM,RES006,OPEN AND THORACOSCOPIC PLEURAL DRAINAGE,134,PULMONARY EMBOLISM,04,DISEASES AND DISORDERS OF THE RESPIRATORY SYSTEM,4,Extreme,Major,Medical,Medicaid,,,,,true,21815.18,6219.13
Capital/Adirond,Schenectady,4601001,000829,Ellis Hospital,70 or Older,123,F,Other Race,Not Span/Hispanic,1,Emergency,Home or Self Care,2018,CIR013,ACUTE PULMONARY EMBOLISM,,,134,PULMONARY EMBOLISM,04,DISEASES AND DISORDERS OF THE RESPIRATORY SYSTEM,1,Minor,Minor,Medical,Medicaid,,,,,false,6522.7,1513.85
New York City,Bronx,7000001,001178,BronxCare Hospital Center,18 to 29,104,F,Other Race,Spanish/Hispanic,3,Emergency,Home or Self Care,2018,CIR014,PULMONARY HEART DISEASE,,,134,PULMONARY EMBOLISM,04,DISEASES AND DISORDERS OF THE RESPIRATORY SYSTEM,1,Minor,Minor,Medical,Self-Pay,,,,,true,14572.9,14871.24
Western NY,Erie,1401013,000218,Sisters of Charity Hospital,30 to 49,142,F,Black/African American,Not Span/Hispanic,2,Emergency,Home or Self Care,2018,CIR013,ACUTE PULMONARY EMBOLISM,,,134,PULMONARY EMBOLISM,04,DISEASES AND DISORDERS OF THE RESPIRATORY SYSTEM,2,Moderate,Minor,Medical,Medicaid,Medicaid,,,,true,9857.65,4081.28
Western NY,Erie,1401014,003067,Millard Fillmore Suburban Hospital,50 to 69,142,M,White,Not Span/Hispanic,2,Emergency,Home or Self Care,2018,CIR013,ACUTE PULMONARY EMBOLISM,,,134,PULMONARY EMBOLISM,04,DISEASES AND DISORDERS OF THE RESPIRATORY SYSTEM,1,Minor,Minor,Medical,Blue Cross/Blue Shield,Self-Pay,,,,true,12160.4,4213.87
New York City,Richmond,7004003,001740,Staten Island University Hosp-North,18 to 29,103,M,White,Not Span/Hispanic,1,Emergency,Home or Self Care,2018,CIR013,ACUTE PULMONARY EMBOLISM,ADM021,"ADMINISTRATION OF THERAPEUTIC SUBSTANCES, NEC",134,PULMONARY EMBOLISM,04,DISEASES AND DISORDERS OF THE RESPIRATORY SYSTEM,1,Minor,Minor,Medical,Medicaid,Medicaid,,,,true,23754.36,4053.23
Long Island,Nassau,2952006,000551,St. Joseph Hospital,70 or Older,117,M,White,Not Span/Hispanic,3,Emergency,Home w/ Home Health Services,2018,CIR013,ACUTE PULMONARY EMBOLISM,,,134,PULMONARY EMBOLISM,04,DISEASES AND DISORDERS OF THE RESPIRATORY SYSTEM,2,Moderate,Major,Medical,Medicare,Blue Cross/Blue Shield,,,,true,34499.7,7688.39
Long Island,Nassau,2951001,000541,North Shore University Hospital,50 to 69,114,F,Black/African American,Not Span/Hispanic,4,Emergency,Home or Self Care,2018,CIR013,ACUTE PULMONARY EMBOLISM,MST028,"SUBCUTANEOUS TISSUE AND FASCIA PROCEDURES, NEC",134,PULMONARY EMBOLISM,04,DISEASES AND DISORDERS OF THE RESPIRATORY SYSTEM,1,Minor,Minor,Medical,Miscellaneous/Other,Medicare,Blue Cross/Blue Shield,,,true,103060.3,17539.64
New York City,Manhattan,7002054,001437,New York-Presbyterian/Lower Manhattan Hospital,30 to 49,104,F,White,Spanish/Hispanic,2,Emergency,Home or Self Care,2018,CIR013,ACUTE PULMONARY EMBOLISM,ADM021,"ADMINISTRATION OF THERAPEUTIC SUBSTANCES, NEC",134,PULMONARY EMBOLISM,04,DISEASES AND DISORDERS OF THE RESPIRATORY SYSTEM,1,Minor,Minor,Medical,"Managed Care, Unspecified",Medicaid,Self-Pay,,,true,25119.65,5717.88
Hudson Valley,Dutchess,1302001,000181,Vassar Brothers Medical Center,50 to 69,124,M,White,Not Span/Hispanic,2,Emergency,Home or Self Care,2018,CIR013,ACUTE PULMONARY EMBOLISM,,,134,PULMONARY EMBOLISM,04,DISEASES AND DISORDERS OF THE RESPIRATORY SYSTEM,2,Moderate,Minor,Medical,"Managed Care, Unspecified",,,,,true,21122.52,4645.31
Central NY,Onondaga,3301003,000630,St. Joseph's Hospital Health Center,50 to 69,130,F,White,Not Span/Hispanic,2,Emergency,Home or Self Care,2018,CIR013,ACUTE PULMONARY EMBOLISM,,,134,PULMONARY EMBOLISM,04,DISEASES AND DISORDERS OF THE RESPIRATORY SYSTEM,1,Minor,Minor,Medical,Medicare,Medicaid,,,,true,11477.32,3171.52
Central NY,Onondaga,3301003,000630,St. Joseph's Hospital Health Center,70 or Older,130,F,White,Not Span/Hispanic,2,Emergency,Home w/ Home Health Services,2018,CIR013,ACUTE PULMONARY EMBOLISM,,,134,PULMONARY EMBOLISM,04,DISEASES AND DISORDERS OF THE RESPIRATORY SYSTEM,2,Moderate,Moderate,Medical,Medicare,Blue Cross/Blue Shield,,,,true,10748.54,3482.19