Hospital Service Area,Hospital County,Operating Certificate Number,Permanent Facility Id,Facility Name,Age Group,Zip Code - 3 digits,Gender,Race,Ethnicity,Length of Stay,Type of Admission,Patient Disposition,Discharge Year,CCS Diagnosis Code,CCS Diagnosis Description,CCS Procedure Code,CCS Procedure Description,APR DRG Code,APR DRG Description,APR MDC Code,APR MDC Description,APR Severity of Illness Code,APR Severity of Illness Description,APR Risk of Mortality,APR Medical Surgical Description,Payment Typology 1,Payment Typology 2,Payment Typology 3,Birth Weight,Abortion Edit Indicator,Emergency Department Indicator,Total Charges,Total Costs
Finger Lakes,Monroe,2701001,000409,Highland Hospital,50 to 69,144,M,White,Not Span/Hispanic,1,Emergency,Home or Self Care,2019,CIR013,ACUTE PULMONARY EMBOLISM,,,134,PULMONARY EMBOLISM,04,DISEASES AND DISORDERS OF THE RESPIRATORY SYSTEM,2,Moderate,Minor,Medical,Self-Pay,,,,,true,8374.54,1820.21
Hudson Valley,Westchester,5902001,001045,White Plains Hospital Center,30 to 49,104,F,Other Race,Not Span/Hispanic,2,Emergency,Home or Self Care,2019,CIR013,ACUTE PULMONARY EMBOLISM,,,134,PULMONARY EMBOLISM,04,DISEASES AND DISORDERS OF THE RESPIRATORY SYSTEM,3,Major,Moderate,Medical,Private Health Insurance,,,,,true,31354,5797.98
New York City,Manhattan,7002032,001466,Mount Sinai West,50 to 69,104,M,Black/African American,Not Span/Hispanic,1,Emergency,Home or Self Care,2019,CIR013,ACUTE PULMONARY EMBOLISM,IMG009,PLAIN RADIOGRAPHY,134,PULMONARY EMBOLISM,04,DISEASES AND DISORDERS OF THE RESPIRATORY SYSTEM,2,Moderate,Minor,Medical,Private Health Insurance,Self-Pay,,,,true,18198.19,5400.44
New York City,Manhattan,7002017,001450,Lenox Hill Hospital,70 or Older,,F,White,Spanish/Hispanic,1,Emergency,Home or Self Care,2019,CIR013,ACUTE PULMONARY EMBOLISM,,,134,PULMONARY EMBOLISM,04,DISEASES AND DISORDERS OF THE RESPIRATORY SYSTEM,1,Minor,Minor,Medical,Private Health Insurance,Medicare,,,,true,23307.66,3878.07
New York City,Kings,7001020,001305,Maimonides Medical Center,70 or Older,112,F,White,Not Span/Hispanic,1,Emergency,Left Against Medical Advice,2019,CIR013,ACUTE PULMONARY EMBOLISM,,,134,PULMONARY EMBOLISM,04,DISEASES AND DISORDERS OF THE RESPIRATORY SYSTEM,2,Moderate,Moderate,Medical,Medicare,Medicare,Self-Pay,,,true,17814,4603.21
Hudson Valley,Westchester,5932000,001129,Phelps Hospital,70 or Older,105,F,White,Not Span/Hispanic,7,Emergency,Inpatient Rehabilitation Facility,2019,CIR013,ACUTE PULMONARY EMBOLISM,,,134,PULMONARY EMBOLISM,04,DISEASES AND DISORDERS OF THE RESPIRATORY SYSTEM,3,Major,Moderate,Medical,Medicare,Private Health Insurance,,,,true,66535.49,25241.37
Finger Lakes,Monroe,2701003,000411,Rochester General Hospital,70 or Older,144,M,White,Not Span/Hispanic,5,Emergency,Skilled Nursing Home,2019,CIR013,ACUTE PULMONARY EMBOLISM,,,134,PULMONARY EMBOLISM,04,DISEASES AND DISORDERS OF THE RESPIRATORY SYSTEM,4,Extreme,Extreme,Medical,Medicare,Medicare,,,,true,20353.28,8412.28
New York City,Manhattan,7002054,001458,New York-Presbyterian Hospital - New York Weill Cornell Center,70 or Older,100,F,White,Not Span/Hispanic,6,Emergency,Home w/ Home Health Services,2019,CIR013,ACUTE PULMONARY EMBOLISM,ADM021,"ADMINISTRATION OF THERAPEUTIC SUBSTANCES, NEC",134,PULMONARY EMBOLISM,04,DISEASES AND DISORDERS OF THE RESPIRATORY SYSTEM,4,Extreme,Extreme,Medical,Medicare,Medicare,Self-Pay,,,true,117209.31,42729.3
New York City,Manhattan,7002054,001458,New York-Presbyterian Hospital - New York Weill Cornell Center,70 or Older,100,M,White,Not Span/Hispanic,16,Emergency,Inpatient Rehabilitation Facility,2019,CIR013,ACUTE PULMONARY EMBOLISM,MAM011,ELECTROENCEPHALOGRAM (EEG),134,PULMONARY EMBOLISM,04,DISEASES AND DISORDERS OF THE RESPIRATORY SYSTEM,4,Extreme,Extreme,Medical,Medicare,Private Health Insurance,Self-Pay,,,true,238362.94,75465.42
Central NY,Onondaga,3301008,000636,Crouse Hospital,50 to 69,136,M,White,Not Span/Hispanic,4,Urgent,Skilled Nursing Home,2019,CIR013,ACUTE PULMONARY EMBOLISM,ADM015,ADMINISTRATION OF ANTIBIOTICS,134,PULMONARY EMBOLISM,04,DISEASES AND DISORDERS OF THE RESPIRATORY SYSTEM,4,Extreme,Major,Medical,Medicare,Self-Pay,,,,false,13577.67,5859.68
Hudson Valley,Putnam,3950000,000752,Putnam Hospital,30 to 49,112,M,White,Not Span/Hispanic,9,Emergency,Another Type Not Listed,2019,CIR013,ACUTE PULMONARY EMBOLISM,RES007,AIRWAY INTUBATION,134,PULMONARY EMBOLISM,04,DISEASES AND DISORDERS OF THE RESPIRATORY SYSTEM,4,Extreme,Major,Medical,Medicaid,,,,,true,62619.69,56463.25
Hudson Valley,Putnam,3950000,000752,Putnam Hospital,70 or Older,125,F,Other Race,Spanish/Hispanic,2,Emergency,Home or Self Care,2019,CIR013,ACUTE PULMONARY EMBOLISM,,,134,PULMONARY EMBOLISM,04,DISEASES AND DISORDERS OF THE RESPIRATORY SYSTEM,3,Major,Major,Medical,Medicare,Medicaid,,,,true,15811.48,4943.14
Long Island,Nassau,2908000,000511,NYU Langone Hospital-Long Island,70 or Older,117,M,White,Not Span/Hispanic,2,Emergency,Home w/ Home Health Services,2019,CIR013,ACUTE PULMONARY EMBOLISM,,,134,PULMONARY EMBOLISM,04,DISEASES AND DISORDERS OF THE RESPIRATORY SYSTEM,3,Major,Major,Medical,Medicare,Medicare,Private Health Insurance,,,true,34596.94,5210.34
Long Island,Nassau,2952005,000552,Plainview Hospital,50 to 69,117,M,White,Not Span/Hispanic,1,Emergency,Home or Self Care,2019,CIR013,ACUTE PULMONARY EMBOLISM,,,134,PULMONARY EMBOLISM,04,DISEASES AND DISORDERS OF THE RESPIRATORY SYSTEM,2,Moderate,Minor,Medical,Medicare,Private Health Insurance,,,,true,15533,3761.46
New York City,Manhattan,7002054,001458,New York-Presbyterian Hospital - New York Weill Cornell Center,30 to 49,112,M,White,Not Span/Hispanic,3,Emergency,Home or Self Care,2019,CIR013,ACUTE PULMONARY EMBOLISM,ADM021,"ADMINISTRATION OF THERAPEUTIC SUBSTANCES, NEC",134,PULMONARY EMBOLISM,04,DISEASES AND DISORDERS OF THE RESPIRATORY SYSTEM,2,Moderate,Minor,Medical,"Managed Care, Unspecified",Medicaid,Self-Pay,,,true,72844.62,28763.45
Western NY,Erie,1401005,000210,Erie County Medical Center,50 to 69,142,M,White,Not Span/Hispanic,6,Emergency,Skilled Nursing Home,2019,CIR013,ACUTE PULMONARY EMBOLISM,CAR028,INFERIOR VENA CAVA (IVC) FILTER PROCEDURES,134,PULMONARY EMBOLISM,04,DISEASES AND DISORDERS OF THE RESPIRATORY SYSTEM,3,Major,Major,Medical,Medicaid,Medicaid,,,,true,29149.63,14442.41
New York City,Kings,7001021,001306,New York - Presbyterian Brooklyn Methodist Hospital,70 or Older,112,F,Black/African American,Not Span/Hispanic,4,Emergency,Home or Self Care,2019,CIR013,ACUTE PULMONARY EMBOLISM,,,134,PULMONARY EMBOLISM,04,DISEASES AND DISORDERS OF THE RESPIRATORY SYSTEM,1,Minor,Minor,Medical,Medicare,Medicare,Self-Pay,,,true,34460.21,7679.68
Central NY,Onondaga,3301007,000635,University Hospital SUNY Health Science Center,30 to 49,130,M,White,Not Span/Hispanic,2,Emergency,Home or Self Care,2019,CIR013,ACUTE PULMONARY EMBOLISM,IMG008,ULTRASONOGRAPHY,134,PULMONARY EMBOLISM,04,DISEASES AND DISORDERS OF THE RESPIRATORY SYSTEM,2,Moderate,Minor,Medical,Blue Cross/Blue Shield,,,,,true,24418.03,4675.06
Western NY,Erie,1401014,003067,Millard Fillmore Suburban Hospital,70 or Older,141,F,White,Not Span/Hispanic,6,Emergency,Home or Self Care,2019,CIR013,ACUTE PULMONARY EMBOLISM,,,134,PULMONARY EMBOLISM,04,DISEASES AND DISORDERS OF THE RESPIRATORY SYSTEM,2,Moderate,Major,Medical,Medicare,Self-Pay,,,,true,20389.94,9734.85
Hudson Valley,Westchester,5902001,001045,White Plains Hospital Center,70 or Older,107,F,Other Race,Not Span/Hispanic,3,Emergency,Hospice - Home,2019,CIR013,ACUTE PULMONARY EMBOLISM,,,134,PULMONARY EMBOLISM,04,DISEASES AND DISORDERS OF THE RESPIRATORY SYSTEM,2,Moderate,Moderate,Medical,Medicare,Medicaid,,,,true,30388,5603.05
New York City,Queens,7003010,001637,New York - Presbyterian/Queens,70 or Older,113,F,Black/African American,Not Span/Hispanic,3,Emergency,Home or Self Care,2019,CIR013,ACUTE PULMONARY EMBOLISM,IMG006,COMPUTERIZED TOMOGRAPHY (CT) WITH CONTRAST,134,PULMONARY EMBOLISM,04,DISEASES AND DISORDERS OF THE RESPIRATORY SYSTEM,3,Major,Extreme,Medical,Medicare,Blue Cross/Blue Shield,Self-Pay,,,true,40889.12,8712.27
Finger Lakes,Monroe,2701003,000411,Rochester General Hospital,50 to 69,146,M,White,Not Span/Hispanic,3,Emergency,Home or Self Care,2019,CIR013,ACUTE PULMONARY EMBOLISM,,,134,PULMONARY EMBOLISM,04,DISEASES AND DISORDERS OF THE RESPIRATORY SYSTEM,4,Extreme,Extreme,Medical,Medicare,Medicaid,,,,true,16323.27,6308.02
Finger Lakes,Monroe,2701003,000411,Rochester General Hospital,50 to 69,146,M,Other Race,Spanish/Hispanic,6,Emergency,Home w/ Home Health Services,2019,CIR013,ACUTE PULMONARY EMBOLISM,,,134,PULMONARY EMBOLISM,04,DISEASES AND DISORDERS OF THE RESPIRATORY SYSTEM,2,Moderate,Minor,Medical,Medicaid,,,,,true,26146.72,9481.75
Western NY,Erie,1401013,000292,Sisters of Charity Hospital - St. Joseph Campus,30 to 49,140,M,White,Not Span/Hispanic,4,Emergency,Home or Self Care,2019,CIR013,ACUTE PULMONARY EMBOLISM,,,134,PULMONARY EMBOLISM,04,DISEASES AND DISORDERS OF THE RESPIRATORY SYSTEM,2,Moderate,Minor,Medical,Private Health Insurance,,,,,true,17922.79,7380.65
Long Island,Suffolk,5154001,000925,Good Samaritan Hospital Medical Center,70 or Older,117,M,White,Not Span/Hispanic,3,Emergency,Home w/ Home Health Services,2019,CIR013,ACUTE PULMONARY EMBOLISM,CAR028,INFERIOR VENA CAVA (IVC) FILTER PROCEDURES,134,PULMONARY EMBOLISM,04,DISEASES AND DISORDERS OF THE RESPIRATORY SYSTEM,3,Major,Major,Medical,Medicare,Private Health Insurance,,,,true,54279.61,9298.83
Long Island,Suffolk,5154001,000925,Good Samaritan Hospital Medical Center,50 to 69,117,M,White,Not Span/Hispanic,2,Emergency,Home or Self Care,2019,CIR013,ACUTE PULMONARY EMBOLISM,SUD001,SUBSTANCE USE DETOXIFICATION,134,PULMONARY EMBOLISM,04,DISEASES AND DISORDERS OF THE RESPIRATORY SYSTEM,2,Moderate,Moderate,Medical,Private Health Insurance,,,,,true,28578,4119.68
Long Island,Nassau,2952005,000552,Plainview Hospital,70 or Older,117,F,White,Not Span/Hispanic,17,Emergency,Skilled Nursing Home,2019,CIR013,ACUTE PULMONARY EMBOLISM,CAR028,INFERIOR VENA CAVA (IVC) FILTER PROCEDURES,134,PULMONARY EMBOLISM,04,DISEASES AND DISORDERS OF THE RESPIRATORY SYSTEM,4,Extreme,Extreme,Medical,Medicare,Blue Cross/Blue Shield,,,,true,163781.67,47987.44
Hudson Valley,Dutchess,1302001,000181,Vassar Brothers Medical Center,50 to 69,126,M,White,Not Span/Hispanic,6,Emergency,Skilled Nursing Home,2019,CIR013,ACUTE PULMONARY EMBOLISM,,,134,PULMONARY EMBOLISM,04,DISEASES AND DISORDERS OF THE RESPIRATORY SYSTEM,2,Moderate,Moderate,Medical,Medicaid,,,,,true,35282.43,9219.52
Hudson Valley,Dutchess,1302001,000181,Vassar Brothers Medical Center,70 or Older,125,M,White,Not Span/Hispanic,5,Emergency,Skilled Nursing Home,2019,CIR013,ACUTE PULMONARY EMBOLISM,,,134,PULMONARY EMBOLISM,04,DISEASES AND DISORDERS OF THE RESPIRATORY SYSTEM,3,Major,Extreme,Medical,Medicare,,,,,true,39237.41,9499.7
Hudson Valley,Westchester,5902001,001045,White Plains Hospital Center,50 to 69,105,F,Black/African American,Not Span/Hispanic,3,Emergency,Home w/ Home Health Services,2019,CIR013,ACUTE PULMONARY EMBOLISM,,,134,PULMONARY EMBOLISM,04,DISEASES AND DISORDERS OF THE RESPIRATORY SYSTEM,2,Moderate,Minor,Medical,Private Health Insurance,,,,,true,37024,6677.39
New York City,Manhattan,7002032,001466,Mount Sinai West,50 to 69,100,M,Other Race,Unknown,2,Emergency,Home w/ Home Health Services,2019,CIR013,ACUTE PULMONARY EMBOLISM,IMG008,ULTRASONOGRAPHY,134,PULMONARY EMBOLISM,04,DISEASES AND DISORDERS OF THE RESPIRATORY SYSTEM,3,Major,Major,Medical,Medicaid,Self-Pay,,,,false,28292.76,6681.74
Capital/Adirond,Warren,5601000,001005,Glens Falls Hospital,30 to 49,128,M,White,Not Span/Hispanic,3,Emergency,Home or Self Care,2019,CIR013,ACUTE PULMONARY EMBOLISM,,,134,PULMONARY EMBOLISM,04,DISEASES AND DISORDERS OF THE RESPIRATORY SYSTEM,1,Minor,Minor,Medical,Private Health Insurance,,,,,true,17462.98,6427.64
Southern Tier,Broome,0303001,000058,United Health Services Hospitals Inc. - Wilson Medical Center,30 to 49,137,F,White,Not Span/Hispanic,3,Emergency,Home or Self Care,2019,CIR013,ACUTE PULMONARY EMBOLISM,IMG006,COMPUTERIZED TOMOGRAPHY (CT) WITH CONTRAST,134,PULMONARY EMBOLISM,04,DISEASES AND DISORDERS OF THE RESPIRATORY SYSTEM,3,Major,Moderate,Medical,Private Health Insurance,,,,,true,28806.1,11560.52
Capital/Adirond,Albany,0101004,000005,St. Peter's Hospital,70 or Older,121,F,White,Not Span/Hispanic,4,Emergency,Home or Self Care,2019,CIR013,ACUTE PULMONARY EMBOLISM,,,134,PULMONARY EMBOLISM,04,DISEASES AND DISORDERS OF THE RESPIRATORY SYSTEM,4,Extreme,Extreme,Medical,Medicare,Medicare,,,,true,41360.55,11583.29
New York City,Kings,7002002,001324,Mount Sinai Brooklyn,50 to 69,112,M,Other Race,Unknown,5,Emergency,Home or Self Care,2019,CIR013,ACUTE PULMONARY EMBOLISM,IMG008,ULTRASONOGRAPHY,134,PULMONARY EMBOLISM,04,DISEASES AND DISORDERS OF THE RESPIRATORY SYSTEM,3,Major,Moderate,Medical,Medicaid,Medicaid,Self-Pay,,,true,66698.36,10890.08
Hudson Valley,Westchester,5907001,001097,SJRH - St Johns Division,18 to 29,107,F,White,Not Span/Hispanic,1,Emergency,Home or Self Care,2019,CIR013,ACUTE PULMONARY EMBOLISM,,,134,PULMONARY EMBOLISM,04,DISEASES AND DISORDERS OF THE RESPIRATORY SYSTEM,1,Minor,Minor,Medical,Medicaid,Medicaid,,,,true,12586.4,2865.94
New York City,Bronx,7000006,003058,Montefiore Med Center - Jack D Weiler Hosp of A Einstein College Div,30 to 49,104,F,Black/African American,Not Span/Hispanic,9,Emergency,Home w/ Home Health Services,2019,CIR013,ACUTE PULMONARY EMBOLISM,,,134,PULMONARY EMBOLISM,04,DISEASES AND DISORDERS OF THE RESPIRATORY SYSTEM,3,Major,Moderate,Medical,Medicaid,,,,,true,107024.79,21744.24
New York City,Kings,7001002,001286,Brookdale Hospital Medical Center,50 to 69,112,M,Other Race,Unknown,2,Emergency,Home or Self Care,2019,CIR013,ACUTE PULMONARY EMBOLISM,IMG006,COMPUTERIZED TOMOGRAPHY (CT) WITH CONTRAST,134,PULMONARY EMBOLISM,04,DISEASES AND DISORDERS OF THE RESPIRATORY SYSTEM,3,Major,Moderate,Medical,Medicaid,,,,,true,15363.09,7055.14
Capital/Adirond,Albany,0101000,000001,Albany Medical Center Hospital,50 to 69,121,F,White,Not Span/Hispanic,4,Emergency,Home or Self Care,2019,CIR013,ACUTE PULMONARY EMBOLISM,,,134,PULMONARY EMBOLISM,04,DISEASES AND DISORDERS OF THE RESPIRATORY SYSTEM,2,Moderate,Minor,Medical,"Managed Care, Unspecified",,,,,true,38268.76,9313.99
Southern Tier,Broome,0303001,000058,United Health Services Hospitals Inc. - Wilson Medical Center,70 or Older,137,M,White,Not Span/Hispanic,6,Emergency,Skilled Nursing Home,2019,CIR013,ACUTE PULMONARY EMBOLISM,,,134,PULMONARY EMBOLISM,04,DISEASES AND DISORDERS OF THE RESPIRATORY SYSTEM,3,Major,Moderate,Medical,Medicare,Medicare,Blue Cross/Blue Shield,,,true,24252.4,11603.24
Capital/Adirond,Columbia,1001000,000146,Columbia Memorial Hospital,50 to 69,120,F,White,Not Span/Hispanic,2,Elective,Home or Self Care,2019,CIR013,ACUTE PULMONARY EMBOLISM,,,134,PULMONARY EMBOLISM,04,DISEASES AND DISORDERS OF THE RESPIRATORY SYSTEM,2,Moderate,Minor,Medical,Blue Cross/Blue Shield,,,,,true,17037.36,4247.77
New York City,Kings,7001021,001306,New York - Presbyterian Brooklyn Methodist Hospital,50 to 69,112,M,White,Not Span/Hispanic,12,Emergency,Inpatient Rehabilitation Facility,2019,CIR013,ACUTE PULMONARY EMBOLISM,CAR028,INFERIOR VENA CAVA (IVC) FILTER PROCEDURES,134,PULMONARY EMBOLISM,04,DISEASES AND DISORDERS OF THE RESPIRATORY SYSTEM,4,Extreme,Extreme,Medical,Medicare,Medicare,Self-Pay,,,false,98861.29,32385.24
New York City,Kings,7001021,001306,New York - Presbyterian Brooklyn Methodist Hospital,50 to 69,112,F,Black/African American,Not Span/Hispanic,4,Emergency,Home or Self Care,2019,CIR013,ACUTE PULMONARY EMBOLISM,ESA001,HEMODIALYSIS,134,PULMONARY EMBOLISM,04,DISEASES AND DISORDERS OF THE RESPIRATORY SYSTEM,3,Major,Major,Medical,Medicare,Medicare,Medicaid,,,true,35634.34,8644.08
Central NY,Onondaga,3301007,000635,University Hospital SUNY Health Science Center,70 or Older,145,M,White,Not Span/Hispanic,5,Emergency,Home or Self Care,2019,CIR013,ACUTE PULMONARY EMBOLISM,ADM005,ADMINISTRATION OF THROMBOLYTICS AND PLATELET INHIBITORS,134,PULMONARY EMBOLISM,04,DISEASES AND DISORDERS OF THE RESPIRATORY SYSTEM,3,Major,Major,Medical,Medicare,Federal/State/Local/VA,,,,false,101756.42,34696.88
Long Island,Nassau,2950001,000527,Mount Sinai South Nassau,30 to 49,114,M,Black/African American,Not Span/Hispanic,1,Emergency,Home or Self Care,2019,CIR013,ACUTE PULMONARY EMBOLISM,,,134,PULMONARY EMBOLISM,04,DISEASES AND DISORDERS OF THE RESPIRATORY SYSTEM,1,Minor,Minor,Medical,Blue Cross/Blue Shield,,,,,true,41155.09,4461.38
New York City,Bronx,7000024,001186,North Central Bronx Hospital,30 to 49,104,M,White,Not Span/Hispanic,2,Emergency,Left Against Medical Advice,2019,CIR014,PULMONARY HEART DISEASE,,,134,PULMONARY EMBOLISM,04,DISEASES AND DISORDERS OF THE RESPIRATORY SYSTEM,2,Moderate,Minor,Medical,Medicaid,,,,,true,15289.01,9178.13
New York City,Manhattan,7002054,003975,New York Presbyterian Hospital - Allen Hospital,70 or Older,100,F,White,Not Span/Hispanic,5,Emergency,Home w/ Home Health Services,2019,CIR013,ACUTE PULMONARY EMBOLISM,ADM020,"ADMINISTRATION OF DIAGNOSTIC SUBSTANCES, NEC",134,PULMONARY EMBOLISM,04,DISEASES AND DISORDERS OF THE RESPIRATORY SYSTEM,3,Major,Major,Medical,Medicare,Medicare,Self-Pay,,,true,62405.54,13817.8
New York City,Bronx,7000024,001186,North Central Bronx Hospital,18 to 29,104,F,Black/African American,Not Span/Hispanic,1,Emergency,Home or Self Care,2019,CIR013,ACUTE PULMONARY EMBOLISM,,,134,PULMONARY EMBOLISM,04,DISEASES AND DISORDERS OF THE RESPIRATORY SYSTEM,1,Minor,Minor,Medical,Private Health Insurance,,,,,true,10036.52,6025.01
Western NY,Erie,1401005,000210,Erie County Medical Center,50 to 69,142,M,Black/African American,Not Span/Hispanic,16,Emergency,Expired,2019,CIR013,ACUTE PULMONARY EMBOLISM,ADM017,ADMINISTRATION OF NUTRITIONAL AND ELECTROLYTIC SUBSTANCES,134,PULMONARY EMBOLISM,04,DISEASES AND DISORDERS OF THE RESPIRATORY SYSTEM,4,Extreme,Major,Medical,Blue Cross/Blue Shield,,,,,true,48408.83,28112.24
Long Island,Suffolk,5151001,000245,Stony Brook University Hospital,50 to 69,117,M,Black/African American,Not Span/Hispanic,6,Emergency,Home or Self Care,2019,CIR013,ACUTE PULMONARY EMBOLISM,,,134,PULMONARY EMBOLISM,04,DISEASES AND DISORDERS OF THE RESPIRATORY SYSTEM,3,Major,Moderate,Medical,Medicaid,,,,,true,75025.82,21215.5
New York City,Queens,7003010,001637,New York - Presbyterian/Queens,50 to 69,113,F,Black/African American,Not Span/Hispanic,4,Emergency,Skilled Nursing Home,2019,CIR014,PULMONARY HEART DISEASE,IMG006,COMPUTERIZED TOMOGRAPHY (CT) WITH CONTRAST,134,PULMONARY EMBOLISM,04,DISEASES AND DISORDERS OF THE RESPIRATORY SYSTEM,3,Major,Moderate,Medical,Private Health Insurance,,,,,true,33692.58,8489.6
Southern Tier,Broome,0301001,000043,Our Lady of Lourdes Memorial Hospital,30 to 49,138,F,White,Not Span/Hispanic,1,Emergency,Home or Self Care,2019,CIR013,ACUTE PULMONARY EMBOLISM,,,134,PULMONARY EMBOLISM,04,DISEASES AND DISORDERS OF THE RESPIRATORY SYSTEM,1,Minor,Minor,Medical,Medicaid,Self-Pay,Self-Pay,,,true,8779.15,1810.85
Long Island,Suffolk,5151001,000245,Stony Brook University Hospital,70 or Older,119,M,White,Not Span/Hispanic,2,Emergency,Home or Self Care,2019,CIR013,ACUTE PULMONARY EMBOLISM,,,134,PULMONARY EMBOLISM,04,DISEASES AND DISORDERS OF THE RESPIRATORY SYSTEM,4,Extreme,Extreme,Medical,Medicare,Private Health Insurance,,,,true,26207.89,7342.14
New York City,Kings,7001021,001306,New York - Presbyterian Brooklyn Methodist Hospital,18 to 29,112,M,Black/African American,Not Span/Hispanic,6,Emergency,Home or Self Care,2019,CIR013,ACUTE PULMONARY EMBOLISM,CAR028,INFERIOR VENA CAVA (IVC) FILTER PROCEDURES,134,PULMONARY EMBOLISM,04,DISEASES AND DISORDERS OF THE RESPIRATORY SYSTEM,3,Major,Minor,Medical,Blue Cross/Blue Shield,Self-Pay,,,,true,90266.25,25940.26
Capital/Adirond,Albany,0101004,000005,St. Peter's Hospital,70 or Older,121,M,White,Not Span/Hispanic,3,Emergency,Home or Self Care,2019,CIR013,ACUTE PULMONARY EMBOLISM,MAM005,MEASUREMENT DURING CARDIAC CATHETERIZATION,134,PULMONARY EMBOLISM,04,DISEASES AND DISORDERS OF THE RESPIRATORY SYSTEM,2,Moderate,Moderate,Medical,Medicare,Medicare,,,,true,30552,9015.7
Capital/Adirond,Albany,0101004,000005,St. Peter's Hospital,50 to 69,121,M,White,Not Span/Hispanic,4,Emergency,Home or Self Care,2019,CIR013,ACUTE PULMONARY EMBOLISM,CAR028,INFERIOR VENA CAVA (IVC) FILTER PROCEDURES,134,PULMONARY EMBOLISM,04,DISEASES AND DISORDERS OF THE RESPIRATORY SYSTEM,3,Major,Major,Medical,Medicare,Blue Cross/Blue Shield,,,,false,41222.25,14517.41
New York City,Manhattan,7002054,001464,New York-Presbyterian Hospital - Columbia Presbyterian Center,50 to 69,112,M,Multi-racial,Not Span/Hispanic,2,Emergency,Home w/ Home Health Services,2019,CIR013,ACUTE PULMONARY EMBOLISM,,,134,PULMONARY EMBOLISM,04,DISEASES AND DISORDERS OF THE RESPIRATORY SYSTEM,3,Major,Moderate,Medical,Medicare,Medicaid,Self-Pay,,,true,33161.18,7576.89
Hudson Valley,Westchester,5957001,001139,Westchester Medical Center,30 to 49,125,M,White,Not Span/Hispanic,10,Emergency,Home w/ Home Health Services,2019,CIR013,ACUTE PULMONARY EMBOLISM,,,134,PULMONARY EMBOLISM,04,DISEASES AND DISORDERS OF THE RESPIRATORY SYSTEM,1,Minor,Minor,Medical,Private Health Insurance,Medicaid,,,,true,207321.28,37602.73
Hudson Valley,Rockland,4324000,000776,Montefiore Nyack,50 to 69,109,F,White,Not Span/Hispanic,3,Emergency,Home w/ Home Health Services,2019,CIR013,ACUTE PULMONARY EMBOLISM,,,134,PULMONARY EMBOLISM,04,DISEASES AND DISORDERS OF THE RESPIRATORY SYSTEM,2,Moderate,Moderate,Medical,Medicare,Medicare,,,,false,43993.26,8224.14
New York City,Manhattan,7002054,003975,New York Presbyterian Hospital - Allen Hospital,70 or Older,100,F,Other Race,Multi-ethnic,1,Emergency,Home or Self Care,2019,CIR013,ACUTE PULMONARY EMBOLISM,,,134,PULMONARY EMBOLISM,04,DISEASES AND DISORDERS OF THE RESPIRATORY SYSTEM,2,Moderate,Moderate,Medical,Medicare,Medicare,Medicaid,,,true,16295.66,3843.92
New York City,Bronx,7000002,001165,Jacobi Medical Center,18 to 29,104,F,Other Race,Unknown,4,Urgent,Home or Self Care,2019,CIR013,ACUTE PULMONARY EMBOLISM,MAM005,MEASUREMENT DURING CARDIAC CATHETERIZATION,134,PULMONARY EMBOLISM,04,DISEASES AND DISORDERS OF THE RESPIRATORY SYSTEM,2,Moderate,Moderate,Medical,Medicaid,Medicaid,,,,false,29245.49,17303.09
Capital/Adirond,Albany,0101000,000001,Albany Medical Center Hospital,70 or Older,134,F,White,Not Span/Hispanic,5,Emergency,Home or Self Care,2019,CIR013,ACUTE PULMONARY EMBOLISM,CAR028,INFERIOR VENA CAVA (IVC) FILTER PROCEDURES,134,PULMONARY EMBOLISM,04,DISEASES AND DISORDERS OF THE RESPIRATORY SYSTEM,4,Extreme,Extreme,Medical,Medicare,Blue Cross/Blue Shield,,,,true,54651.44,18258.31
New York City,Bronx,7000002,001165,Jacobi Medical Center,50 to 69,104,F,Black/African American,Unknown,10,Emergency,Inpatient Rehabilitation Facility,2019,CIR013,ACUTE PULMONARY EMBOLISM,MAM005,MEASUREMENT DURING CARDIAC CATHETERIZATION,134,PULMONARY EMBOLISM,04,DISEASES AND DISORDERS OF THE RESPIRATORY SYSTEM,3,Major,Moderate,Medical,Blue Cross/Blue Shield,,,,,true,65990.27,39043.14
Southern Tier,Broome,0301001,000043,Our Lady of Lourdes Memorial Hospital,30 to 49,138,F,White,Not Span/Hispanic,2,Emergency,Home or Self Care,2019,CIR013,ACUTE PULMONARY EMBOLISM,,,134,PULMONARY EMBOLISM,04,DISEASES AND DISORDERS OF THE RESPIRATORY SYSTEM,1,Minor,Minor,Medical,Self-Pay,Self-Pay,Self-Pay,,,true,13233.23,3096.36
New York City,Kings,7002002,001324,Mount Sinai Brooklyn,70 or Older,112,F,White,Not Span/Hispanic,5,Emergency,Home w/ Home Health Services,2019,CIR013,ACUTE PULMONARY EMBOLISM,,,134,PULMONARY EMBOLISM,04,DISEASES AND DISORDERS OF THE RESPIRATORY SYSTEM,2,Moderate,Moderate,Medical,Medicare,Blue Cross/Blue Shield,Self-Pay,,,true,59981.43,9428.52