Hospital Service Area,Hospital County,Operating Certificate Number,Permanent Facility Id,Facility Name,Age Group,Zip Code - 3 digits,Gender,Race,Ethnicity,Length of Stay,Type of Admission,Patient Disposition,Discharge Year,CCS Diagnosis Code,CCS Diagnosis Description,CCS Procedure Code,CCS Procedure Description,APR DRG Code,APR DRG Description,APR MDC Code,APR MDC Description,APR Severity of Illness Code,APR Severity of Illness Description,APR Risk of Mortality,APR Medical Surgical Description,Payment Typology 1,Payment Typology 2,Payment Typology 3,Birth Weight,Abortion Edit Indicator,Emergency Department Indicator,Total Charges,Total Costs
Long Island,Suffolk,5123000,000885,Long Island Community Hospital,70 or Older,119,M,White,Not Span/Hispanic,6,Emergency,Home w/ Home Health Services,2019,INJ003,"FRACTURE OF TORSO, INITIAL ENCOUNTER",RES005,CHEST TUBE PLACEMENT AND THERAPEUTIC THORACENTESIS,135,MAJOR CHEST & RESPIRATORY TRAUMA,04,DISEASES AND DISORDERS OF THE RESPIRATORY SYSTEM,3,Major,Moderate,Medical,Medicare,Medicare,Private Health Insurance,,,true,102159.75,15348.25
Long Island,Suffolk,5123000,000885,Long Island Community Hospital,50 to 69,117,M,White,Not Span/Hispanic,16,Emergency,Home or Self Care,2019,INJ010,"INTERNAL ORGAN INJURY, INITIAL ENCOUNTER",PLC001,IMMOBILIZATION BY SPLINT OR OTHER EXTERNAL DEVICE,135,MAJOR CHEST & RESPIRATORY TRAUMA,04,DISEASES AND DISORDERS OF THE RESPIRATORY SYSTEM,4,Extreme,Major,Medical,Private Health Insurance,Medicare,Medicare,,,true,233470.36,34432.28
Long Island,Suffolk,5123000,000885,Long Island Community Hospital,50 to 69,119,M,Black/African American,Not Span/Hispanic,12,Emergency,Home or Self Care,2019,INJ010,"INTERNAL ORGAN INJURY, INITIAL ENCOUNTER",RES005,CHEST TUBE PLACEMENT AND THERAPEUTIC THORACENTESIS,135,MAJOR CHEST & RESPIRATORY TRAUMA,04,DISEASES AND DISORDERS OF THE RESPIRATORY SYSTEM,2,Moderate,Minor,Medical,Private Health Insurance,Blue Cross/Blue Shield,,,,true,161229.34,24357.21
Long Island,Suffolk,5123000,000885,Long Island Community Hospital,70 or Older,117,M,White,Not Span/Hispanic,3,Emergency,Skilled Nursing Home,2019,INJ003,"FRACTURE OF TORSO, INITIAL ENCOUNTER",,,135,MAJOR CHEST & RESPIRATORY TRAUMA,04,DISEASES AND DISORDERS OF THE RESPIRATORY SYSTEM,1,Minor,Moderate,Medical,Medicare,Medicare,Private Health Insurance,,,true,57715.37,6855.28
Long Island,Suffolk,5123000,000885,Long Island Community Hospital,30 to 49,117,M,White,Not Span/Hispanic,1,Emergency,Home or Self Care,2019,INJ003,"FRACTURE OF TORSO, INITIAL ENCOUNTER",,,135,MAJOR CHEST & RESPIRATORY TRAUMA,04,DISEASES AND DISORDERS OF THE RESPIRATORY SYSTEM,1,Minor,Minor,Medical,Private Health Insurance,,,,,true,36377.39,2874.42
Long Island,Suffolk,5123000,000885,Long Island Community Hospital,30 to 49,117,M,White,Not Span/Hispanic,3,Emergency,Home or Self Care,2019,INJ003,"FRACTURE OF TORSO, INITIAL ENCOUNTER",,,135,MAJOR CHEST & RESPIRATORY TRAUMA,04,DISEASES AND DISORDERS OF THE RESPIRATORY SYSTEM,1,Minor,Minor,Medical,Self-Pay,,,,,true,62922.03,5951.41
Long Island,Suffolk,5123000,000885,Long Island Community Hospital,18 to 29,119,F,White,Not Span/Hispanic,1,Emergency,Home or Self Care,2019,INJ003,"FRACTURE OF TORSO, INITIAL ENCOUNTER",,,135,MAJOR CHEST & RESPIRATORY TRAUMA,04,DISEASES AND DISORDERS OF THE RESPIRATORY SYSTEM,1,Minor,Minor,Medical,Private Health Insurance,Private Health Insurance,Private Health Insurance,,,true,41499.18,3289.19
Long Island,Suffolk,5123000,000885,Long Island Community Hospital,50 to 69,117,F,White,Not Span/Hispanic,2,Emergency,Home or Self Care,2019,INJ003,"FRACTURE OF TORSO, INITIAL ENCOUNTER",,,135,MAJOR CHEST & RESPIRATORY TRAUMA,04,DISEASES AND DISORDERS OF THE RESPIRATORY SYSTEM,1,Minor,Minor,Medical,Private Health Insurance,Private Health Insurance,,,,true,52031.83,5428.95
Long Island,Suffolk,5123000,000885,Long Island Community Hospital,70 or Older,117,M,White,Not Span/Hispanic,6,Emergency,Skilled Nursing Home,2019,INJ003,"FRACTURE OF TORSO, INITIAL ENCOUNTER",,,135,MAJOR CHEST & RESPIRATORY TRAUMA,04,DISEASES AND DISORDERS OF THE RESPIRATORY SYSTEM,1,Minor,Minor,Medical,Private Health Insurance,,,,,true,97798.52,13473.88
Long Island,Suffolk,5123000,000885,Long Island Community Hospital,18 to 29,117,F,White,Not Span/Hispanic,1,Emergency,Home or Self Care,2019,INJ003,"FRACTURE OF TORSO, INITIAL ENCOUNTER",,,135,MAJOR CHEST & RESPIRATORY TRAUMA,04,DISEASES AND DISORDERS OF THE RESPIRATORY SYSTEM,1,Minor,Minor,Medical,Private Health Insurance,Private Health Insurance,,,,true,38591.42,3048.55
Long Island,Suffolk,5123000,000885,Long Island Community Hospital,70 or Older,119,M,White,Not Span/Hispanic,3,Emergency,Home w/ Home Health Services,2019,INJ003,"FRACTURE OF TORSO, INITIAL ENCOUNTER",,,135,MAJOR CHEST & RESPIRATORY TRAUMA,04,DISEASES AND DISORDERS OF THE RESPIRATORY SYSTEM,1,Minor,Moderate,Medical,Medicare,Medicare,Blue Cross/Blue Shield,,,true,60940.59,6851.31
Long Island,Suffolk,5123000,000885,Long Island Community Hospital,70 or Older,117,F,White,Not Span/Hispanic,3,Emergency,Skilled Nursing Home,2019,INJ003,"FRACTURE OF TORSO, INITIAL ENCOUNTER",ADM001,TRANSFUSION OF BLOOD AND BLOOD PRODUCTS,135,MAJOR CHEST & RESPIRATORY TRAUMA,04,DISEASES AND DISORDERS OF THE RESPIRATORY SYSTEM,3,Major,Moderate,Medical,Medicare,Medicare,Medicaid,,,true,66703.15,7531.07
Long Island,Suffolk,5123000,000885,Long Island Community Hospital,30 to 49,117,M,White,Not Span/Hispanic,3,Emergency,Home or Self Care,2019,INJ010,"INTERNAL ORGAN INJURY, INITIAL ENCOUNTER",RES005,CHEST TUBE PLACEMENT AND THERAPEUTIC THORACENTESIS,135,MAJOR CHEST & RESPIRATORY TRAUMA,04,DISEASES AND DISORDERS OF THE RESPIRATORY SYSTEM,1,Minor,Minor,Medical,Blue Cross/Blue Shield,,,,,true,51906.77,5764.36
Long Island,Suffolk,5123000,000885,Long Island Community Hospital,70 or Older,117,F,White,Not Span/Hispanic,5,Emergency,Skilled Nursing Home,2019,INJ003,"FRACTURE OF TORSO, INITIAL ENCOUNTER",,,135,MAJOR CHEST & RESPIRATORY TRAUMA,04,DISEASES AND DISORDERS OF THE RESPIRATORY SYSTEM,1,Minor,Moderate,Medical,Medicare,Medicare,Blue Cross/Blue Shield,,,true,85111.79,10402.95
Long Island,Suffolk,5123000,000885,Long Island Community Hospital,70 or Older,117,M,White,Not Span/Hispanic,6,Emergency,Skilled Nursing Home,2019,INJ003,"FRACTURE OF TORSO, INITIAL ENCOUNTER",ADM001,TRANSFUSION OF BLOOD AND BLOOD PRODUCTS,135,MAJOR CHEST & RESPIRATORY TRAUMA,04,DISEASES AND DISORDERS OF THE RESPIRATORY SYSTEM,3,Major,Moderate,Medical,Medicare,Medicare,Blue Cross/Blue Shield,,,true,102837.97,13666.86
Long Island,Suffolk,5123000,000885,Long Island Community Hospital,50 to 69,117,M,White,Not Span/Hispanic,3,Emergency,Home or Self Care,2019,INJ010,"INTERNAL ORGAN INJURY, INITIAL ENCOUNTER",PLC001,IMMOBILIZATION BY SPLINT OR OTHER EXTERNAL DEVICE,135,MAJOR CHEST & RESPIRATORY TRAUMA,04,DISEASES AND DISORDERS OF THE RESPIRATORY SYSTEM,2,Moderate,Minor,Medical,Private Health Insurance,Medicare,Medicare,,,true,51720.69,5485.42
Long Island,Suffolk,5123000,000885,Long Island Community Hospital,70 or Older,117,F,White,Not Span/Hispanic,9,Emergency,Home w/ Home Health Services,2019,INJ003,"FRACTURE OF TORSO, INITIAL ENCOUNTER",CNS013,SPINAL EPIDURAL CATHETER PLACEMENT,135,MAJOR CHEST & RESPIRATORY TRAUMA,04,DISEASES AND DISORDERS OF THE RESPIRATORY SYSTEM,1,Minor,Moderate,Medical,Medicare,Medicare,Blue Cross/Blue Shield,,,true,124103.9,18678.9
Long Island,Suffolk,5123000,000885,Long Island Community Hospital,70 or Older,117,F,White,Not Span/Hispanic,5,Emergency,Home or Self Care,2019,INJ003,"FRACTURE OF TORSO, INITIAL ENCOUNTER",,,135,MAJOR CHEST & RESPIRATORY TRAUMA,04,DISEASES AND DISORDERS OF THE RESPIRATORY SYSTEM,1,Minor,Minor,Medical,Medicare,Medicare,Medicaid,,,true,68688.39,9027.02
Long Island,Suffolk,5123000,000885,Long Island Community Hospital,50 to 69,117,M,White,Not Span/Hispanic,1,Emergency,Home or Self Care,2019,INJ003,"FRACTURE OF TORSO, INITIAL ENCOUNTER",,,135,MAJOR CHEST & RESPIRATORY TRAUMA,04,DISEASES AND DISORDERS OF THE RESPIRATORY SYSTEM,1,Minor,Minor,Medical,Medicare,,,,,true,37017.69,2865.16
Long Island,Suffolk,5123000,000885,Long Island Community Hospital,30 to 49,117,M,Other Race,Not Span/Hispanic,1,Emergency,Home or Self Care,2019,INJ010,"INTERNAL ORGAN INJURY, INITIAL ENCOUNTER",,,135,MAJOR CHEST & RESPIRATORY TRAUMA,04,DISEASES AND DISORDERS OF THE RESPIRATORY SYSTEM,2,Moderate,Minor,Medical,Medicaid,,,,,true,38784.92,2491.7
Long Island,Suffolk,5123000,000885,Long Island Community Hospital,70 or Older,117,F,White,Not Span/Hispanic,8,Emergency,Skilled Nursing Home,2019,INJ003,"FRACTURE OF TORSO, INITIAL ENCOUNTER",,,135,MAJOR CHEST & RESPIRATORY TRAUMA,04,DISEASES AND DISORDERS OF THE RESPIRATORY SYSTEM,1,Minor,Minor,Medical,Medicare,Medicare,Blue Cross/Blue Shield,,,true,99140.84,13803.14
Long Island,Suffolk,5123000,000885,Long Island Community Hospital,50 to 69,117,M,White,Not Span/Hispanic,5,Emergency,Psychiatric Hospital or Unit of Hosp,2019,INJ010,"INTERNAL ORGAN INJURY, INITIAL ENCOUNTER",,,135,MAJOR CHEST & RESPIRATORY TRAUMA,04,DISEASES AND DISORDERS OF THE RESPIRATORY SYSTEM,1,Minor,Minor,Medical,Medicare,Medicare,Medicaid,,,true,61536.77,7743.42
Long Island,Suffolk,5123000,000885,Long Island Community Hospital,70 or Older,117,F,White,Not Span/Hispanic,8,Emergency,Skilled Nursing Home,2019,INJ010,"INTERNAL ORGAN INJURY, INITIAL ENCOUNTER",RES005,CHEST TUBE PLACEMENT AND THERAPEUTIC THORACENTESIS,135,MAJOR CHEST & RESPIRATORY TRAUMA,04,DISEASES AND DISORDERS OF THE RESPIRATORY SYSTEM,2,Moderate,Minor,Medical,Medicare,Medicare,Private Health Insurance,,,true,75532.9,12785.54
Long Island,Suffolk,5123000,000885,Long Island Community Hospital,70 or Older,119,M,White,Not Span/Hispanic,7,Emergency,Skilled Nursing Home,2019,INJ010,"INTERNAL ORGAN INJURY, INITIAL ENCOUNTER",RES005,CHEST TUBE PLACEMENT AND THERAPEUTIC THORACENTESIS,135,MAJOR CHEST & RESPIRATORY TRAUMA,04,DISEASES AND DISORDERS OF THE RESPIRATORY SYSTEM,3,Major,Major,Medical,Medicare,Medicare,Blue Cross/Blue Shield,,,true,97982.61,15328.87
Long Island,Suffolk,5123000,000885,Long Island Community Hospital,70 or Older,117,M,White,Not Span/Hispanic,9,Emergency,Skilled Nursing Home,2019,INJ010,"INTERNAL ORGAN INJURY, INITIAL ENCOUNTER",RES005,CHEST TUBE PLACEMENT AND THERAPEUTIC THORACENTESIS,135,MAJOR CHEST & RESPIRATORY TRAUMA,04,DISEASES AND DISORDERS OF THE RESPIRATORY SYSTEM,2,Moderate,Moderate,Medical,Medicare,Medicare,Private Health Insurance,,,true,107467.82,17266.86
Long Island,Suffolk,5123000,000885,Long Island Community Hospital,70 or Older,117,M,White,Not Span/Hispanic,11,Emergency,Skilled Nursing Home,2019,INJ003,"FRACTURE OF TORSO, INITIAL ENCOUNTER",MAM011,ELECTROENCEPHALOGRAM (EEG),135,MAJOR CHEST & RESPIRATORY TRAUMA,04,DISEASES AND DISORDERS OF THE RESPIRATORY SYSTEM,3,Major,Major,Medical,Medicare,Medicare,Blue Cross/Blue Shield,,,true,180300.4,18811.67
Long Island,Suffolk,5123000,000885,Long Island Community Hospital,50 to 69,117,M,White,Not Span/Hispanic,29,Emergency,Expired,2019,INJ003,"FRACTURE OF TORSO, INITIAL ENCOUNTER",RES005,CHEST TUBE PLACEMENT AND THERAPEUTIC THORACENTESIS,135,MAJOR CHEST & RESPIRATORY TRAUMA,04,DISEASES AND DISORDERS OF THE RESPIRATORY SYSTEM,4,Extreme,Extreme,Medical,Private Health Insurance,Medicaid,,,,true,367621.12,59165.64
Long Island,Suffolk,5123000,000885,Long Island Community Hospital,70 or Older,117,M,White,Not Span/Hispanic,3,Emergency,Skilled Nursing Home,2019,INJ003,"FRACTURE OF TORSO, INITIAL ENCOUNTER",,,135,MAJOR CHEST & RESPIRATORY TRAUMA,04,DISEASES AND DISORDERS OF THE RESPIRATORY SYSTEM,1,Minor,Moderate,Medical,Medicare,Medicare,Private Health Insurance,,,true,58439.94,5898.24
Long Island,Suffolk,5123000,000885,Long Island Community Hospital,50 to 69,117,F,White,Not Span/Hispanic,2,Emergency,Home or Self Care,2019,INJ010,"INTERNAL ORGAN INJURY, INITIAL ENCOUNTER",,,135,MAJOR CHEST & RESPIRATORY TRAUMA,04,DISEASES AND DISORDERS OF THE RESPIRATORY SYSTEM,2,Moderate,Minor,Medical,Blue Cross/Blue Shield,,,,,true,41450.17,4439.77
Long Island,Suffolk,5123000,000885,Long Island Community Hospital,70 or Older,117,F,White,Not Span/Hispanic,7,Emergency,Skilled Nursing Home,2019,INJ003,"FRACTURE OF TORSO, INITIAL ENCOUNTER",,,135,MAJOR CHEST & RESPIRATORY TRAUMA,04,DISEASES AND DISORDERS OF THE RESPIRATORY SYSTEM,1,Minor,Moderate,Medical,Medicare,Medicare,,,,true,81867.21,12613.33
Long Island,Suffolk,5123000,000885,Long Island Community Hospital,30 to 49,117,M,White,Not Span/Hispanic,4,Emergency,Home or Self Care,2019,INJ010,"INTERNAL ORGAN INJURY, INITIAL ENCOUNTER",ESA003,MECHANICAL VENTILATION,135,MAJOR CHEST & RESPIRATORY TRAUMA,04,DISEASES AND DISORDERS OF THE RESPIRATORY SYSTEM,4,Extreme,Extreme,Medical,Private Health Insurance,,,,,true,100178.92,11573.45
Long Island,Suffolk,5123000,000885,Long Island Community Hospital,70 or Older,117,M,White,Not Span/Hispanic,2,Emergency,Home or Self Care,2019,INJ003,"FRACTURE OF TORSO, INITIAL ENCOUNTER",,,135,MAJOR CHEST & RESPIRATORY TRAUMA,04,DISEASES AND DISORDERS OF THE RESPIRATORY SYSTEM,1,Minor,Minor,Medical,Medicare,,,,,true,44588.87,4355.71
Long Island,Suffolk,5123000,000885,Long Island Community Hospital,50 to 69,117,M,White,Not Span/Hispanic,3,Emergency,Home or Self Care,2019,INJ003,"FRACTURE OF TORSO, INITIAL ENCOUNTER",,,135,MAJOR CHEST & RESPIRATORY TRAUMA,04,DISEASES AND DISORDERS OF THE RESPIRATORY SYSTEM,3,Major,Moderate,Medical,Medicare,Medicare,Blue Cross/Blue Shield,,,true,46350.01,5664.04
Long Island,Suffolk,5123000,000885,Long Island Community Hospital,70 or Older,117,F,White,Not Span/Hispanic,2,Emergency,Home or Self Care,2019,INJ003,"FRACTURE OF TORSO, INITIAL ENCOUNTER",,,135,MAJOR CHEST & RESPIRATORY TRAUMA,04,DISEASES AND DISORDERS OF THE RESPIRATORY SYSTEM,3,Major,Moderate,Medical,Private Health Insurance,Medicare,Medicare,,,true,53715.62,5207.7
Long Island,Suffolk,5123000,000885,Long Island Community Hospital,50 to 69,117,M,White,Not Span/Hispanic,2,Emergency,Home or Self Care,2019,INJ010,"INTERNAL ORGAN INJURY, INITIAL ENCOUNTER",RES005,CHEST TUBE PLACEMENT AND THERAPEUTIC THORACENTESIS,135,MAJOR CHEST & RESPIRATORY TRAUMA,04,DISEASES AND DISORDERS OF THE RESPIRATORY SYSTEM,2,Moderate,Minor,Medical,Private Health Insurance,Medicaid,,,,true,54041.23,4742.23
Long Island,Suffolk,5123000,000885,Long Island Community Hospital,50 to 69,119,M,White,Not Span/Hispanic,4,Emergency,Home w/ Home Health Services,2019,INJ010,"INTERNAL ORGAN INJURY, INITIAL ENCOUNTER",,,135,MAJOR CHEST & RESPIRATORY TRAUMA,04,DISEASES AND DISORDERS OF THE RESPIRATORY SYSTEM,2,Moderate,Minor,Medical,Private Health Insurance,Private Health Insurance,Medicare,,,true,63146.96,7561.96
Long Island,Suffolk,5123000,000885,Long Island Community Hospital,30 to 49,117,M,Black/African American,Not Span/Hispanic,3,Emergency,Court/Law Enforcement,2019,INJ003,"FRACTURE OF TORSO, INITIAL ENCOUNTER",SUD002,PHARMACOTHERAPY FOR SUBSTANCE USE,135,MAJOR CHEST & RESPIRATORY TRAUMA,04,DISEASES AND DISORDERS OF THE RESPIRATORY SYSTEM,1,Minor,Minor,Medical,Self-Pay,,,,,true,56273.42,6126.46
Long Island,Suffolk,5123000,000885,Long Island Community Hospital,70 or Older,119,F,White,Not Span/Hispanic,1,Emergency,Home or Self Care,2019,INJ003,"FRACTURE OF TORSO, INITIAL ENCOUNTER",,,135,MAJOR CHEST & RESPIRATORY TRAUMA,04,DISEASES AND DISORDERS OF THE RESPIRATORY SYSTEM,1,Minor,Moderate,Medical,Private Health Insurance,Medicare,Medicare,,,true,44280.04,3487.05
Long Island,Suffolk,5123000,000885,Long Island Community Hospital,50 to 69,117,M,White,Not Span/Hispanic,7,Emergency,Home w/ Home Health Services,2019,INJ003,"FRACTURE OF TORSO, INITIAL ENCOUNTER",,,135,MAJOR CHEST & RESPIRATORY TRAUMA,04,DISEASES AND DISORDERS OF THE RESPIRATORY SYSTEM,1,Minor,Minor,Medical,Private Health Insurance,Medicare,Medicare,,,true,80488.24,11648.01
Long Island,Suffolk,5123000,000885,Long Island Community Hospital,70 or Older,117,F,White,Not Span/Hispanic,5,Emergency,Skilled Nursing Home,2019,INJ010,"INTERNAL ORGAN INJURY, INITIAL ENCOUNTER",,,135,MAJOR CHEST & RESPIRATORY TRAUMA,04,DISEASES AND DISORDERS OF THE RESPIRATORY SYSTEM,3,Major,Moderate,Medical,Medicare,Medicare,Medicaid,,,true,85916.77,11898.96
Long Island,Suffolk,5123000,000885,Long Island Community Hospital,50 to 69,119,F,White,Not Span/Hispanic,1,Emergency,Home or Self Care,2019,INJ003,"FRACTURE OF TORSO, INITIAL ENCOUNTER",,,135,MAJOR CHEST & RESPIRATORY TRAUMA,04,DISEASES AND DISORDERS OF THE RESPIRATORY SYSTEM,1,Minor,Minor,Medical,Private Health Insurance,Private Health Insurance,,,,true,53670.54,3483.62
Long Island,Suffolk,5123000,000885,Long Island Community Hospital,70 or Older,119,F,White,Not Span/Hispanic,2,Emergency,Home or Self Care,2019,INJ003,"FRACTURE OF TORSO, INITIAL ENCOUNTER",,,135,MAJOR CHEST & RESPIRATORY TRAUMA,04,DISEASES AND DISORDERS OF THE RESPIRATORY SYSTEM,1,Minor,Minor,Medical,Private Health Insurance,Medicare,Medicare,,,true,47226.69,4296.25
Long Island,Suffolk,5123000,000885,Long Island Community Hospital,70 or Older,117,F,White,Not Span/Hispanic,2,Emergency,Home or Self Care,2019,INJ010,"INTERNAL ORGAN INJURY, INITIAL ENCOUNTER",SKB006,SKIN LACERATION REPAIR (EXCLUDING PERINEUM),135,MAJOR CHEST & RESPIRATORY TRAUMA,04,DISEASES AND DISORDERS OF THE RESPIRATORY SYSTEM,2,Moderate,Minor,Medical,Medicare,Medicare,Blue Cross/Blue Shield,,,true,42977.5,4040.36
Long Island,Suffolk,5123000,000885,Long Island Community Hospital,50 to 69,117,M,White,Not Span/Hispanic,2,Emergency,Home or Self Care,2019,INJ003,"FRACTURE OF TORSO, INITIAL ENCOUNTER",SUD002,PHARMACOTHERAPY FOR SUBSTANCE USE,135,MAJOR CHEST & RESPIRATORY TRAUMA,04,DISEASES AND DISORDERS OF THE RESPIRATORY SYSTEM,1,Minor,Moderate,Medical,Medicare,Medicare,Medicaid,,,true,28663.15,4455.83
Long Island,Suffolk,5123000,000885,Long Island Community Hospital,70 or Older,117,F,White,Not Span/Hispanic,16,Emergency,Skilled Nursing Home,2019,INJ003,"FRACTURE OF TORSO, INITIAL ENCOUNTER",ESA001,HEMODIALYSIS,135,MAJOR CHEST & RESPIRATORY TRAUMA,04,DISEASES AND DISORDERS OF THE RESPIRATORY SYSTEM,4,Extreme,Extreme,Medical,Medicare,Medicare,Blue Cross/Blue Shield,,,true,219388.88,37665.08
Long Island,Suffolk,5123000,000885,Long Island Community Hospital,30 to 49,119,M,Black/African American,Not Span/Hispanic,4,Emergency,Home or Self Care,2019,INJ010,"INTERNAL ORGAN INJURY, INITIAL ENCOUNTER",RES005,CHEST TUBE PLACEMENT AND THERAPEUTIC THORACENTESIS,135,MAJOR CHEST & RESPIRATORY TRAUMA,04,DISEASES AND DISORDERS OF THE RESPIRATORY SYSTEM,3,Major,Minor,Medical,Medicaid,,,,,true,67587.11,8140.85
Long Island,Suffolk,5123000,000885,Long Island Community Hospital,70 or Older,119,F,White,Not Span/Hispanic,9,Emergency,Home w/ Home Health Services,2019,INJ003,"FRACTURE OF TORSO, INITIAL ENCOUNTER",,,135,MAJOR CHEST & RESPIRATORY TRAUMA,04,DISEASES AND DISORDERS OF THE RESPIRATORY SYSTEM,1,Minor,Minor,Medical,Private Health Insurance,Medicare,Medicare,,,true,96500.84,15990.53
Long Island,Suffolk,5123000,000885,Long Island Community Hospital,30 to 49,117,M,White,Not Span/Hispanic,4,Emergency,Home w/ Home Health Services,2019,INJ003,"FRACTURE OF TORSO, INITIAL ENCOUNTER",,,135,MAJOR CHEST & RESPIRATORY TRAUMA,04,DISEASES AND DISORDERS OF THE RESPIRATORY SYSTEM,3,Major,Moderate,Medical,Private Health Insurance,Private Health Insurance,,,,true,70810.57,8596.66
Long Island,Suffolk,5123000,000885,Long Island Community Hospital,50 to 69,117,F,White,Not Span/Hispanic,7,Emergency,Home w/ Home Health Services,2019,INJ010,"INTERNAL ORGAN INJURY, INITIAL ENCOUNTER",RES005,CHEST TUBE PLACEMENT AND THERAPEUTIC THORACENTESIS,135,MAJOR CHEST & RESPIRATORY TRAUMA,04,DISEASES AND DISORDERS OF THE RESPIRATORY SYSTEM,3,Major,Major,Medical,Blue Cross/Blue Shield,,,,,true,120050.43,15447.98
Long Island,Suffolk,5123000,000885,Long Island Community Hospital,30 to 49,,F,Other Race,Not Span/Hispanic,2,Emergency,Home or Self Care,2019,INJ003,"FRACTURE OF TORSO, INITIAL ENCOUNTER",,,135,MAJOR CHEST & RESPIRATORY TRAUMA,04,DISEASES AND DISORDERS OF THE RESPIRATORY SYSTEM,1,Minor,Minor,Medical,Private Health Insurance,Medicaid,,,,true,44147.09,4204.9
Long Island,Suffolk,5123000,000885,Long Island Community Hospital,50 to 69,119,F,White,Not Span/Hispanic,2,Emergency,Home or Self Care,2019,INJ010,"INTERNAL ORGAN INJURY, INITIAL ENCOUNTER",,,135,MAJOR CHEST & RESPIRATORY TRAUMA,04,DISEASES AND DISORDERS OF THE RESPIRATORY SYSTEM,2,Moderate,Minor,Medical,Medicare,Medicare,Blue Cross/Blue Shield,,,true,36905.63,3785.09
Long Island,Suffolk,5123000,000885,Long Island Community Hospital,70 or Older,117,M,White,Not Span/Hispanic,6,Emergency,Skilled Nursing Home,2019,INJ003,"FRACTURE OF TORSO, INITIAL ENCOUNTER",,,135,MAJOR CHEST & RESPIRATORY TRAUMA,04,DISEASES AND DISORDERS OF THE RESPIRATORY SYSTEM,3,Major,Major,Medical,Medicare,Medicare,Medicaid,,,true,86204.66,10777.75
Long Island,Suffolk,5123000,000885,Long Island Community Hospital,70 or Older,117,F,White,Not Span/Hispanic,2,Emergency,Home or Self Care,2019,INJ003,"FRACTURE OF TORSO, INITIAL ENCOUNTER",,,135,MAJOR CHEST & RESPIRATORY TRAUMA,04,DISEASES AND DISORDERS OF THE RESPIRATORY SYSTEM,1,Minor,Moderate,Medical,Medicare,,,,,true,56364.76,4894.11
Long Island,Suffolk,5123000,000885,Long Island Community Hospital,70 or Older,117,F,White,Not Span/Hispanic,3,Emergency,Skilled Nursing Home,2019,INJ003,"FRACTURE OF TORSO, INITIAL ENCOUNTER",,,135,MAJOR CHEST & RESPIRATORY TRAUMA,04,DISEASES AND DISORDERS OF THE RESPIRATORY SYSTEM,1,Minor,Moderate,Medical,Medicare,Medicare,,,,true,64330.63,6251.77
Long Island,Suffolk,5123000,000885,Long Island Community Hospital,50 to 69,119,F,White,Not Span/Hispanic,1,Emergency,Home or Self Care,2019,INJ003,"FRACTURE OF TORSO, INITIAL ENCOUNTER",SUD002,PHARMACOTHERAPY FOR SUBSTANCE USE,135,MAJOR CHEST & RESPIRATORY TRAUMA,04,DISEASES AND DISORDERS OF THE RESPIRATORY SYSTEM,1,Minor,Minor,Medical,Blue Cross/Blue Shield,,,,,true,41393.76,2426.17
Long Island,Suffolk,5123000,000885,Long Island Community Hospital,70 or Older,117,F,White,Not Span/Hispanic,4,Emergency,Skilled Nursing Home,2019,INJ010,"INTERNAL ORGAN INJURY, INITIAL ENCOUNTER",,,135,MAJOR CHEST & RESPIRATORY TRAUMA,04,DISEASES AND DISORDERS OF THE RESPIRATORY SYSTEM,2,Moderate,Moderate,Medical,Medicare,Medicare,,,,true,48303.41,6306.49
Long Island,Suffolk,5123000,000885,Long Island Community Hospital,50 to 69,119,M,White,Not Span/Hispanic,3,Emergency,Home w/ Home Health Services,2019,INJ003,"FRACTURE OF TORSO, INITIAL ENCOUNTER",ADM001,TRANSFUSION OF BLOOD AND BLOOD PRODUCTS,135,MAJOR CHEST & RESPIRATORY TRAUMA,04,DISEASES AND DISORDERS OF THE RESPIRATORY SYSTEM,3,Major,Moderate,Medical,Private Health Insurance,Medicaid,,,,true,69442.27,8101.26
Long Island,Suffolk,5123000,000885,Long Island Community Hospital,70 or Older,117,M,White,Not Span/Hispanic,2,Emergency,Home or Self Care,2019,INJ003,"FRACTURE OF TORSO, INITIAL ENCOUNTER",PLC001,IMMOBILIZATION BY SPLINT OR OTHER EXTERNAL DEVICE,135,MAJOR CHEST & RESPIRATORY TRAUMA,04,DISEASES AND DISORDERS OF THE RESPIRATORY SYSTEM,1,Minor,Moderate,Medical,Medicare,Medicare,Private Health Insurance,,,true,40452.64,3810.76
Long Island,Suffolk,5123000,000885,Long Island Community Hospital,70 or Older,117,M,White,Not Span/Hispanic,5,Emergency,Home w/ Home Health Services,2019,INJ010,"INTERNAL ORGAN INJURY, INITIAL ENCOUNTER",RES005,CHEST TUBE PLACEMENT AND THERAPEUTIC THORACENTESIS,135,MAJOR CHEST & RESPIRATORY TRAUMA,04,DISEASES AND DISORDERS OF THE RESPIRATORY SYSTEM,2,Moderate,Minor,Medical,Medicare,Medicare,Medicaid,,,true,74906.99,10496.6
Long Island,Suffolk,5123000,000885,Long Island Community Hospital,50 to 69,119,F,White,Not Span/Hispanic,3,Emergency,Home or Self Care,2019,INJ003,"FRACTURE OF TORSO, INITIAL ENCOUNTER",,,135,MAJOR CHEST & RESPIRATORY TRAUMA,04,DISEASES AND DISORDERS OF THE RESPIRATORY SYSTEM,1,Minor,Minor,Medical,Medicare,Medicare,Blue Cross/Blue Shield,,,true,55464.2,5254.33