Hospital Service Area,Hospital County,Operating Certificate Number,Permanent Facility Id,Facility Name,Age Group,Zip Code - 3 digits,Gender,Race,Ethnicity,Length of Stay,Type of Admission,Patient Disposition,Discharge Year,CCS Diagnosis Code,CCS Diagnosis Description,CCS Procedure Code,CCS Procedure Description,APR DRG Code,APR DRG Description,APR MDC Code,APR MDC Description,APR Severity of Illness Code,APR Severity of Illness Description,APR Risk of Mortality,APR Medical Surgical Description,Payment Typology 1,Payment Typology 2,Payment Typology 3,Birth Weight,Abortion Edit Indicator,Emergency Department Indicator,Total Charges,Total Costs
New York City,Bronx,7000006,001168,Montefiore Medical Center-Wakefield Hospital,30 to 49,104,F,Black/African American,Not Span/Hispanic,10,Emergency,Hospice - Medical Facility,2017,042,Secondary malignancies,231,OTHER THERAPEUTIC PRCS,136,Respiratory malignancy,04,Diseases and Disorders of the Respiratory System,4,Extreme,Major,Medical,Medicaid,,,,N,Y,192456.65,48534.45
New York City,Bronx,7000006,001168,Montefiore Medical Center-Wakefield Hospital,50 to 69,104,F,Black/African American,Not Span/Hispanic,6,Emergency,Expired,2017,042,Secondary malignancies,000,NO PROC,136,Respiratory malignancy,04,Diseases and Disorders of the Respiratory System,3,Major,Major,Medical,Medicaid,,,,N,Y,54746.04,12111.95
New York City,Bronx,7000006,001168,Montefiore Medical Center-Wakefield Hospital,50 to 69,104,F,Black/African American,Not Span/Hispanic,3,Emergency,Home or Self Care,2017,019,Cancer of bronchus; lung,039,INCISION OF PLEURA,136,Respiratory malignancy,04,Diseases and Disorders of the Respiratory System,2,Moderate,Minor,Medical,Private Health Insurance,,,,N,Y,52986.96,8089.95
New York City,Bronx,7000006,001169,Montefiore Medical Center - Henry & Lucy Moses Div,70 or Older,104,F,Other Race,Not Span/Hispanic,9,Emergency,Expired,2017,019,Cancer of bronchus; lung,231,OTHER THERAPEUTIC PRCS,136,Respiratory malignancy,04,Diseases and Disorders of the Respiratory System,4,Extreme,Major,Medical,Medicare,,,,N,Y,81265.90,17009.98
New York City,Bronx,7000006,001169,Montefiore Medical Center - Henry & Lucy Moses Div,70 or Older,104,F,Black/African American,Not Span/Hispanic,1,Emergency,Home w/ Home Health Services,2017,019,Cancer of bronchus; lung,039,INCISION OF PLEURA,136,Respiratory malignancy,04,Diseases and Disorders of the Respiratory System,3,Major,Moderate,Medical,Medicaid,,,,N,N,27491.70,7430.45
New York City,Bronx,7000006,001169,Montefiore Medical Center - Henry & Lucy Moses Div,50 to 69,104,F,Other Race,Spanish/Hispanic,5,Emergency,Home w/ Home Health Services,2017,042,Secondary malignancies,039,INCISION OF PLEURA,136,Respiratory malignancy,04,Diseases and Disorders of the Respiratory System,3,Major,Major,Medical,Medicaid,,,,N,N,49217.66,10197.90
New York City,Bronx,7000011,001175,Calvary Hospital Inc,50 to 69,104,F,Other Race,Spanish/Hispanic,113,Elective,Expired,2017,019,Cancer of bronchus; lung,041,OT NON-OR THER PRC RESP,136,Respiratory malignancy,04,Diseases and Disorders of the Respiratory System,3,Major,Extreme,Medical,Blue Cross/Blue Shield,,,,N,N,248526.46,134717.74
New York City,Bronx,7000011,001175,Calvary Hospital Inc,70 or Older,104,M,White,Not Span/Hispanic,1,Elective,Expired,2017,019,Cancer of bronchus; lung,000,NO PROC,136,Respiratory malignancy,04,Diseases and Disorders of the Respiratory System,2,Moderate,Moderate,Medical,Private Health Insurance,Medicare,Medicaid,,N,N,1977.00,1071.66
New York City,Bronx,7000011,001175,Calvary Hospital Inc,50 to 69,100,M,Other Race,Unknown,1,Elective,Expired,2017,019,Cancer of bronchus; lung,000,NO PROC,136,Respiratory malignancy,04,Diseases and Disorders of the Respiratory System,3,Major,Moderate,Medical,Medicare,,,,N,N,1968.00,1066.79
New York City,Kings,7002002,001324,Mount Sinai Brooklyn,50 to 69,112,F,White,Not Span/Hispanic,4,Emergency,Expired,2017,042,Secondary malignancies,216,RESP INTUB/MECH VENTIL,136,Respiratory malignancy,04,Diseases and Disorders of the Respiratory System,3,Major,Extreme,Medical,Medicare,Blue Cross/Blue Shield,Self-Pay,,N,Y,36718.80,6175.80
New York City,Kings,7002002,001324,Mount Sinai Brooklyn,50 to 69,112,F,White,Not Span/Hispanic,4,Emergency,Home or Self Care,2017,019,Cancer of bronchus; lung,037,DX BRONCHOSCOPY & BIOPS,136,Respiratory malignancy,04,Diseases and Disorders of the Respiratory System,2,Moderate,Minor,Medical,Medicare,Miscellaneous/Other,Self-Pay,,N,Y,34515.57,7090.59
New York City,Manhattan,7002002,001439,Mount Sinai Beth Israel,70 or Older,100,F,Other Race,Not Span/Hispanic,7,Emergency,Expired,2017,019,Cancer of bronchus; lung,039,INCISION OF PLEURA,136,Respiratory malignancy,04,Diseases and Disorders of the Respiratory System,4,Extreme,Extreme,Medical,Medicare,Private Health Insurance,Self-Pay,,N,Y,60283.76,18718.12
New York City,Manhattan,7002002,001439,Mount Sinai Beth Israel,70 or Older,100,F,White,Not Span/Hispanic,12,Emergency,Hospice - Medical Facility,2017,042,Secondary malignancies,222,BLOOD TRANSFUSION,136,Respiratory malignancy,04,Diseases and Disorders of the Respiratory System,3,Major,Major,Medical,Medicare,Private Health Insurance,Self-Pay,,N,Y,77457.66,25899.04
New York City,Manhattan,7002002,001439,Mount Sinai Beth Israel,50 to 69,100,F,Black/African American,Spanish/Hispanic,5,Emergency,Home w/ Home Health Services,2017,042,Secondary malignancies,054,OT VASC CATH; NOT HEART,136,Respiratory malignancy,04,Diseases and Disorders of the Respiratory System,3,Major,Extreme,Medical,Medicare,Miscellaneous/Other,Medicaid,,N,Y,60367.35,24232.83
New York City,Manhattan,7002002,001439,Mount Sinai Beth Israel,50 to 69,100,M,White,Not Span/Hispanic,1,Emergency,Home or Self Care,2017,020,Cancer; other respiratory and intrathoracic,183,ROUTINE CHEST X-RAY,136,Respiratory malignancy,04,Diseases and Disorders of the Respiratory System,2,Moderate,Minor,Medical,Medicaid,Medicaid,Self-Pay,,N,Y,9203.50,2735.58
New York City,Manhattan,7002024,001456,Mount Sinai Hospital,50 to 69,100,F,Other Race,Not Span/Hispanic,23,Emergency,Hospice - Home,2017,019,Cancer of bronchus; lung,000,NO PROC,136,Respiratory malignancy,04,Diseases and Disorders of the Respiratory System,3,Major,Moderate,Medical,"Managed Care, Unspecified",Medicaid,Self-Pay,,N,Y,254954.87,77529.54
New York City,Manhattan,7002024,001456,Mount Sinai Hospital,70 or Older,100,M,Black/African American,Not Span/Hispanic,5,Emergency,Hospice - Home,2017,019,Cancer of bronchus; lung,000,NO PROC,136,Respiratory malignancy,04,Diseases and Disorders of the Respiratory System,3,Major,Major,Medical,Medicare,Private Health Insurance,Self-Pay,,N,Y,37568.01,12655.03
New York City,Manhattan,7002032,001466,Mount Sinai West,50 to 69,100,M,Black/African American,Not Span/Hispanic,6,Emergency,Home or Self Care,2017,019,Cancer of bronchus; lung,198,MAG RESONANCE IMAGING,136,Respiratory malignancy,04,Diseases and Disorders of the Respiratory System,2,Moderate,Moderate,Medical,Medicare,Medicare,Medicaid,,N,Y,70384.33,17060.13
Hudson Valley,Orange,3523000,000699,Orange Regional Medical Center,50 to 69,124,M,White,Not Span/Hispanic,6,Emergency,Expired,2017,042,Secondary malignancies,071,GASTROSTOMY; TEMP/PERM,136,Respiratory malignancy,04,Diseases and Disorders of the Respiratory System,4,Extreme,Major,Medical,Blue Cross/Blue Shield,,,,N,Y,62792.53,18075.77
New York City,Bronx,7000006,001169,Montefiore Medical Center - Henry & Lucy Moses Div,70 or Older,109,M,White,Not Span/Hispanic,13,Emergency,Hospice - Medical Facility,2017,019,Cancer of bronchus; lung,039,INCISION OF PLEURA,136,Respiratory malignancy,04,Diseases and Disorders of the Respiratory System,2,Moderate,Major,Medical,Medicare,Private Health Insurance,,,N,Y,140055.68,26457.86
New York City,Bronx,7000006,001169,Montefiore Medical Center - Henry & Lucy Moses Div,50 to 69,104,F,Black/African American,Not Span/Hispanic,3,Emergency,Home or Self Care,2017,042,Secondary malignancies,000,NO PROC,136,Respiratory malignancy,04,Diseases and Disorders of the Respiratory System,2,Moderate,Moderate,Medical,Medicare,,,,N,Y,30083.27,6176.88
New York City,Bronx,7000006,003058,Montefiore Med Center - Jack D Weiler Hosp of A Einstein College Div,50 to 69,104,F,Black/African American,Not Span/Hispanic,17,Emergency,Home w/ Home Health Services,2017,042,Secondary malignancies,216,RESP INTUB/MECH VENTIL,136,Respiratory malignancy,04,Diseases and Disorders of the Respiratory System,3,Major,Major,Medical,Medicaid,,,,N,Y,264416.96,80395.92
New York City,Bronx,7000006,003058,Montefiore Med Center - Jack D Weiler Hosp of A Einstein College Div,50 to 69,104,F,Black/African American,Not Span/Hispanic,6,Emergency,Home w/ Home Health Services,2017,019,Cancer of bronchus; lung,211,THERAPEUTIC RADIOLOGY,136,Respiratory malignancy,04,Diseases and Disorders of the Respiratory System,4,Extreme,Major,Medical,Private Health Insurance,,,,N,N,78828.78,13076.36
New York City,Bronx,7000006,003058,Montefiore Med Center - Jack D Weiler Hosp of A Einstein College Div,30 to 49,109,F,White,Not Span/Hispanic,6,Emergency,Expired,2017,042,Secondary malignancies,216,RESP INTUB/MECH VENTIL,136,Respiratory malignancy,04,Diseases and Disorders of the Respiratory System,3,Major,Extreme,Medical,Blue Cross/Blue Shield,,,,N,Y,80289.95,15135.10
New York City,Manhattan,7002002,001439,Mount Sinai Beth Israel,50 to 69,100,M,Black/African American,Spanish/Hispanic,16,Emergency,Home w/ Home Health Services,2017,042,Secondary malignancies,039,INCISION OF PLEURA,136,Respiratory malignancy,04,Diseases and Disorders of the Respiratory System,3,Major,Major,Medical,Blue Cross/Blue Shield,Medicare,Self-Pay,,N,Y,162593.99,49021.30
New York City,Manhattan,7002032,001466,Mount Sinai West,50 to 69,100,F,White,Not Span/Hispanic,4,Emergency,Hospice - Home,2017,019,Cancer of bronchus; lung,177,COMP AXIAL TOMOGR (CT),136,Respiratory malignancy,04,Diseases and Disorders of the Respiratory System,4,Extreme,Major,Medical,Medicaid,Medicaid,Self-Pay,,N,Y,39206.72,11043.19
New York City,Manhattan,7002032,001469,Mount Sinai St. Luke's,70 or Older,100,M,Black/African American,Spanish/Hispanic,1,Emergency,Expired,2017,019,Cancer of bronchus; lung,225,CONV OF CARDIAC RHYTHM,136,Respiratory malignancy,04,Diseases and Disorders of the Respiratory System,3,Major,Moderate,Medical,Medicare,Medicare,Medicaid,,N,Y,29512.00,8455.22
Hudson Valley,Westchester,5903001,001061,Montefiore Mount Vernon Hospital,50 to 69,105,F,Black/African American,Unknown,8,Emergency,Expired,2017,042,Secondary malignancies,216,RESP INTUB/MECH VENTIL,136,Respiratory malignancy,04,Diseases and Disorders of the Respiratory System,3,Major,Major,Medical,Medicaid,Self-Pay,,,N,N,92901.20,35107.82
New York City,Bronx,7000006,001168,Montefiore Medical Center-Wakefield Hospital,70 or Older,104,F,Other Race,Not Span/Hispanic,10,Emergency,Skilled Nursing Home,2017,019,Cancer of bronchus; lung,039,INCISION OF PLEURA,136,Respiratory malignancy,04,Diseases and Disorders of the Respiratory System,4,Extreme,Major,Medical,Medicare,Medicaid,,,N,Y,102210.23,20499.75
New York City,Bronx,7000006,001168,Montefiore Medical Center-Wakefield Hospital,50 to 69,104,F,Black/African American,Not Span/Hispanic,5,Emergency,Home w/ Home Health Services,2017,019,Cancer of bronchus; lung,039,INCISION OF PLEURA,136,Respiratory malignancy,04,Diseases and Disorders of the Respiratory System,2,Moderate,Minor,Medical,Private Health Insurance,,,,N,Y,68684.56,14740.25
New York City,Bronx,7000006,001169,Montefiore Medical Center - Henry & Lucy Moses Div,50 to 69,104,M,Black/African American,Not Span/Hispanic,7,Emergency,Hospice - Home,2017,019,Cancer of bronchus; lung,108,INDWELLING CATHETER,136,Respiratory malignancy,04,Diseases and Disorders of the Respiratory System,3,Major,Major,Medical,Medicaid,,,,N,Y,75145.55,16650.29
New York City,Bronx,7000006,001169,Montefiore Medical Center - Henry & Lucy Moses Div,70 or Older,104,M,Black/African American,Not Span/Hispanic,11,Emergency,Home w/ Home Health Services,2017,042,Secondary malignancies,037,DX BRONCHOSCOPY & BIOPS,136,Respiratory malignancy,04,Diseases and Disorders of the Respiratory System,3,Major,Major,Medical,Medicare,,,,N,Y,211048.44,38888.73
New York City,Bronx,7000006,001169,Montefiore Medical Center - Henry & Lucy Moses Div,50 to 69,104,F,White,Spanish/Hispanic,9,Emergency,Expired,2017,019,Cancer of bronchus; lung,039,INCISION OF PLEURA,136,Respiratory malignancy,04,Diseases and Disorders of the Respiratory System,3,Major,Major,Medical,Medicare,,,,N,N,120205.57,24089.72
New York City,Bronx,7000006,003058,Montefiore Med Center - Jack D Weiler Hosp of A Einstein College Div,50 to 69,104,M,White,Not Span/Hispanic,5,Emergency,Home or Self Care,2017,019,Cancer of bronchus; lung,037,DX BRONCHOSCOPY & BIOPS,136,Respiratory malignancy,04,Diseases and Disorders of the Respiratory System,4,Extreme,Extreme,Medical,Private Health Insurance,Medicare,,,N,Y,100758.84,18075.69
New York City,Bronx,7000006,003058,Montefiore Med Center - Jack D Weiler Hosp of A Einstein College Div,70 or Older,104,F,Other Race,Spanish/Hispanic,8,Emergency,Hospice - Home,2017,042,Secondary malignancies,039,INCISION OF PLEURA,136,Respiratory malignancy,04,Diseases and Disorders of the Respiratory System,3,Major,Major,Medical,Medicare,Private Health Insurance,,,N,Y,68554.61,14146.14
New York City,Kings,7001003,001288,Brooklyn Hospital Center - Downtown Campus,50 to 69,112,M,Black/African American,Unknown,19,Elective,Expired,2017,019,Cancer of bronchus; lung,000,NO PROC,136,Respiratory malignancy,04,Diseases and Disorders of the Respiratory System,3,Major,Major,Medical,Private Health Insurance,Self-Pay,,,N,N,106039.16,20514.87
New York City,Kings,7001003,001288,Brooklyn Hospital Center - Downtown Campus,70 or Older,112,M,Black/African American,Unknown,1,Elective,Expired,2017,019,Cancer of bronchus; lung,000,NO PROC,136,Respiratory malignancy,04,Diseases and Disorders of the Respiratory System,3,Major,Major,Medical,Private Health Insurance,Self-Pay,,,N,N,5535.56,1095.15
New York City,Kings,7001003,001288,Brooklyn Hospital Center - Downtown Campus,70 or Older,112,F,Black/African American,Unknown,1,Elective,Expired,2017,019,Cancer of bronchus; lung,000,NO PROC,136,Respiratory malignancy,04,Diseases and Disorders of the Respiratory System,3,Major,Major,Medical,Private Health Insurance,Self-Pay,,,N,N,5584.40,1095.40
New York City,Kings,7001003,001288,Brooklyn Hospital Center - Downtown Campus,50 to 69,112,M,Black/African American,Unknown,11,Emergency,Hospice - Medical Facility,2017,019,Cancer of bronchus; lung,159,OT DX PRCS ON MUSC/SKEL,136,Respiratory malignancy,04,Diseases and Disorders of the Respiratory System,4,Extreme,Extreme,Medical,Medicare,Medicare,Medicaid,,N,Y,141483.10,23659.47
New York City,Kings,7001003,001288,Brooklyn Hospital Center - Downtown Campus,50 to 69,112,M,Black/African American,Not Span/Hispanic,5,Emergency,Home or Self Care,2017,019,Cancer of bronchus; lung,222,BLOOD TRANSFUSION,136,Respiratory malignancy,04,Diseases and Disorders of the Respiratory System,3,Major,Major,Medical,Medicaid,Self-Pay,,,N,Y,42554.63,7860.22
New York City,Kings,7001003,001288,Brooklyn Hospital Center - Downtown Campus,50 to 69,112,M,Other Race,Not Span/Hispanic,9,Emergency,Expired,2017,042,Secondary malignancies,039,INCISION OF PLEURA,136,Respiratory malignancy,04,Diseases and Disorders of the Respiratory System,4,Extreme,Extreme,Medical,Medicare,Medicare,Medicaid,,N,Y,110579.89,21057.14
New York City,Kings,7001003,001288,Brooklyn Hospital Center - Downtown Campus,70 or Older,112,F,Black/African American,Not Span/Hispanic,6,Emergency,Home w/ Home Health Services,2017,042,Secondary malignancies,037,DX BRONCHOSCOPY & BIOPS,136,Respiratory malignancy,04,Diseases and Disorders of the Respiratory System,2,Moderate,Moderate,Medical,Medicare,Medicare,Self-Pay,,N,Y,67414.65,12037.43
New York City,Kings,7001003,001288,Brooklyn Hospital Center - Downtown Campus,50 to 69,112,M,Black/African American,Unknown,3,Emergency,Short-term Hospital,2017,019,Cancer of bronchus; lung,000,NO PROC,136,Respiratory malignancy,04,Diseases and Disorders of the Respiratory System,3,Major,Major,Medical,Private Health Insurance,Self-Pay,,,N,Y,24691.58,4661.30
New York City,Kings,7001003,001288,Brooklyn Hospital Center - Downtown Campus,70 or Older,112,F,Black/African American,Unknown,1,Emergency,Hospice - Medical Facility,2017,019,Cancer of bronchus; lung,000,NO PROC,136,Respiratory malignancy,04,Diseases and Disorders of the Respiratory System,3,Major,Major,Medical,Medicare,Medicaid,Self-Pay,,N,Y,28522.56,2465.87
New York City,Kings,7001037,001320,University Hospital of Brooklyn,50 to 69,112,F,Black/African American,Not Span/Hispanic,5,Emergency,Home or Self Care,2017,019,Cancer of bronchus; lung,224,CANCER CHEMOTHERAPY,136,Respiratory malignancy,04,Diseases and Disorders of the Respiratory System,3,Major,Major,Medical,Medicaid,Medicaid,Self-Pay,,N,Y,27116.69,16785.78
New York City,Manhattan,7002002,001439,Mount Sinai Beth Israel,70 or Older,103,F,Other Race,Not Span/Hispanic,16,Emergency,Hospice - Medical Facility,2017,019,Cancer of bronchus; lung,193,DX ULTRASOUND HEART,136,Respiratory malignancy,04,Diseases and Disorders of the Respiratory System,4,Extreme,Extreme,Medical,Medicare,Private Health Insurance,Self-Pay,,N,Y,190191.28,60430.37
New York City,Manhattan,7002002,001439,Mount Sinai Beth Israel,70 or Older,112,M,Black/African American,Spanish/Hispanic,13,Emergency,Hospice - Medical Facility,2017,042,Secondary malignancies,193,DX ULTRASOUND HEART,136,Respiratory malignancy,04,Diseases and Disorders of the Respiratory System,4,Extreme,Extreme,Medical,Medicare,Miscellaneous/Other,Medicaid,,N,Y,141480.53,46011.61
Western NY,Niagara,1401014,000581,Degraff Memorial Hospital,50 to 69,OOS,F,White,Not Span/Hispanic,1,Urgent,Expired,2017,019,Cancer of bronchus; lung,000,NO PROC,136,Respiratory malignancy,04,Diseases and Disorders of the Respiratory System,1,Minor,Minor,Medical,Medicaid,Self-Pay,,,N,N,1528.00,1140.75
New York City,Manhattan,7002024,001456,Mount Sinai Hospital,30 to 49,100,F,Other Race,Not Span/Hispanic,9,Emergency,Home or Self Care,2017,042,Secondary malignancies,039,INCISION OF PLEURA,136,Respiratory malignancy,04,Diseases and Disorders of the Respiratory System,3,Major,Moderate,Medical,Blue Cross/Blue Shield,Self-Pay,,,N,Y,75391.79,25277.49
New York City,Manhattan,7002032,001466,Mount Sinai West,70 or Older,100,F,White,Not Span/Hispanic,13,Emergency,Home or Self Care,2017,019,Cancer of bronchus; lung,039,INCISION OF PLEURA,136,Respiratory malignancy,04,Diseases and Disorders of the Respiratory System,3,Major,Extreme,Medical,Medicare,Medicaid,Self-Pay,,N,Y,146722.46,36257.93
New York City,Manhattan,7002032,001466,Mount Sinai West,70 or Older,100,F,Black/African American,Spanish/Hispanic,10,Emergency,Expired,2017,019,Cancer of bronchus; lung,231,OTHER THERAPEUTIC PRCS,136,Respiratory malignancy,04,Diseases and Disorders of the Respiratory System,4,Extreme,Major,Medical,Medicare,Medicare,Medicaid,,N,Y,68549.94,19380.89
New York City,Kings,7001008,001293,"New York Community Hospital of Brooklyn, Inc",70 or Older,112,F,Black/African American,Not Span/Hispanic,4,Emergency,Hospice - Medical Facility,2017,042,Secondary malignancies,202,ELECTROCARDIOGRAM,136,Respiratory malignancy,04,Diseases and Disorders of the Respiratory System,3,Major,Major,Medical,Medicare,Medicare,Self-Pay,,N,Y,15686.76,6290.30
New York City,Kings,7001008,001293,"New York Community Hospital of Brooklyn, Inc",50 to 69,112,M,White,Not Span/Hispanic,9,Emergency,Home or Self Care,2017,019,Cancer of bronchus; lung,227,"OT DX PRC (INTERVW,EVAL",136,Respiratory malignancy,04,Diseases and Disorders of the Respiratory System,3,Major,Major,Medical,Medicare,Medicare,Medicaid,,N,Y,36065.39,15204.47
New York City,Kings,7001008,001293,"New York Community Hospital of Brooklyn, Inc",50 to 69,112,M,White,Not Span/Hispanic,8,Emergency,Inpatient Rehabilitation Facility,2017,019,Cancer of bronchus; lung,037,DX BRONCHOSCOPY & BIOPS,136,Respiratory malignancy,04,Diseases and Disorders of the Respiratory System,2,Moderate,Minor,Medical,Medicaid,Self-Pay,,,N,Y,45405.27,21778.08
New York City,Kings,7001008,001293,"New York Community Hospital of Brooklyn, Inc",50 to 69,112,M,White,Not Span/Hispanic,4,Emergency,Expired,2017,019,Cancer of bronchus; lung,227,"OT DX PRC (INTERVW,EVAL",136,Respiratory malignancy,04,Diseases and Disorders of the Respiratory System,3,Major,Major,Medical,Medicaid,Self-Pay,,,N,Y,27108.75,10919.05
New York City,Kings,7001008,001293,"New York Community Hospital of Brooklyn, Inc",70 or Older,112,M,White,Not Span/Hispanic,3,Emergency,Home or Self Care,2017,019,Cancer of bronchus; lung,180,OTHER CT SCAN,136,Respiratory malignancy,04,Diseases and Disorders of the Respiratory System,2,Moderate,Moderate,Medical,Medicare,Medicaid,Self-Pay,,N,Y,11936.51,5376.21
New York City,Kings,7001021,001306,New York - Presbyterian Brooklyn Methodist Hospital,50 to 69,112,M,Black/African American,Not Span/Hispanic,22,Emergency,Expired,2017,019,Cancer of bronchus; lung,037,DX BRONCHOSCOPY & BIOPS,136,Respiratory malignancy,04,Diseases and Disorders of the Respiratory System,3,Major,Major,Medical,Medicare,Medicaid,Self-Pay,,N,Y,146743.44,50511.76
New York City,Kings,7001021,001306,New York - Presbyterian Brooklyn Methodist Hospital,70 or Older,112,F,White,Not Span/Hispanic,7,Emergency,Hospice - Home,2017,019,Cancer of bronchus; lung,000,NO PROC,136,Respiratory malignancy,04,Diseases and Disorders of the Respiratory System,3,Major,Moderate,Medical,Medicare,Private Health Insurance,Self-Pay,,N,Y,40646.34,11899.60
New York City,Kings,7001021,001306,New York - Presbyterian Brooklyn Methodist Hospital,50 to 69,112,F,White,Not Span/Hispanic,10,Emergency,Home or Self Care,2017,019,Cancer of bronchus; lung,199,ELECTROENCEPHALOGRAM,136,Respiratory malignancy,04,Diseases and Disorders of the Respiratory System,4,Extreme,Extreme,Medical,Medicare,Medicare,Self-Pay,,N,Y,74928.26,31807.83
New York City,Kings,7001021,001306,New York - Presbyterian Brooklyn Methodist Hospital,70 or Older,112,F,White,Not Span/Hispanic,5,Emergency,Home w/ Home Health Services,2017,019,Cancer of bronchus; lung,037,DX BRONCHOSCOPY & BIOPS,136,Respiratory malignancy,04,Diseases and Disorders of the Respiratory System,3,Major,Major,Medical,Medicare,Private Health Insurance,Self-Pay,,N,Y,33334.64,9558.59
New York City,Kings,7001021,001306,New York - Presbyterian Brooklyn Methodist Hospital,70 or Older,112,F,White,Not Span/Hispanic,13,Emergency,Expired,2017,019,Cancer of bronchus; lung,037,DX BRONCHOSCOPY & BIOPS,136,Respiratory malignancy,04,Diseases and Disorders of the Respiratory System,3,Major,Major,Medical,Medicare,Medicare,Self-Pay,,N,Y,80710.10,24297.55
New York City,Kings,7001021,001306,New York - Presbyterian Brooklyn Methodist Hospital,70 or Older,112,F,White,Not Span/Hispanic,13,Emergency,Home w/ Home Health Services,2017,042,Secondary malignancies,037,DX BRONCHOSCOPY & BIOPS,136,Respiratory malignancy,04,Diseases and Disorders of the Respiratory System,3,Major,Major,Medical,Medicare,Blue Cross/Blue Shield,Self-Pay,,N,Y,78483.42,22496.01
New York City,Kings,7001021,001306,New York - Presbyterian Brooklyn Methodist Hospital,50 to 69,112,F,Black/African American,Not Span/Hispanic,11,Emergency,Home w/ Home Health Services,2017,019,Cancer of bronchus; lung,054,OT VASC CATH; NOT HEART,136,Respiratory malignancy,04,Diseases and Disorders of the Respiratory System,3,Major,Moderate,Medical,Medicare,Medicare,Medicaid,,N,Y,62995.09,19144.32