Hospital Service Area,Hospital County,Operating Certificate Number,Permanent Facility Id,Facility Name,Age Group,Zip Code - 3 digits,Gender,Race,Ethnicity,Length of Stay,Type of Admission,Patient Disposition,Discharge Year,CCS Diagnosis Code,CCS Diagnosis Description,CCS Procedure Code,CCS Procedure Description,APR DRG Code,APR DRG Description,APR MDC Code,APR MDC Description,APR Severity of Illness Code,APR Severity of Illness Description,APR Risk of Mortality,APR Medical Surgical Description,Payment Typology 1,Payment Typology 2,Payment Typology 3,Birth Weight,Abortion Edit Indicator,Emergency Department Indicator,Total Charges,Total Costs
Long Island,Suffolk,5123000,000885,Brookhaven Memorial Hospital Medical Center Inc,50 to 69,119,F,White,Not Span/Hispanic,27,Emergency,Home w/ Home Health Services,2017,019,Cancer of bronchus; lung,039,INCISION OF PLEURA,136,Respiratory malignancy,04,Diseases and Disorders of the Respiratory System,4,Extreme,Extreme,Medical,Private Health Insurance,Medicaid,,,N,Y,270184.00,55307.38
Long Island,Suffolk,5123000,000885,Brookhaven Memorial Hospital Medical Center Inc,70 or Older,119,F,White,Not Span/Hispanic,18,Emergency,Expired,2017,042,Secondary malignancies,222,BLOOD TRANSFUSION,136,Respiratory malignancy,04,Diseases and Disorders of the Respiratory System,4,Extreme,Extreme,Medical,Medicare,Medicare,Private Health Insurance,,N,Y,175111.27,29163.50
Long Island,Suffolk,5123000,000885,Brookhaven Memorial Hospital Medical Center Inc,70 or Older,117,F,White,Not Span/Hispanic,2,Emergency,Expired,2017,019,Cancer of bronchus; lung,000,NO PROC,136,Respiratory malignancy,04,Diseases and Disorders of the Respiratory System,2,Moderate,Major,Medical,Self-Pay,,,,N,Y,10989.48,2721.71
Long Island,Suffolk,5123000,000885,Brookhaven Memorial Hospital Medical Center Inc,50 to 69,117,F,Black/African American,Not Span/Hispanic,7,Emergency,Home or Self Care,2017,042,Secondary malignancies,040,OT DX PRCS OF RESP TRCT,136,Respiratory malignancy,04,Diseases and Disorders of the Respiratory System,3,Major,Minor,Medical,Private Health Insurance,,,,N,Y,56613.96,10151.69
Long Island,Suffolk,5123000,000885,Brookhaven Memorial Hospital Medical Center Inc,70 or Older,119,F,White,Not Span/Hispanic,7,Emergency,Home w/ Home Health Services,2017,019,Cancer of bronchus; lung,037,DX BRONCHOSCOPY & BIOPS,136,Respiratory malignancy,04,Diseases and Disorders of the Respiratory System,4,Extreme,Major,Medical,Medicare,Medicare,Private Health Insurance,,N,Y,88983.50,15795.89
Long Island,Suffolk,5123000,000885,Brookhaven Memorial Hospital Medical Center Inc,50 to 69,117,F,Other Race,Not Span/Hispanic,10,Emergency,Home w/ Home Health Services,2017,019,Cancer of bronchus; lung,216,RESP INTUB/MECH VENTIL,136,Respiratory malignancy,04,Diseases and Disorders of the Respiratory System,3,Major,Major,Medical,Medicare,Medicare,Medicaid,,N,Y,118338.35,22119.46
Long Island,Suffolk,5123000,000885,Brookhaven Memorial Hospital Medical Center Inc,50 to 69,119,M,White,Not Span/Hispanic,6,Emergency,Home or Self Care,2017,042,Secondary malignancies,000,NO PROC,136,Respiratory malignancy,04,Diseases and Disorders of the Respiratory System,2,Moderate,Moderate,Medical,Private Health Insurance,,,,N,Y,41691.67,7909.78
Long Island,Suffolk,5123000,000885,Brookhaven Memorial Hospital Medical Center Inc,50 to 69,119,M,White,Not Span/Hispanic,7,Emergency,Expired,2017,019,Cancer of bronchus; lung,222,BLOOD TRANSFUSION,136,Respiratory malignancy,04,Diseases and Disorders of the Respiratory System,3,Major,Major,Medical,Medicare,Medicare,Blue Cross/Blue Shield,,N,Y,103964.43,18860.82
Long Island,Suffolk,5123000,000885,Brookhaven Memorial Hospital Medical Center Inc,50 to 69,119,F,White,Not Span/Hispanic,9,Emergency,Home w/ Home Health Services,2017,019,Cancer of bronchus; lung,199,ELECTROENCEPHALOGRAM,136,Respiratory malignancy,04,Diseases and Disorders of the Respiratory System,3,Major,Moderate,Medical,Private Health Insurance,,,,N,Y,100288.18,13813.99
Long Island,Suffolk,5123000,000885,Brookhaven Memorial Hospital Medical Center Inc,50 to 69,117,M,White,Not Span/Hispanic,1,Emergency,Expired,2017,019,Cancer of bronchus; lung,216,RESP INTUB/MECH VENTIL,136,Respiratory malignancy,04,Diseases and Disorders of the Respiratory System,4,Extreme,Major,Medical,Medicare,Medicare,Private Health Insurance,,N,Y,22098.32,3778.68
Long Island,Suffolk,5123000,000885,Brookhaven Memorial Hospital Medical Center Inc,70 or Older,117,F,White,Not Span/Hispanic,3,Emergency,Home or Self Care,2017,019,Cancer of bronchus; lung,000,NO PROC,136,Respiratory malignancy,04,Diseases and Disorders of the Respiratory System,3,Major,Major,Medical,Medicare,Medicare,,,N,Y,36136.74,5389.27
Long Island,Suffolk,5123000,000885,Brookhaven Memorial Hospital Medical Center Inc,50 to 69,117,F,White,Not Span/Hispanic,7,Emergency,Home or Self Care,2017,019,Cancer of bronchus; lung,000,NO PROC,136,Respiratory malignancy,04,Diseases and Disorders of the Respiratory System,3,Major,Major,Medical,Private Health Insurance,,,,N,Y,50418.13,9746.71
Long Island,Suffolk,5123000,000885,Brookhaven Memorial Hospital Medical Center Inc,70 or Older,117,F,White,Not Span/Hispanic,16,Emergency,Expired,2017,019,Cancer of bronchus; lung,037,DX BRONCHOSCOPY & BIOPS,136,Respiratory malignancy,04,Diseases and Disorders of the Respiratory System,3,Major,Major,Medical,Medicare,Medicare,Blue Cross/Blue Shield,,N,Y,154789.63,26933.65
Long Island,Suffolk,5123000,000885,Brookhaven Memorial Hospital Medical Center Inc,70 or Older,117,M,White,Not Span/Hispanic,15,Emergency,Home or Self Care,2017,019,Cancer of bronchus; lung,037,DX BRONCHOSCOPY & BIOPS,136,Respiratory malignancy,04,Diseases and Disorders of the Respiratory System,3,Major,Major,Medical,Medicare,Medicare,Private Health Insurance,,N,Y,149151.44,24378.37
Long Island,Suffolk,5123000,000885,Brookhaven Memorial Hospital Medical Center Inc,70 or Older,117,F,White,Not Span/Hispanic,5,Emergency,Skilled Nursing Home,2017,019,Cancer of bronchus; lung,216,RESP INTUB/MECH VENTIL,136,Respiratory malignancy,04,Diseases and Disorders of the Respiratory System,3,Major,Major,Medical,Medicare,Medicare,Private Health Insurance,,N,Y,57571.01,8411.62
Long Island,Suffolk,5123000,000885,Brookhaven Memorial Hospital Medical Center Inc,70 or Older,117,F,White,Not Span/Hispanic,3,Emergency,Home w/ Home Health Services,2017,019,Cancer of bronchus; lung,039,INCISION OF PLEURA,136,Respiratory malignancy,04,Diseases and Disorders of the Respiratory System,3,Major,Major,Medical,Medicare,Medicare,,,N,Y,32877.08,5026.11
Long Island,Suffolk,5123000,000885,Brookhaven Memorial Hospital Medical Center Inc,50 to 69,117,F,Black/African American,Not Span/Hispanic,1,Emergency,Expired,2017,019,Cancer of bronchus; lung,000,NO PROC,136,Respiratory malignancy,04,Diseases and Disorders of the Respiratory System,4,Extreme,Extreme,Medical,Self-Pay,,,,N,Y,6388.96,1519.12
Long Island,Suffolk,5123000,000885,Brookhaven Memorial Hospital Medical Center Inc,70 or Older,117,M,White,Not Span/Hispanic,7,Emergency,Skilled Nursing Home,2017,019,Cancer of bronchus; lung,039,INCISION OF PLEURA,136,Respiratory malignancy,04,Diseases and Disorders of the Respiratory System,3,Major,Major,Medical,Medicare,Medicare,Private Health Insurance,,N,Y,52663.74,9833.30
Long Island,Suffolk,5123000,000885,Brookhaven Memorial Hospital Medical Center Inc,70 or Older,117,M,White,Not Span/Hispanic,6,Emergency,Cancer Center or Children's Hospital,2017,019,Cancer of bronchus; lung,037,DX BRONCHOSCOPY & BIOPS,136,Respiratory malignancy,04,Diseases and Disorders of the Respiratory System,3,Major,Major,Medical,Medicare,Medicare,Private Health Insurance,,N,Y,69159.00,9836.98
Long Island,Suffolk,5123000,000885,Brookhaven Memorial Hospital Medical Center Inc,70 or Older,117,F,White,Not Span/Hispanic,3,Emergency,Home or Self Care,2017,019,Cancer of bronchus; lung,039,INCISION OF PLEURA,136,Respiratory malignancy,04,Diseases and Disorders of the Respiratory System,3,Major,Moderate,Medical,Medicare,Medicare,Blue Cross/Blue Shield,,N,Y,36750.95,5095.34
Long Island,Suffolk,5123000,000885,Brookhaven Memorial Hospital Medical Center Inc,70 or Older,119,M,White,Not Span/Hispanic,5,Emergency,Skilled Nursing Home,2017,042,Secondary malignancies,000,NO PROC,136,Respiratory malignancy,04,Diseases and Disorders of the Respiratory System,2,Moderate,Major,Medical,Medicare,Medicare,Private Health Insurance,,N,Y,35560.57,6797.31
Long Island,Suffolk,5123000,000885,Brookhaven Memorial Hospital Medical Center Inc,70 or Older,119,M,White,Not Span/Hispanic,2,Emergency,Home or Self Care,2017,019,Cancer of bronchus; lung,000,NO PROC,136,Respiratory malignancy,04,Diseases and Disorders of the Respiratory System,2,Moderate,Moderate,Medical,Medicare,Medicare,Private Health Insurance,,N,Y,34753.54,5505.15
Long Island,Suffolk,5123000,000885,Brookhaven Memorial Hospital Medical Center Inc,70 or Older,117,M,White,Not Span/Hispanic,21,Emergency,Expired,2017,019,Cancer of bronchus; lung,216,RESP INTUB/MECH VENTIL,136,Respiratory malignancy,04,Diseases and Disorders of the Respiratory System,4,Extreme,Extreme,Medical,Medicare,,,,N,Y,420176.26,86306.37
Long Island,Suffolk,5123000,000885,Brookhaven Memorial Hospital Medical Center Inc,70 or Older,119,M,White,Not Span/Hispanic,39,Emergency,Hospice - Home,2017,019,Cancer of bronchus; lung,039,INCISION OF PLEURA,136,Respiratory malignancy,04,Diseases and Disorders of the Respiratory System,3,Major,Major,Medical,Medicare,,,,N,Y,315911.41,63368.70
Long Island,Suffolk,5123000,000885,Brookhaven Memorial Hospital Medical Center Inc,50 to 69,117,F,White,Not Span/Hispanic,3,Emergency,Home or Self Care,2017,019,Cancer of bronchus; lung,000,NO PROC,136,Respiratory malignancy,04,Diseases and Disorders of the Respiratory System,3,Major,Major,Medical,Medicaid,,,,N,Y,43016.61,5000.37
Long Island,Suffolk,5123000,000885,Brookhaven Memorial Hospital Medical Center Inc,70 or Older,119,M,White,Not Span/Hispanic,1,Emergency,Short-term Hospital,2017,019,Cancer of bronchus; lung,000,NO PROC,136,Respiratory malignancy,04,Diseases and Disorders of the Respiratory System,3,Major,Major,Medical,Medicare,,,,N,Y,30108.03,3312.44
Long Island,Suffolk,5123000,000885,Brookhaven Memorial Hospital Medical Center Inc,70 or Older,117,M,White,Not Span/Hispanic,4,Emergency,Short-term Hospital,2017,019,Cancer of bronchus; lung,000,NO PROC,136,Respiratory malignancy,04,Diseases and Disorders of the Respiratory System,3,Major,Extreme,Medical,Medicare,,,,N,Y,40254.27,7363.94
Long Island,Suffolk,5123000,000885,Brookhaven Memorial Hospital Medical Center Inc,50 to 69,119,M,White,Not Span/Hispanic,6,Emergency,Short-term Hospital,2017,042,Secondary malignancies,000,NO PROC,136,Respiratory malignancy,04,Diseases and Disorders of the Respiratory System,3,Major,Moderate,Medical,Private Health Insurance,,,,N,Y,50101.50,8082.84
Long Island,Suffolk,5123000,000885,Brookhaven Memorial Hospital Medical Center Inc,70 or Older,117,F,White,Not Span/Hispanic,10,Emergency,Skilled Nursing Home,2017,019,Cancer of bronchus; lung,083,BIOPSY OF LIVER,136,Respiratory malignancy,04,Diseases and Disorders of the Respiratory System,2,Moderate,Moderate,Medical,Medicare,Medicare,Private Health Insurance,,N,Y,109647.83,14835.52
Long Island,Suffolk,5123000,000885,Brookhaven Memorial Hospital Medical Center Inc,50 to 69,119,M,White,Not Span/Hispanic,9,Emergency,Home or Self Care,2017,042,Secondary malignancies,058,HEMODIALYSIS,136,Respiratory malignancy,04,Diseases and Disorders of the Respiratory System,3,Major,Major,Medical,Medicare,Medicare,,,N,Y,82137.00,13880.41
Long Island,Suffolk,5123000,000885,Brookhaven Memorial Hospital Medical Center Inc,30 to 49,117,M,White,Not Span/Hispanic,3,Emergency,Home or Self Care,2017,019,Cancer of bronchus; lung,000,NO PROC,136,Respiratory malignancy,04,Diseases and Disorders of the Respiratory System,4,Extreme,Extreme,Medical,Private Health Insurance,,,,N,Y,33027.90,5215.39
Long Island,Suffolk,5123000,000885,Brookhaven Memorial Hospital Medical Center Inc,50 to 69,117,M,White,Not Span/Hispanic,5,Emergency,Home w/ Home Health Services,2017,042,Secondary malignancies,222,BLOOD TRANSFUSION,136,Respiratory malignancy,04,Diseases and Disorders of the Respiratory System,4,Extreme,Major,Medical,Private Health Insurance,,,,N,Y,50978.20,9472.89
Long Island,Suffolk,5123000,000885,Brookhaven Memorial Hospital Medical Center Inc,50 to 69,119,M,White,Not Span/Hispanic,8,Emergency,Skilled Nursing Home,2017,019,Cancer of bronchus; lung,000,NO PROC,136,Respiratory malignancy,04,Diseases and Disorders of the Respiratory System,3,Major,Extreme,Medical,Medicare,Medicare,Medicaid,,N,Y,59643.33,10765.50
Long Island,Suffolk,5123000,000885,Brookhaven Memorial Hospital Medical Center Inc,70 or Older,117,M,White,Not Span/Hispanic,8,Emergency,Expired,2017,019,Cancer of bronchus; lung,039,INCISION OF PLEURA,136,Respiratory malignancy,04,Diseases and Disorders of the Respiratory System,4,Extreme,Extreme,Medical,Medicare,Medicare,Private Health Insurance,,N,Y,68749.76,12123.05
Long Island,Suffolk,5123000,000885,Brookhaven Memorial Hospital Medical Center Inc,50 to 69,119,M,White,Not Span/Hispanic,2,Elective,Home w/ Home Health Services,2017,019,Cancer of bronchus; lung,039,INCISION OF PLEURA,136,Respiratory malignancy,04,Diseases and Disorders of the Respiratory System,3,Major,Major,Medical,Medicare,Medicare,,,N,N,38447.03,8075.01
Long Island,Suffolk,5123000,000885,Brookhaven Memorial Hospital Medical Center Inc,70 or Older,119,M,White,Not Span/Hispanic,25,Emergency,Home or Self Care,2017,019,Cancer of bronchus; lung,108,INDWELLING CATHETER,136,Respiratory malignancy,04,Diseases and Disorders of the Respiratory System,4,Extreme,Extreme,Medical,Blue Cross/Blue Shield,Medicare,,,N,Y,177080.01,35644.32
Long Island,Suffolk,5123000,000885,Brookhaven Memorial Hospital Medical Center Inc,50 to 69,117,F,Other Race,Not Span/Hispanic,4,Emergency,Expired,2017,019,Cancer of bronchus; lung,216,RESP INTUB/MECH VENTIL,136,Respiratory malignancy,04,Diseases and Disorders of the Respiratory System,4,Extreme,Extreme,Medical,Medicare,Medicare,Medicaid,,N,Y,75586.67,10239.70
Long Island,Suffolk,5123000,000885,Brookhaven Memorial Hospital Medical Center Inc,50 to 69,119,F,White,Not Span/Hispanic,11,Emergency,Left Against Medical Advice,2017,019,Cancer of bronchus; lung,008,OT NON-OR THER NERV SYS,136,Respiratory malignancy,04,Diseases and Disorders of the Respiratory System,3,Major,Major,Medical,Private Health Insurance,Medicaid,,,N,Y,127049.91,32987.90
Long Island,Suffolk,5123000,000885,Brookhaven Memorial Hospital Medical Center Inc,70 or Older,117,F,White,Not Span/Hispanic,5,Urgent,Expired,2017,019,Cancer of bronchus; lung,000,NO PROC,136,Respiratory malignancy,04,Diseases and Disorders of the Respiratory System,1,Minor,Minor,Medical,Medicare,,,,N,N,21446.95,5555.48
