Hospital Service Area,Hospital County,Operating Certificate Number,Permanent Facility Id,Facility Name,Age Group,Zip Code - 3 digits,Gender,Race,Ethnicity,Length of Stay,Type of Admission,Patient Disposition,Discharge Year,CCS Diagnosis Code,CCS Diagnosis Description,CCS Procedure Code,CCS Procedure Description,APR DRG Code,APR DRG Description,APR MDC Code,APR MDC Description,APR Severity of Illness Code,APR Severity of Illness Description,APR Risk of Mortality,APR Medical Surgical Description,Payment Typology 1,Payment Typology 2,Payment Typology 3,Birth Weight,Abortion Edit Indicator,Emergency Department Indicator,Total Charges,Total Costs
New York City,Kings,7002053,001304,NYU Langone Hospital-Brooklyn,50 to 69,112,F,Other Race,Unknown,2,Emergency,Home or Self Care,2019,NEO070,SECONDARY MALIGNANCIES,ADM021,"ADMINISTRATION OF THERAPEUTIC SUBSTANCES, NEC",136,RESPIRATORY MALIGNANCY,04,DISEASES AND DISORDERS OF THE RESPIRATORY SYSTEM,3,Major,Major,Medical,Private Health Insurance,,,,,true,38063.96,9985.1
New York City,Kings,7002053,001304,NYU Langone Hospital-Brooklyn,70 or Older,112,M,White,Not Span/Hispanic,6,Emergency,Home w/ Home Health Services,2019,NEO022,RESPIRATORY CANCERS,RES005,CHEST TUBE PLACEMENT AND THERAPEUTIC THORACENTESIS,136,RESPIRATORY MALIGNANCY,04,DISEASES AND DISORDERS OF THE RESPIRATORY SYSTEM,3,Major,Major,Medical,Medicare,Medicaid,,,,true,54541.25,20758.66
New York City,Kings,7002053,001304,NYU Langone Hospital-Brooklyn,70 or Older,112,M,Other Race,Not Span/Hispanic,16,Emergency,Hospice - Medical Facility,2019,NEO070,SECONDARY MALIGNANCIES,ADM001,TRANSFUSION OF BLOOD AND BLOOD PRODUCTS,136,RESPIRATORY MALIGNANCY,04,DISEASES AND DISORDERS OF THE RESPIRATORY SYSTEM,4,Extreme,Extreme,Medical,Private Health Insurance,,,,,true,214900.67,72458.95
New York City,Kings,7002053,001304,NYU Langone Hospital-Brooklyn,70 or Older,112,M,White,Not Span/Hispanic,2,Emergency,Home or Self Care,2019,NEO022,RESPIRATORY CANCERS,,,136,RESPIRATORY MALIGNANCY,04,DISEASES AND DISORDERS OF THE RESPIRATORY SYSTEM,3,Major,Moderate,Medical,Private Health Insurance,,,,,true,42565.95,9525.31
New York City,Kings,7002053,001304,NYU Langone Hospital-Brooklyn,50 to 69,112,M,Other Race,Not Span/Hispanic,19,Emergency,Hospice - Medical Facility,2019,NEO022,RESPIRATORY CANCERS,,,136,RESPIRATORY MALIGNANCY,04,DISEASES AND DISORDERS OF THE RESPIRATORY SYSTEM,3,Major,Major,Medical,Medicaid,,,,,true,162155.87,63022.06
New York City,Kings,7002053,001304,NYU Langone Hospital-Brooklyn,50 to 69,112,M,Other Race,Not Span/Hispanic,6,Emergency,Home or Self Care,2019,NEO067,MESOTHELIOMA,ADM001,TRANSFUSION OF BLOOD AND BLOOD PRODUCTS,136,RESPIRATORY MALIGNANCY,04,DISEASES AND DISORDERS OF THE RESPIRATORY SYSTEM,3,Major,Major,Medical,Private Health Insurance,,,,,true,82827.4,23593.45
New York City,Kings,7002053,001304,NYU Langone Hospital-Brooklyn,50 to 69,112,M,Other Race,Spanish/Hispanic,7,Emergency,Skilled Nursing Home,2019,NEO022,RESPIRATORY CANCERS,ADM021,"ADMINISTRATION OF THERAPEUTIC SUBSTANCES, NEC",136,RESPIRATORY MALIGNANCY,04,DISEASES AND DISORDERS OF THE RESPIRATORY SYSTEM,4,Extreme,Extreme,Medical,Medicaid,,,,,true,94852.41,41132.01
New York City,Kings,7002053,001304,NYU Langone Hospital-Brooklyn,50 to 69,112,F,Other Race,Spanish/Hispanic,3,Elective,Home or Self Care,2019,NEO022,RESPIRATORY CANCERS,RES001,BRONCHOSCOPY (DIAGNOSTIC),136,RESPIRATORY MALIGNANCY,04,DISEASES AND DISORDERS OF THE RESPIRATORY SYSTEM,4,Extreme,Major,Medical,Medicaid,,,,,false,143999.53,34765.72
New York City,Kings,7002053,001304,NYU Langone Hospital-Brooklyn,70 or Older,112,M,White,Not Span/Hispanic,3,Emergency,Hospice - Medical Facility,2019,NEO022,RESPIRATORY CANCERS,,,136,RESPIRATORY MALIGNANCY,04,DISEASES AND DISORDERS OF THE RESPIRATORY SYSTEM,3,Major,Major,Medical,Medicare,Medicaid,,,,true,69573.69,27178.53
New York City,Kings,7002053,001304,NYU Langone Hospital-Brooklyn,50 to 69,112,F,White,Not Span/Hispanic,3,Emergency,Hospice - Home,2019,NEO022,RESPIRATORY CANCERS,ADM021,"ADMINISTRATION OF THERAPEUTIC SUBSTANCES, NEC",136,RESPIRATORY MALIGNANCY,04,DISEASES AND DISORDERS OF THE RESPIRATORY SYSTEM,3,Major,Major,Medical,Medicare,Medicaid,,,,true,44071.35,13389
New York City,Kings,7002053,001304,NYU Langone Hospital-Brooklyn,50 to 69,112,M,Black/African American,Unknown,8,Emergency,Home w/ Home Health Services,2019,NEO070,SECONDARY MALIGNANCIES,IMG006,COMPUTERIZED TOMOGRAPHY (CT) WITH CONTRAST,136,RESPIRATORY MALIGNANCY,04,DISEASES AND DISORDERS OF THE RESPIRATORY SYSTEM,3,Major,Major,Medical,Medicare,Medicaid,,,,true,142277.37,43163.34
New York City,Kings,7002053,001304,NYU Langone Hospital-Brooklyn,70 or Older,112,F,Other Race,Not Span/Hispanic,10,Emergency,Home w/ Home Health Services,2019,NEO022,RESPIRATORY CANCERS,ADM001,TRANSFUSION OF BLOOD AND BLOOD PRODUCTS,136,RESPIRATORY MALIGNANCY,04,DISEASES AND DISORDERS OF THE RESPIRATORY SYSTEM,3,Major,Major,Medical,Medicare,Medicaid,,,,true,83295.98,34595.13
New York City,Kings,7002053,001304,NYU Langone Hospital-Brooklyn,70 or Older,112,F,White,Not Span/Hispanic,1,Emergency,Left Against Medical Advice,2019,NEO022,RESPIRATORY CANCERS,ADM021,"ADMINISTRATION OF THERAPEUTIC SUBSTANCES, NEC",136,RESPIRATORY MALIGNANCY,04,DISEASES AND DISORDERS OF THE RESPIRATORY SYSTEM,2,Moderate,Moderate,Medical,Medicare,Medicaid,,,,true,18493.44,5062.54
New York City,Kings,7002053,001304,NYU Langone Hospital-Brooklyn,70 or Older,112,M,White,Not Span/Hispanic,7,Emergency,Expired,2019,NEO070,SECONDARY MALIGNANCIES,RES002,"LUNG, PLEURA, OR DIAPHRAGM BIOPSY (NON-ENDOSCOPIC)",136,RESPIRATORY MALIGNANCY,04,DISEASES AND DISORDERS OF THE RESPIRATORY SYSTEM,4,Extreme,Extreme,Medical,Medicare,Private Health Insurance,,,,true,109759.37,31173.7
New York City,Kings,7002053,001304,NYU Langone Hospital-Brooklyn,50 to 69,112,F,Other Race,Spanish/Hispanic,4,Emergency,Hospice - Medical Facility,2019,NEO022,RESPIRATORY CANCERS,IMG004,FLUOROSCOPY OF NON-CIRCULATORY ORGANS,136,RESPIRATORY MALIGNANCY,04,DISEASES AND DISORDERS OF THE RESPIRATORY SYSTEM,3,Major,Major,Medical,Medicaid,,,,,true,42125.21,14773.21
New York City,Kings,7002053,001304,NYU Langone Hospital-Brooklyn,70 or Older,112,F,White,Not Span/Hispanic,2,Emergency,Left Against Medical Advice,2019,NEO022,RESPIRATORY CANCERS,ADM015,ADMINISTRATION OF ANTIBIOTICS,136,RESPIRATORY MALIGNANCY,04,DISEASES AND DISORDERS OF THE RESPIRATORY SYSTEM,3,Major,Major,Medical,Medicare,Medicaid,,,,true,29945.94,9084.26
New York City,Kings,7002053,001304,NYU Langone Hospital-Brooklyn,70 or Older,112,F,Black/African American,Not Span/Hispanic,12,Emergency,Home w/ Home Health Services,2019,NEO070,SECONDARY MALIGNANCIES,RES002,"LUNG, PLEURA, OR DIAPHRAGM BIOPSY (NON-ENDOSCOPIC)",136,RESPIRATORY MALIGNANCY,04,DISEASES AND DISORDERS OF THE RESPIRATORY SYSTEM,3,Major,Extreme,Medical,Medicare,Medicaid,,,,true,190639.88,47316.77
New York City,Kings,7002053,001304,NYU Langone Hospital-Brooklyn,70 or Older,112,F,White,Not Span/Hispanic,1,Emergency,Home or Self Care,2019,NEO022,RESPIRATORY CANCERS,RES001,BRONCHOSCOPY (DIAGNOSTIC),136,RESPIRATORY MALIGNANCY,04,DISEASES AND DISORDERS OF THE RESPIRATORY SYSTEM,2,Moderate,Moderate,Medical,Medicare,,,,,true,75863.21,13086.58
New York City,Kings,7002053,001304,NYU Langone Hospital-Brooklyn,70 or Older,112,F,White,Not Span/Hispanic,1,Emergency,Home or Self Care,2019,NEO022,RESPIRATORY CANCERS,RES005,CHEST TUBE PLACEMENT AND THERAPEUTIC THORACENTESIS,136,RESPIRATORY MALIGNANCY,04,DISEASES AND DISORDERS OF THE RESPIRATORY SYSTEM,3,Major,Major,Medical,Medicare,Medicaid,,,,true,37767.77,10119.09
New York City,Kings,7002053,001304,NYU Langone Hospital-Brooklyn,70 or Older,112,M,Other Race,Not Span/Hispanic,8,Emergency,Skilled Nursing Home,2019,NEO022,RESPIRATORY CANCERS,RES002,"LUNG, PLEURA, OR DIAPHRAGM BIOPSY (NON-ENDOSCOPIC)",136,RESPIRATORY MALIGNANCY,04,DISEASES AND DISORDERS OF THE RESPIRATORY SYSTEM,3,Major,Major,Medical,Medicare,Medicaid,,,,true,101929.98,38672.96
New York City,Kings,7002053,001304,NYU Langone Hospital-Brooklyn,70 or Older,112,F,White,Not Span/Hispanic,1,Emergency,Home or Self Care,2019,NEO022,RESPIRATORY CANCERS,,,136,RESPIRATORY MALIGNANCY,04,DISEASES AND DISORDERS OF THE RESPIRATORY SYSTEM,3,Major,Major,Medical,Medicare,Blue Cross/Blue Shield,,,,true,41743.36,7995.05
New York City,Kings,7002053,001304,NYU Langone Hospital-Brooklyn,50 to 69,112,F,White,Not Span/Hispanic,1,Elective,Home or Self Care,2019,NEO022,RESPIRATORY CANCERS,RES002,"LUNG, PLEURA, OR DIAPHRAGM BIOPSY (NON-ENDOSCOPIC)",136,RESPIRATORY MALIGNANCY,04,DISEASES AND DISORDERS OF THE RESPIRATORY SYSTEM,3,Major,Moderate,Medical,Medicaid,,,,,false,25037.24,5641.08
New York City,Kings,7002053,001304,NYU Langone Hospital-Brooklyn,70 or Older,112,M,White,Not Span/Hispanic,1,Emergency,Home or Self Care,2019,NEO022,RESPIRATORY CANCERS,ADM021,"ADMINISTRATION OF THERAPEUTIC SUBSTANCES, NEC",136,RESPIRATORY MALIGNANCY,04,DISEASES AND DISORDERS OF THE RESPIRATORY SYSTEM,3,Major,Major,Medical,Medicare,,,,,true,27824.33,6196.61
New York City,Kings,7002053,001304,NYU Langone Hospital-Brooklyn,50 to 69,112,M,Black/African American,Not Span/Hispanic,4,Emergency,Home or Self Care,2019,NEO022,RESPIRATORY CANCERS,RES001,BRONCHOSCOPY (DIAGNOSTIC),136,RESPIRATORY MALIGNANCY,04,DISEASES AND DISORDERS OF THE RESPIRATORY SYSTEM,3,Major,Moderate,Medical,Medicaid,,,,,true,100171.17,21526.23
New York City,Kings,7002053,001304,NYU Langone Hospital-Brooklyn,50 to 69,112,F,White,Spanish/Hispanic,5,Emergency,Home or Self Care,2019,NEO022,RESPIRATORY CANCERS,LYM001,LYMPH NODE BIOPSY,136,RESPIRATORY MALIGNANCY,04,DISEASES AND DISORDERS OF THE RESPIRATORY SYSTEM,3,Major,Major,Medical,Medicaid,,,,,true,102673.7,24602.22
New York City,Kings,7002053,001304,NYU Langone Hospital-Brooklyn,70 or Older,112,F,White,Not Span/Hispanic,2,Emergency,Home w/ Home Health Services,2019,NEO022,RESPIRATORY CANCERS,,,136,RESPIRATORY MALIGNANCY,04,DISEASES AND DISORDERS OF THE RESPIRATORY SYSTEM,3,Major,Major,Medical,Medicare,Medicaid,,,,true,48581,16615.96
New York City,Kings,7002053,001304,NYU Langone Hospital-Brooklyn,70 or Older,112,M,White,Not Span/Hispanic,11,Emergency,Skilled Nursing Home,2019,NEO022,RESPIRATORY CANCERS,RES005,CHEST TUBE PLACEMENT AND THERAPEUTIC THORACENTESIS,136,RESPIRATORY MALIGNANCY,04,DISEASES AND DISORDERS OF THE RESPIRATORY SYSTEM,3,Major,Major,Medical,Medicare,Medicaid,,,,true,155975.39,42970.54
New York City,Kings,7002053,001304,NYU Langone Hospital-Brooklyn,50 to 69,112,M,White,Not Span/Hispanic,7,Emergency,Skilled Nursing Home,2019,NEO022,RESPIRATORY CANCERS,,,136,RESPIRATORY MALIGNANCY,04,DISEASES AND DISORDERS OF THE RESPIRATORY SYSTEM,4,Extreme,Extreme,Medical,Medicare,Medicaid,,,,true,105829.6,33921.49
New York City,Kings,7002053,001304,NYU Langone Hospital-Brooklyn,70 or Older,112,M,Other Race,Spanish/Hispanic,4,Emergency,Hospice - Home,2019,NEO022,RESPIRATORY CANCERS,RES003,THORACENTESIS (DIAGNOSTIC),136,RESPIRATORY MALIGNANCY,04,DISEASES AND DISORDERS OF THE RESPIRATORY SYSTEM,4,Extreme,Major,Medical,Medicare,,,,,true,61025.05,20103.26
New York City,Kings,7002053,001304,NYU Langone Hospital-Brooklyn,50 to 69,112,F,Other Race,Not Span/Hispanic,12,Emergency,Hospice - Medical Facility,2019,NEO022,RESPIRATORY CANCERS,RES002,"LUNG, PLEURA, OR DIAPHRAGM BIOPSY (NON-ENDOSCOPIC)",136,RESPIRATORY MALIGNANCY,04,DISEASES AND DISORDERS OF THE RESPIRATORY SYSTEM,4,Extreme,Extreme,Medical,Medicare,Medicaid,,,,true,136727.55,44867.92
New York City,Kings,7002053,001304,NYU Langone Hospital-Brooklyn,70 or Older,112,M,White,Not Span/Hispanic,14,Emergency,Skilled Nursing Home,2019,NEO022,RESPIRATORY CANCERS,,,136,RESPIRATORY MALIGNANCY,04,DISEASES AND DISORDERS OF THE RESPIRATORY SYSTEM,4,Extreme,Extreme,Medical,Medicare,Blue Cross/Blue Shield,,,,true,162500.85,48896.68
New York City,Kings,7002053,001304,NYU Langone Hospital-Brooklyn,70 or Older,112,M,White,Not Span/Hispanic,14,Emergency,Skilled Nursing Home,2019,NEO022,RESPIRATORY CANCERS,RES001,BRONCHOSCOPY (DIAGNOSTIC),136,RESPIRATORY MALIGNANCY,04,DISEASES AND DISORDERS OF THE RESPIRATORY SYSTEM,4,Extreme,Extreme,Medical,Medicare,Blue Cross/Blue Shield,,,,true,234135.39,61137.86
New York City,Kings,7002053,001304,NYU Langone Hospital-Brooklyn,50 to 69,100,F,Black/African American,Unknown,5,Elective,Home or Self Care,2019,NEO070,SECONDARY MALIGNANCIES,,,136,RESPIRATORY MALIGNANCY,04,DISEASES AND DISORDERS OF THE RESPIRATORY SYSTEM,2,Moderate,Moderate,Medical,Medicaid,,,,,false,41530.48,17363.29
New York City,Kings,7002053,001304,NYU Langone Hospital-Brooklyn,50 to 69,112,F,Other Race,Not Span/Hispanic,2,Emergency,Short-term Hospital,2019,NEO070,SECONDARY MALIGNANCIES,RES005,CHEST TUBE PLACEMENT AND THERAPEUTIC THORACENTESIS,136,RESPIRATORY MALIGNANCY,04,DISEASES AND DISORDERS OF THE RESPIRATORY SYSTEM,3,Major,Major,Medical,Medicare,Blue Cross/Blue Shield,,,,true,58280.08,12183.88
New York City,Kings,7002053,001304,NYU Langone Hospital-Brooklyn,50 to 69,112,M,Other Race,Not Span/Hispanic,4,Emergency,Home or Self Care,2019,NEO022,RESPIRATORY CANCERS,OTR004,ISOLATION PROCEDURES,136,RESPIRATORY MALIGNANCY,04,DISEASES AND DISORDERS OF THE RESPIRATORY SYSTEM,3,Major,Moderate,Medical,Private Health Insurance,,,,,true,52032.81,16311.63
New York City,Kings,7002053,001304,NYU Langone Hospital-Brooklyn,50 to 69,112,M,Black/African American,Unknown,4,Emergency,Home or Self Care,2019,NEO022,RESPIRATORY CANCERS,GIS001,ESOPHAGOGASTRODUODENOSCOPY (EGD) WITH BIOPSY,136,RESPIRATORY MALIGNANCY,04,DISEASES AND DISORDERS OF THE RESPIRATORY SYSTEM,3,Major,Moderate,Medical,Medicaid,,,,,true,124468.34,26051.39
New York City,Kings,7002053,001304,NYU Langone Hospital-Brooklyn,70 or Older,116,F,Other Race,Not Span/Hispanic,10,Emergency,Home or Self Care,2019,NEO022,RESPIRATORY CANCERS,RES001,BRONCHOSCOPY (DIAGNOSTIC),136,RESPIRATORY MALIGNANCY,04,DISEASES AND DISORDERS OF THE RESPIRATORY SYSTEM,4,Extreme,Major,Medical,Medicare,Medicaid,,,,true,198282.13,45474.1
New York City,Kings,7002053,001304,NYU Langone Hospital-Brooklyn,70 or Older,112,F,Other Race,Not Span/Hispanic,2,Emergency,Hospice - Home,2019,NEO022,RESPIRATORY CANCERS,ADM015,ADMINISTRATION OF ANTIBIOTICS,136,RESPIRATORY MALIGNANCY,04,DISEASES AND DISORDERS OF THE RESPIRATORY SYSTEM,2,Moderate,Major,Medical,Medicare,Medicaid,,,,true,32113.8,8596.24
New York City,Kings,7002053,001304,NYU Langone Hospital-Brooklyn,50 to 69,112,M,White,Not Span/Hispanic,11,Elective,Hospice - Medical Facility,2019,NEO022,RESPIRATORY CANCERS,RHB002,"PHYSICAL, OCCUPATIONAL, AND RESPIRATORY THERAPY TREATMENT",136,RESPIRATORY MALIGNANCY,04,DISEASES AND DISORDERS OF THE RESPIRATORY SYSTEM,3,Major,Major,Medical,Medicare,Medicare,,,,false,116218.42,34575.42
New York City,Kings,7002053,001304,NYU Langone Hospital-Brooklyn,50 to 69,112,F,White,Not Span/Hispanic,8,Emergency,Home or Self Care,2019,NEO022,RESPIRATORY CANCERS,RES002,"LUNG, PLEURA, OR DIAPHRAGM BIOPSY (NON-ENDOSCOPIC)",136,RESPIRATORY MALIGNANCY,04,DISEASES AND DISORDERS OF THE RESPIRATORY SYSTEM,3,Major,Major,Medical,Medicare,,,,,true,154129.85,43331.72
New York City,Kings,7002053,001304,NYU Langone Hospital-Brooklyn,70 or Older,112,F,Other Race,Not Span/Hispanic,2,Emergency,Hospice - Home,2019,NEO022,RESPIRATORY CANCERS,ADM015,ADMINISTRATION OF ANTIBIOTICS,136,RESPIRATORY MALIGNANCY,04,DISEASES AND DISORDERS OF THE RESPIRATORY SYSTEM,3,Major,Major,Medical,Medicare,Medicaid,,,,true,49231.01,18358.1
New York City,Kings,7002053,001304,NYU Langone Hospital-Brooklyn,50 to 69,112,M,Black/African American,Not Span/Hispanic,6,Emergency,Home w/ Home Health Services,2019,NEO022,RESPIRATORY CANCERS,ADM001,TRANSFUSION OF BLOOD AND BLOOD PRODUCTS,136,RESPIRATORY MALIGNANCY,04,DISEASES AND DISORDERS OF THE RESPIRATORY SYSTEM,4,Extreme,Major,Medical,Medicare,Medicaid,,,,true,82284.49,24675.4
New York City,Kings,7002053,001304,NYU Langone Hospital-Brooklyn,50 to 69,112,M,Black/African American,Not Span/Hispanic,2,Emergency,Home or Self Care,2019,NEO022,RESPIRATORY CANCERS,,,136,RESPIRATORY MALIGNANCY,04,DISEASES AND DISORDERS OF THE RESPIRATORY SYSTEM,3,Major,Moderate,Medical,Medicare,Medicaid,,,,true,35638.27,14217.91
New York City,Kings,7002053,001304,NYU Langone Hospital-Brooklyn,30 to 49,112,F,Other Race,Not Span/Hispanic,1,Emergency,Left Against Medical Advice,2019,NEO022,RESPIRATORY CANCERS,,,136,RESPIRATORY MALIGNANCY,04,DISEASES AND DISORDERS OF THE RESPIRATORY SYSTEM,1,Minor,Minor,Medical,Medicaid,,,,,true,18685.92,5069.89
New York City,Kings,7002053,001304,NYU Langone Hospital-Brooklyn,70 or Older,112,M,Black/African American,Not Span/Hispanic,25,Emergency,Home or Self Care,2019,NEO022,RESPIRATORY CANCERS,,,136,RESPIRATORY MALIGNANCY,04,DISEASES AND DISORDERS OF THE RESPIRATORY SYSTEM,4,Extreme,Extreme,Medical,Medicare,,,,,true,195503.82,81206.78
New York City,Kings,7002053,001304,NYU Langone Hospital-Brooklyn,70 or Older,112,F,Other Race,Not Span/Hispanic,3,Emergency,Hospice - Home,2019,NEO022,RESPIRATORY CANCERS,,,136,RESPIRATORY MALIGNANCY,04,DISEASES AND DISORDERS OF THE RESPIRATORY SYSTEM,2,Moderate,Moderate,Medical,Medicare,,,,,true,44958.69,13175.82
New York City,Kings,7002053,001304,NYU Langone Hospital-Brooklyn,70 or Older,112,M,Other Race,Not Span/Hispanic,4,Emergency,Hospice - Medical Facility,2019,NEO022,RESPIRATORY CANCERS,,,136,RESPIRATORY MALIGNANCY,04,DISEASES AND DISORDERS OF THE RESPIRATORY SYSTEM,3,Major,Extreme,Medical,Medicare,,,,,true,68809.04,17686.42
New York City,Kings,7002053,001304,NYU Langone Hospital-Brooklyn,30 to 49,103,F,Other Race,Unknown,5,Emergency,Home or Self Care,2019,NEO022,RESPIRATORY CANCERS,RES001,BRONCHOSCOPY (DIAGNOSTIC),136,RESPIRATORY MALIGNANCY,04,DISEASES AND DISORDERS OF THE RESPIRATORY SYSTEM,3,Major,Moderate,Medical,Medicaid,,,,,true,96950.93,25382.89
New York City,Kings,7002053,001304,NYU Langone Hospital-Brooklyn,30 to 49,103,F,Other Race,Unknown,17,Emergency,Hospice - Home,2019,NEO070,SECONDARY MALIGNANCIES,GIS006,PARACENTESIS,136,RESPIRATORY MALIGNANCY,04,DISEASES AND DISORDERS OF THE RESPIRATORY SYSTEM,4,Extreme,Major,Medical,Medicaid,,,,,true,243387,75190.38
