Hospital Service Area,Hospital County,Operating Certificate Number,Permanent Facility Id,Facility Name,Age Group,Zip Code - 3 digits,Gender,Race,Ethnicity,Length of Stay,Type of Admission,Patient Disposition,Discharge Year,CCS Diagnosis Code,CCS Diagnosis Description,CCS Procedure Code,CCS Procedure Description,APR DRG Code,APR DRG Description,APR MDC Code,APR MDC Description,APR Severity of Illness Code,APR Severity of Illness Description,APR Risk of Mortality,APR Medical Surgical Description,Payment Typology 1,Payment Typology 2,Payment Typology 3,Birth Weight,Abortion Edit Indicator,Emergency Department Indicator,Total Charges,Total Costs
Long Island,Suffolk,5123000,000885,Long Island Community Hospital,70 or Older,117,M,White,Not Span/Hispanic,2,Emergency,Expired,2019,NEO022,RESPIRATORY CANCERS,,,136,RESPIRATORY MALIGNANCY,04,DISEASES AND DISORDERS OF THE RESPIRATORY SYSTEM,4,Extreme,Extreme,Medical,Medicare,Medicare,,,,true,16804.3,2898.95
Long Island,Suffolk,5123000,000885,Long Island Community Hospital,70 or Older,117,M,White,Not Span/Hispanic,6,Emergency,Expired,2019,NEO022,RESPIRATORY CANCERS,HEP001,LIVER BIOPSY,136,RESPIRATORY MALIGNANCY,04,DISEASES AND DISORDERS OF THE RESPIRATORY SYSTEM,4,Extreme,Extreme,Medical,Medicare,Medicare,Blue Cross/Blue Shield,,,true,74108.99,10092.72
Long Island,Suffolk,5123000,000885,Long Island Community Hospital,70 or Older,119,F,White,Not Span/Hispanic,8,Emergency,Hospice - Home,2019,NEO022,RESPIRATORY CANCERS,,,136,RESPIRATORY MALIGNANCY,04,DISEASES AND DISORDERS OF THE RESPIRATORY SYSTEM,3,Major,Extreme,Medical,Medicare,,,,,true,67542.23,12548.44
Long Island,Suffolk,5123000,000885,Long Island Community Hospital,70 or Older,117,F,White,Not Span/Hispanic,4,Emergency,Home or Self Care,2019,NEO022,RESPIRATORY CANCERS,RES002,"LUNG, PLEURA, OR DIAPHRAGM BIOPSY (NON-ENDOSCOPIC)",136,RESPIRATORY MALIGNANCY,04,DISEASES AND DISORDERS OF THE RESPIRATORY SYSTEM,3,Major,Extreme,Medical,Medicare,Medicare,Blue Cross/Blue Shield,,,true,50063.83,7612.46
Long Island,Suffolk,5123000,000885,Long Island Community Hospital,50 to 69,119,F,White,Not Span/Hispanic,4,Emergency,Home or Self Care,2019,NEO022,RESPIRATORY CANCERS,RES005,CHEST TUBE PLACEMENT AND THERAPEUTIC THORACENTESIS,136,RESPIRATORY MALIGNANCY,04,DISEASES AND DISORDERS OF THE RESPIRATORY SYSTEM,3,Major,Moderate,Medical,Medicare,Medicare,Medicaid,,,true,46085.8,7284.32
Long Island,Suffolk,5123000,000885,Long Island Community Hospital,50 to 69,119,F,White,Not Span/Hispanic,5,Emergency,Expired,2019,NEO022,RESPIRATORY CANCERS,,,136,RESPIRATORY MALIGNANCY,04,DISEASES AND DISORDERS OF THE RESPIRATORY SYSTEM,3,Major,Extreme,Medical,Medicare,Medicare,,,,true,33230.64,7207.99
Long Island,Suffolk,5123000,000885,Long Island Community Hospital,70 or Older,119,F,White,Not Span/Hispanic,16,Emergency,Home w/ Home Health Services,2019,NEO022,RESPIRATORY CANCERS,RES006,OPEN AND THORACOSCOPIC PLEURAL DRAINAGE,136,RESPIRATORY MALIGNANCY,04,DISEASES AND DISORDERS OF THE RESPIRATORY SYSTEM,3,Major,Moderate,Medical,Medicare,Medicare,,,,true,160477.56,30442.01
Long Island,Suffolk,5123000,000885,Long Island Community Hospital,70 or Older,117,M,White,Not Span/Hispanic,18,Emergency,Home or Self Care,2019,NEO022,RESPIRATORY CANCERS,GIS004,GI SYSTEM ENDOSCOPY WITHOUT BIOPSY (DIAGNOSTIC),136,RESPIRATORY MALIGNANCY,04,DISEASES AND DISORDERS OF THE RESPIRATORY SYSTEM,4,Extreme,Major,Medical,Medicare,,,,,true,135631.12,27324.08
Long Island,Suffolk,5123000,000885,Long Island Community Hospital,70 or Older,117,F,White,Not Span/Hispanic,36,Emergency,Expired,2019,NEO022,RESPIRATORY CANCERS,ADM001,TRANSFUSION OF BLOOD AND BLOOD PRODUCTS,136,RESPIRATORY MALIGNANCY,04,DISEASES AND DISORDERS OF THE RESPIRATORY SYSTEM,4,Extreme,Extreme,Medical,Medicare,Medicare,Private Health Insurance,,,true,414549.93,79814.42
Long Island,Suffolk,5123000,000885,Long Island Community Hospital,50 to 69,117,F,White,Not Span/Hispanic,8,Emergency,Home w/ Home Health Services,2019,NEO022,RESPIRATORY CANCERS,RES001,BRONCHOSCOPY (DIAGNOSTIC),136,RESPIRATORY MALIGNANCY,04,DISEASES AND DISORDERS OF THE RESPIRATORY SYSTEM,3,Major,Moderate,Medical,Medicare,Medicare,Medicaid,,,true,130615.26,22712.44
Long Island,Suffolk,5123000,000885,Long Island Community Hospital,70 or Older,117,M,White,Not Span/Hispanic,4,Emergency,Home or Self Care,2019,NEO022,RESPIRATORY CANCERS,RES005,CHEST TUBE PLACEMENT AND THERAPEUTIC THORACENTESIS,136,RESPIRATORY MALIGNANCY,04,DISEASES AND DISORDERS OF THE RESPIRATORY SYSTEM,3,Major,Major,Medical,Medicare,,,,,true,50049.85,7500.19
Long Island,Suffolk,5123000,000885,Long Island Community Hospital,50 to 69,119,F,White,Not Span/Hispanic,12,Emergency,Home w/ Home Health Services,2019,NEO022,RESPIRATORY CANCERS,HEP001,LIVER BIOPSY,136,RESPIRATORY MALIGNANCY,04,DISEASES AND DISORDERS OF THE RESPIRATORY SYSTEM,3,Major,Major,Medical,Medicare,Medicare,,,,true,115990.39,20910.31
Long Island,Suffolk,5123000,000885,Long Island Community Hospital,70 or Older,119,F,White,Not Span/Hispanic,5,Emergency,Skilled Nursing Home,2019,NEO070,SECONDARY MALIGNANCIES,RES005,CHEST TUBE PLACEMENT AND THERAPEUTIC THORACENTESIS,136,RESPIRATORY MALIGNANCY,04,DISEASES AND DISORDERS OF THE RESPIRATORY SYSTEM,3,Major,Major,Medical,Medicare,Medicare,,,,true,47305.58,7719.65
Long Island,Suffolk,5123000,000885,Long Island Community Hospital,50 to 69,119,M,White,Not Span/Hispanic,8,Emergency,Home w/ Home Health Services,2019,NEO022,RESPIRATORY CANCERS,MAM005,MEASUREMENT DURING CARDIAC CATHETERIZATION,136,RESPIRATORY MALIGNANCY,04,DISEASES AND DISORDERS OF THE RESPIRATORY SYSTEM,3,Major,Major,Medical,Medicare,Medicare,,,,true,122263.4,18412.58
Long Island,Suffolk,5123000,000885,Long Island Community Hospital,50 to 69,119,F,White,Not Span/Hispanic,5,Emergency,Home or Self Care,2019,NEO070,SECONDARY MALIGNANCIES,RES002,"LUNG, PLEURA, OR DIAPHRAGM BIOPSY (NON-ENDOSCOPIC)",136,RESPIRATORY MALIGNANCY,04,DISEASES AND DISORDERS OF THE RESPIRATORY SYSTEM,2,Moderate,Minor,Medical,Private Health Insurance,Medicaid,,,,true,71429.73,10822.36
Long Island,Suffolk,5123000,000885,Long Island Community Hospital,70 or Older,117,M,White,Not Span/Hispanic,14,Emergency,Home or Self Care,2019,NEO022,RESPIRATORY CANCERS,ESA001,HEMODIALYSIS,136,RESPIRATORY MALIGNANCY,04,DISEASES AND DISORDERS OF THE RESPIRATORY SYSTEM,3,Major,Major,Medical,Medicare,Medicare,Blue Cross/Blue Shield,,,true,172378.96,29430.01
Long Island,Suffolk,5123000,000885,Long Island Community Hospital,70 or Older,117,M,White,Not Span/Hispanic,15,Emergency,Home w/ Home Health Services,2019,NEO022,RESPIRATORY CANCERS,RES002,"LUNG, PLEURA, OR DIAPHRAGM BIOPSY (NON-ENDOSCOPIC)",136,RESPIRATORY MALIGNANCY,04,DISEASES AND DISORDERS OF THE RESPIRATORY SYSTEM,3,Major,Extreme,Medical,Medicare,,,,,true,161555.18,33239.25
Long Island,Suffolk,5123000,000885,Long Island Community Hospital,70 or Older,117,F,White,Not Span/Hispanic,6,Emergency,Expired,2019,NEO022,RESPIRATORY CANCERS,,,136,RESPIRATORY MALIGNANCY,04,DISEASES AND DISORDERS OF THE RESPIRATORY SYSTEM,4,Extreme,Extreme,Medical,Medicare,Medicare,Private Health Insurance,,,true,53680.91,9350.11
Long Island,Suffolk,5123000,000885,Long Island Community Hospital,70 or Older,117,M,White,Not Span/Hispanic,14,Emergency,Home w/ Home Health Services,2019,NEO070,SECONDARY MALIGNANCIES,RES003,THORACENTESIS (DIAGNOSTIC),136,RESPIRATORY MALIGNANCY,04,DISEASES AND DISORDERS OF THE RESPIRATORY SYSTEM,4,Extreme,Extreme,Medical,Medicare,Medicare,Blue Cross/Blue Shield,,,true,118036.52,25179.43
Long Island,Suffolk,5123000,000885,Long Island Community Hospital,70 or Older,119,F,White,Not Span/Hispanic,7,Emergency,Home w/ Home Health Services,2019,NEO022,RESPIRATORY CANCERS,CAR024,VENOUS AND ARTERIAL CATHETER PLACEMENT,136,RESPIRATORY MALIGNANCY,04,DISEASES AND DISORDERS OF THE RESPIRATORY SYSTEM,2,Moderate,Moderate,Medical,Medicare,Medicare,Blue Cross/Blue Shield,,,true,135212.31,23987.51
Long Island,Suffolk,5123000,000885,Long Island Community Hospital,70 or Older,117,M,White,Not Span/Hispanic,1,Emergency,Expired,2019,NEO070,SECONDARY MALIGNANCIES,ESA004,NON-INVASIVE VENTILATION,136,RESPIRATORY MALIGNANCY,04,DISEASES AND DISORDERS OF THE RESPIRATORY SYSTEM,4,Extreme,Extreme,Medical,Medicare,Medicare,Blue Cross/Blue Shield,,,true,9451.55,1814.21
Long Island,Suffolk,5123000,000885,Long Island Community Hospital,50 to 69,119,F,White,Not Span/Hispanic,12,Emergency,Home w/ Home Health Services,2019,NEO070,SECONDARY MALIGNANCIES,GIS001,ESOPHAGOGASTRODUODENOSCOPY (EGD) WITH BIOPSY,136,RESPIRATORY MALIGNANCY,04,DISEASES AND DISORDERS OF THE RESPIRATORY SYSTEM,3,Major,Major,Medical,Medicare,,,,,true,115058.44,19639.56
Long Island,Suffolk,5123000,000885,Long Island Community Hospital,70 or Older,117,F,White,Not Span/Hispanic,11,Emergency,Skilled Nursing Home,2019,NEO022,RESPIRATORY CANCERS,RES002,"LUNG, PLEURA, OR DIAPHRAGM BIOPSY (NON-ENDOSCOPIC)",136,RESPIRATORY MALIGNANCY,04,DISEASES AND DISORDERS OF THE RESPIRATORY SYSTEM,3,Major,Major,Medical,Medicare,Medicare,Medicaid,,,true,135811.27,19632.31
Long Island,Suffolk,5123000,000885,Long Island Community Hospital,50 to 69,117,F,White,Not Span/Hispanic,14,Emergency,Short-term Hospital,2019,NEO022,RESPIRATORY CANCERS,RES002,"LUNG, PLEURA, OR DIAPHRAGM BIOPSY (NON-ENDOSCOPIC)",136,RESPIRATORY MALIGNANCY,04,DISEASES AND DISORDERS OF THE RESPIRATORY SYSTEM,3,Major,Major,Medical,Medicare,Medicare,,,,true,124581.73,20985.17
Long Island,Suffolk,5123000,000885,Long Island Community Hospital,70 or Older,117,M,White,Not Span/Hispanic,5,Emergency,Home or Self Care,2019,NEO070,SECONDARY MALIGNANCIES,RES002,"LUNG, PLEURA, OR DIAPHRAGM BIOPSY (NON-ENDOSCOPIC)",136,RESPIRATORY MALIGNANCY,04,DISEASES AND DISORDERS OF THE RESPIRATORY SYSTEM,3,Major,Major,Medical,Medicare,Medicare,,,,true,89689.11,10415.65
Long Island,Suffolk,5123000,000885,Long Island Community Hospital,70 or Older,117,M,White,Not Span/Hispanic,6,Emergency,Skilled Nursing Home,2019,NEO022,RESPIRATORY CANCERS,ESA004,NON-INVASIVE VENTILATION,136,RESPIRATORY MALIGNANCY,04,DISEASES AND DISORDERS OF THE RESPIRATORY SYSTEM,4,Extreme,Extreme,Medical,Medicare,Medicare,Blue Cross/Blue Shield,,,true,83547.66,11557.87
