Hospital Service Area,Hospital County,Operating Certificate Number,Permanent Facility Id,Facility Name,Age Group,Zip Code - 3 digits,Gender,Race,Ethnicity,Length of Stay,Type of Admission,Patient Disposition,Discharge Year,CCS Diagnosis Code,CCS Diagnosis Description,CCS Procedure Code,CCS Procedure Description,APR DRG Code,APR DRG Description,APR MDC Code,APR MDC Description,APR Severity of Illness Code,APR Severity of Illness Description,APR Risk of Mortality,APR Medical Surgical Description,Payment Typology 1,Payment Typology 2,Payment Typology 3,Birth Weight,Abortion Edit Indicator,Emergency Department Indicator,Total Charges,Total Costs
Long Island,Nassau,2908000,000511,NYU Langone Hospital-Long Island,70 or Older,115,F,Black/African American,Not Span/Hispanic,8,Emergency,Home w/ Home Health Services,2019,RSP010,ASPIRATION PNEUMONITIS,OTR004,ISOLATION PROCEDURES,137,MAJOR RESPIRATORY INFECTIONS & INFLAMMATIONS,04,DISEASES AND DISORDERS OF THE RESPIRATORY SYSTEM,4,Extreme,Extreme,Medical,Medicare,Medicare,,,,true,154050.64,22350.79
Long Island,Nassau,2908000,000511,NYU Langone Hospital-Long Island,70 or Older,115,F,White,Not Span/Hispanic,17,Emergency,Home w/ Home Health Services,2019,RSP010,ASPIRATION PNEUMONITIS,ADM001,TRANSFUSION OF BLOOD AND BLOOD PRODUCTS,137,MAJOR RESPIRATORY INFECTIONS & INFLAMMATIONS,04,DISEASES AND DISORDERS OF THE RESPIRATORY SYSTEM,4,Extreme,Major,Medical,Medicare,Medicare,Private Health Insurance,,,true,182200.52,37255.8
Long Island,Nassau,2908000,000511,NYU Langone Hospital-Long Island,70 or Older,115,F,White,Not Span/Hispanic,6,Emergency,Home w/ Home Health Services,2019,RSP010,ASPIRATION PNEUMONITIS,ESA004,NON-INVASIVE VENTILATION,137,MAJOR RESPIRATORY INFECTIONS & INFLAMMATIONS,04,DISEASES AND DISORDERS OF THE RESPIRATORY SYSTEM,4,Extreme,Extreme,Medical,Medicare,Medicare,Private Health Insurance,,,true,101826.35,17758.05
Long Island,Nassau,2908000,000511,NYU Langone Hospital-Long Island,70 or Older,115,F,Black/African American,Not Span/Hispanic,12,Emergency,Home w/ Home Health Services,2019,RSP010,ASPIRATION PNEUMONITIS,CAR024,VENOUS AND ARTERIAL CATHETER PLACEMENT,137,MAJOR RESPIRATORY INFECTIONS & INFLAMMATIONS,04,DISEASES AND DISORDERS OF THE RESPIRATORY SYSTEM,4,Extreme,Major,Medical,Medicare,Medicare,Blue Cross/Blue Shield,,,true,136798.5,28277.59
Long Island,Nassau,2908000,000511,NYU Langone Hospital-Long Island,70 or Older,113,M,White,Not Span/Hispanic,8,Emergency,Home w/ Home Health Services,2019,RSP010,ASPIRATION PNEUMONITIS,RES005,CHEST TUBE PLACEMENT AND THERAPEUTIC THORACENTESIS,137,MAJOR RESPIRATORY INFECTIONS & INFLAMMATIONS,04,DISEASES AND DISORDERS OF THE RESPIRATORY SYSTEM,3,Major,Major,Medical,Medicare,Medicare,,,,true,89930.33,17923.53
Long Island,Nassau,2908000,000511,NYU Langone Hospital-Long Island,50 to 69,115,M,Other Race,Spanish/Hispanic,1,Emergency,Skilled Nursing Home,2019,RSP010,ASPIRATION PNEUMONITIS,GIS017,GASTROSTOMY,137,MAJOR RESPIRATORY INFECTIONS & INFLAMMATIONS,04,DISEASES AND DISORDERS OF THE RESPIRATORY SYSTEM,3,Major,Major,Medical,Medicaid,,,,,true,60235.47,7803.35
Long Island,Nassau,2908000,000511,NYU Langone Hospital-Long Island,70 or Older,110,M,White,Not Span/Hispanic,7,Emergency,Home or Self Care,2019,RSP010,ASPIRATION PNEUMONITIS,,,137,MAJOR RESPIRATORY INFECTIONS & INFLAMMATIONS,04,DISEASES AND DISORDERS OF THE RESPIRATORY SYSTEM,3,Major,Major,Medical,Private Health Insurance,Medicare,,,,true,63843.38,13808.33
Long Island,Nassau,2908000,000511,NYU Langone Hospital-Long Island,50 to 69,115,M,Black/African American,Not Span/Hispanic,10,Emergency,Left Against Medical Advice,2019,RSP010,ASPIRATION PNEUMONITIS,ESA003,MECHANICAL VENTILATION,137,MAJOR RESPIRATORY INFECTIONS & INFLAMMATIONS,04,DISEASES AND DISORDERS OF THE RESPIRATORY SYSTEM,4,Extreme,Extreme,Medical,Medicare,Medicare,,,,true,189863.6,33034.77
Long Island,Nassau,2908000,000511,NYU Langone Hospital-Long Island,70 or Older,115,F,White,Not Span/Hispanic,8,Emergency,Expired,2019,RSP011,"PLEURISY, PLEURAL EFFUSION AND PULMONARY COLLAPSE",RES005,CHEST TUBE PLACEMENT AND THERAPEUTIC THORACENTESIS,137,MAJOR RESPIRATORY INFECTIONS & INFLAMMATIONS,04,DISEASES AND DISORDERS OF THE RESPIRATORY SYSTEM,4,Extreme,Extreme,Medical,Medicare,Medicare,Private Health Insurance,,,true,97145.72,18736.39
Long Island,Nassau,2908000,000511,NYU Langone Hospital-Long Island,70 or Older,117,F,White,Spanish/Hispanic,5,Emergency,Home or Self Care,2019,RSP010,ASPIRATION PNEUMONITIS,,,137,MAJOR RESPIRATORY INFECTIONS & INFLAMMATIONS,04,DISEASES AND DISORDERS OF THE RESPIRATORY SYSTEM,3,Major,Moderate,Medical,Medicare,Medicare,Private Health Insurance,,,true,69069.06,12405.95
Long Island,Nassau,2908000,000511,NYU Langone Hospital-Long Island,70 or Older,115,M,White,Not Span/Hispanic,9,Emergency,Hospice - Home,2019,RSP010,ASPIRATION PNEUMONITIS,,,137,MAJOR RESPIRATORY INFECTIONS & INFLAMMATIONS,04,DISEASES AND DISORDERS OF THE RESPIRATORY SYSTEM,3,Major,Major,Medical,Medicare,Medicare,Private Health Insurance,,,true,101721.22,19911.87
Long Island,Nassau,2908000,000511,NYU Langone Hospital-Long Island,70 or Older,117,F,White,Not Span/Hispanic,4,Emergency,Home w/ Home Health Services,2019,RSP010,ASPIRATION PNEUMONITIS,GIS004,GI SYSTEM ENDOSCOPY WITHOUT BIOPSY (DIAGNOSTIC),137,MAJOR RESPIRATORY INFECTIONS & INFLAMMATIONS,04,DISEASES AND DISORDERS OF THE RESPIRATORY SYSTEM,2,Moderate,Moderate,Medical,Medicare,Medicare,Blue Cross/Blue Shield,,,true,54412,9846.55
Long Island,Nassau,2908000,000511,NYU Langone Hospital-Long Island,50 to 69,115,M,Black/African American,Not Span/Hispanic,45,Emergency,Home or Self Care,2019,INF001,TUBERCULOSIS,OTR004,ISOLATION PROCEDURES,137,MAJOR RESPIRATORY INFECTIONS & INFLAMMATIONS,04,DISEASES AND DISORDERS OF THE RESPIRATORY SYSTEM,2,Moderate,Minor,Medical,Blue Cross/Blue Shield,,,,,true,316284.88,79382.25
Long Island,Nassau,2908000,000511,NYU Langone Hospital-Long Island,70 or Older,115,M,White,Not Span/Hispanic,3,Emergency,Home w/ Home Health Services,2019,RSP010,ASPIRATION PNEUMONITIS,,,137,MAJOR RESPIRATORY INFECTIONS & INFLAMMATIONS,04,DISEASES AND DISORDERS OF THE RESPIRATORY SYSTEM,3,Major,Major,Medical,Medicare,Medicare,Blue Cross/Blue Shield,,,true,66550.67,11112.46
Long Island,Nassau,2908000,000511,NYU Langone Hospital-Long Island,30 to 49,117,F,Other Race,Not Span/Hispanic,14,Emergency,Home or Self Care,2019,INF001,TUBERCULOSIS,OTR004,ISOLATION PROCEDURES,137,MAJOR RESPIRATORY INFECTIONS & INFLAMMATIONS,04,DISEASES AND DISORDERS OF THE RESPIRATORY SYSTEM,1,Minor,Minor,Medical,Blue Cross/Blue Shield,,,,,true,94295.96,24569.01
Long Island,Nassau,2908000,000511,NYU Langone Hospital-Long Island,70 or Older,115,M,White,Not Span/Hispanic,10,Emergency,Expired,2019,RSP010,ASPIRATION PNEUMONITIS,,,137,MAJOR RESPIRATORY INFECTIONS & INFLAMMATIONS,04,DISEASES AND DISORDERS OF THE RESPIRATORY SYSTEM,4,Extreme,Extreme,Medical,Medicare,Medicare,Blue Cross/Blue Shield,,,true,124094.53,23302.83
Long Island,Nassau,2908000,000511,NYU Langone Hospital-Long Island,70 or Older,115,M,White,Not Span/Hispanic,8,Emergency,Skilled Nursing Home,2019,RSP010,ASPIRATION PNEUMONITIS,OTR004,ISOLATION PROCEDURES,137,MAJOR RESPIRATORY INFECTIONS & INFLAMMATIONS,04,DISEASES AND DISORDERS OF THE RESPIRATORY SYSTEM,3,Major,Major,Medical,Medicare,Medicare,Private Health Insurance,,,true,82639.63,17006.05
Long Island,Nassau,2908000,000511,NYU Langone Hospital-Long Island,0 to 17,115,F,Black/African American,Not Span/Hispanic,11,Emergency,Home w/ Home Health Services,2019,RSP010,ASPIRATION PNEUMONITIS,ESA004,NON-INVASIVE VENTILATION,137,MAJOR RESPIRATORY INFECTIONS & INFLAMMATIONS,04,DISEASES AND DISORDERS OF THE RESPIRATORY SYSTEM,4,Extreme,Major,Medical,Private Health Insurance,Medicaid,,,,true,112873.38,24334.54
Long Island,Nassau,2908000,000511,NYU Langone Hospital-Long Island,70 or Older,115,M,White,Not Span/Hispanic,10,Emergency,Home or Self Care,2019,RSP002,PNEUMONIA (EXCEPT THAT CAUSED BY TUBERCULOSIS),,,137,MAJOR RESPIRATORY INFECTIONS & INFLAMMATIONS,04,DISEASES AND DISORDERS OF THE RESPIRATORY SYSTEM,4,Extreme,Major,Medical,Medicare,Medicare,Private Health Insurance,,,true,150406.77,25869.67
Long Island,Nassau,2908000,000511,NYU Langone Hospital-Long Island,70 or Older,117,F,White,Not Span/Hispanic,5,Emergency,Skilled Nursing Home,2019,RSP010,ASPIRATION PNEUMONITIS,,,137,MAJOR RESPIRATORY INFECTIONS & INFLAMMATIONS,04,DISEASES AND DISORDERS OF THE RESPIRATORY SYSTEM,2,Moderate,Moderate,Medical,Medicare,Medicare,Private Health Insurance,,,true,58090.9,11458.41
Long Island,Nassau,2908000,000511,NYU Langone Hospital-Long Island,50 to 69,113,F,White,Not Span/Hispanic,3,Emergency,Home w/ Home Health Services,2019,RSP002,PNEUMONIA (EXCEPT THAT CAUSED BY TUBERCULOSIS),,,137,MAJOR RESPIRATORY INFECTIONS & INFLAMMATIONS,04,DISEASES AND DISORDERS OF THE RESPIRATORY SYSTEM,4,Extreme,Major,Medical,Private Health Insurance,,,,,true,45612.91,7767.29
Long Island,Nassau,2908000,000511,NYU Langone Hospital-Long Island,50 to 69,115,F,White,Spanish/Hispanic,8,Emergency,Home or Self Care,2019,INF001,TUBERCULOSIS,OTR004,ISOLATION PROCEDURES,137,MAJOR RESPIRATORY INFECTIONS & INFLAMMATIONS,04,DISEASES AND DISORDERS OF THE RESPIRATORY SYSTEM,1,Minor,Minor,Medical,Blue Cross/Blue Shield,,,,,true,67563.35,15435.9
Long Island,Nassau,2908000,000511,NYU Langone Hospital-Long Island,70 or Older,115,F,White,Not Span/Hispanic,29,Emergency,Skilled Nursing Home,2019,RSP002,PNEUMONIA (EXCEPT THAT CAUSED BY TUBERCULOSIS),ESA004,NON-INVASIVE VENTILATION,137,MAJOR RESPIRATORY INFECTIONS & INFLAMMATIONS,04,DISEASES AND DISORDERS OF THE RESPIRATORY SYSTEM,4,Extreme,Extreme,Medical,Medicare,Medicare,,,,true,317424.24,63141.55
Long Island,Nassau,2908000,000511,NYU Langone Hospital-Long Island,0 to 17,,F,Black/African American,Not Span/Hispanic,8,Emergency,Home w/ Home Health Services,2019,RSP010,ASPIRATION PNEUMONITIS,ESA004,NON-INVASIVE VENTILATION,137,MAJOR RESPIRATORY INFECTIONS & INFLAMMATIONS,04,DISEASES AND DISORDERS OF THE RESPIRATORY SYSTEM,4,Extreme,Major,Medical,Medicaid,Medicaid,,,,true,101858.66,20883.7
Long Island,Nassau,2908000,000511,NYU Langone Hospital-Long Island,50 to 69,115,M,White,Spanish/Hispanic,7,Emergency,Home or Self Care,2019,INF001,TUBERCULOSIS,OTR004,ISOLATION PROCEDURES,137,MAJOR RESPIRATORY INFECTIONS & INFLAMMATIONS,04,DISEASES AND DISORDERS OF THE RESPIRATORY SYSTEM,2,Moderate,Minor,Medical,Private Health Insurance,,,,,true,71923.98,14431.79
Long Island,Nassau,2908000,000511,NYU Langone Hospital-Long Island,50 to 69,110,M,White,Not Span/Hispanic,2,Emergency,Home or Self Care,2019,RSP002,PNEUMONIA (EXCEPT THAT CAUSED BY TUBERCULOSIS),ESA001,HEMODIALYSIS,137,MAJOR RESPIRATORY INFECTIONS & INFLAMMATIONS,04,DISEASES AND DISORDERS OF THE RESPIRATORY SYSTEM,3,Major,Major,Medical,Medicare,Medicare,Private Health Insurance,,,true,52087.87,6928.36
Long Island,Nassau,2908000,000511,NYU Langone Hospital-Long Island,70 or Older,117,M,White,Not Span/Hispanic,26,Emergency,Home w/ Home Health Services,2019,RSP010,ASPIRATION PNEUMONITIS,GIS017,GASTROSTOMY,137,MAJOR RESPIRATORY INFECTIONS & INFLAMMATIONS,04,DISEASES AND DISORDERS OF THE RESPIRATORY SYSTEM,4,Extreme,Extreme,Medical,Medicare,Medicare,Private Health Insurance,,,true,345995.37,67826.11
Long Island,Nassau,2908000,000511,NYU Langone Hospital-Long Island,70 or Older,111,F,White,Not Span/Hispanic,15,Emergency,Skilled Nursing Home,2019,RSP010,ASPIRATION PNEUMONITIS,OTR004,ISOLATION PROCEDURES,137,MAJOR RESPIRATORY INFECTIONS & INFLAMMATIONS,04,DISEASES AND DISORDERS OF THE RESPIRATORY SYSTEM,4,Extreme,Major,Medical,Medicare,Medicaid,Medicare,,,true,136965.21,29898.88
Long Island,Nassau,2908000,000511,NYU Langone Hospital-Long Island,70 or Older,115,M,White,Not Span/Hispanic,5,Emergency,Skilled Nursing Home,2019,RSP010,ASPIRATION PNEUMONITIS,,,137,MAJOR RESPIRATORY INFECTIONS & INFLAMMATIONS,04,DISEASES AND DISORDERS OF THE RESPIRATORY SYSTEM,4,Extreme,Extreme,Medical,Medicare,Medicare,Medicaid,,,true,73050.16,12551.58
Long Island,Nassau,2908000,000511,NYU Langone Hospital-Long Island,70 or Older,110,F,White,Not Span/Hispanic,7,Emergency,Inpatient Rehabilitation Facility,2019,RSP010,ASPIRATION PNEUMONITIS,,,137,MAJOR RESPIRATORY INFECTIONS & INFLAMMATIONS,04,DISEASES AND DISORDERS OF THE RESPIRATORY SYSTEM,3,Major,Major,Medical,Medicare,Medicare,Private Health Insurance,,,true,75480.95,15416.88
Long Island,Nassau,2908000,000511,NYU Langone Hospital-Long Island,70 or Older,115,F,White,Not Span/Hispanic,11,Emergency,Hospice - Home,2019,RSP010,ASPIRATION PNEUMONITIS,IMG008,ULTRASONOGRAPHY,137,MAJOR RESPIRATORY INFECTIONS & INFLAMMATIONS,04,DISEASES AND DISORDERS OF THE RESPIRATORY SYSTEM,4,Extreme,Extreme,Medical,Medicare,Medicare,Private Health Insurance,,,true,121936.98,25265.14
Long Island,Nassau,2908000,000511,NYU Langone Hospital-Long Island,0 to 17,115,M,Black/African American,Not Span/Hispanic,2,Emergency,Home or Self Care,2019,RSP010,ASPIRATION PNEUMONITIS,,,137,MAJOR RESPIRATORY INFECTIONS & INFLAMMATIONS,04,DISEASES AND DISORDERS OF THE RESPIRATORY SYSTEM,3,Major,Moderate,Medical,Blue Cross/Blue Shield,Medicaid,,,,true,26432.85,4967.28
Long Island,Nassau,2908000,000511,NYU Langone Hospital-Long Island,70 or Older,115,M,White,Not Span/Hispanic,1,Emergency,Expired,2019,RSP010,ASPIRATION PNEUMONITIS,,,137,MAJOR RESPIRATORY INFECTIONS & INFLAMMATIONS,04,DISEASES AND DISORDERS OF THE RESPIRATORY SYSTEM,4,Extreme,Extreme,Medical,Medicare,Medicare,Blue Cross/Blue Shield,,,true,36000.05,4776.66
Long Island,Nassau,2908000,000511,NYU Langone Hospital-Long Island,70 or Older,112,M,White,Not Span/Hispanic,8,Emergency,Skilled Nursing Home,2019,RSP010,ASPIRATION PNEUMONITIS,RAD001,BEAM RADIATION,137,MAJOR RESPIRATORY INFECTIONS & INFLAMMATIONS,04,DISEASES AND DISORDERS OF THE RESPIRATORY SYSTEM,3,Major,Major,Medical,Blue Cross/Blue Shield,Medicare,Medicare,,,true,137533.53,20242.13
Long Island,Nassau,2908000,000511,NYU Langone Hospital-Long Island,70 or Older,117,M,White,Not Span/Hispanic,4,Emergency,Hospice - Medical Facility,2019,RSP010,ASPIRATION PNEUMONITIS,,,137,MAJOR RESPIRATORY INFECTIONS & INFLAMMATIONS,04,DISEASES AND DISORDERS OF THE RESPIRATORY SYSTEM,4,Extreme,Extreme,Medical,Medicare,Medicare,Private Health Insurance,,,true,84328.24,11774.67
Long Island,Nassau,2908000,000511,NYU Langone Hospital-Long Island,70 or Older,115,F,Black/African American,Not Span/Hispanic,7,Emergency,Home or Self Care,2019,RSP002,PNEUMONIA (EXCEPT THAT CAUSED BY TUBERCULOSIS),,,137,MAJOR RESPIRATORY INFECTIONS & INFLAMMATIONS,04,DISEASES AND DISORDERS OF THE RESPIRATORY SYSTEM,2,Moderate,Moderate,Medical,Medicare,Medicare,Blue Cross/Blue Shield,,,true,80331.45,15961.18
Long Island,Nassau,2908000,000511,NYU Langone Hospital-Long Island,70 or Older,117,M,White,Not Span/Hispanic,2,Emergency,Expired,2019,RSP010,ASPIRATION PNEUMONITIS,ESA003,MECHANICAL VENTILATION,137,MAJOR RESPIRATORY INFECTIONS & INFLAMMATIONS,04,DISEASES AND DISORDERS OF THE RESPIRATORY SYSTEM,4,Extreme,Extreme,Medical,Medicare,Medicare,Private Health Insurance,,,true,76687.58,10631
Long Island,Nassau,2908000,000511,NYU Langone Hospital-Long Island,70 or Older,115,F,Black/African American,Not Span/Hispanic,8,Emergency,Home w/ Home Health Services,2019,RSP002,PNEUMONIA (EXCEPT THAT CAUSED BY TUBERCULOSIS),ESA004,NON-INVASIVE VENTILATION,137,MAJOR RESPIRATORY INFECTIONS & INFLAMMATIONS,04,DISEASES AND DISORDERS OF THE RESPIRATORY SYSTEM,3,Major,Major,Medical,Medicare,Medicare,Private Health Insurance,,,true,102663.46,18893.5
Long Island,Nassau,2908000,000511,NYU Langone Hospital-Long Island,70 or Older,115,M,White,Not Span/Hispanic,9,Emergency,Home w/ Home Health Services,2019,RSP011,"PLEURISY, PLEURAL EFFUSION AND PULMONARY COLLAPSE",RES005,CHEST TUBE PLACEMENT AND THERAPEUTIC THORACENTESIS,137,MAJOR RESPIRATORY INFECTIONS & INFLAMMATIONS,04,DISEASES AND DISORDERS OF THE RESPIRATORY SYSTEM,3,Major,Moderate,Medical,Medicare,Medicare,Private Health Insurance,,,true,108343.83,20447.72
Long Island,Nassau,2908000,000511,NYU Langone Hospital-Long Island,50 to 69,117,M,White,Not Span/Hispanic,2,Emergency,Home or Self Care,2019,RSP010,ASPIRATION PNEUMONITIS,,,137,MAJOR RESPIRATORY INFECTIONS & INFLAMMATIONS,04,DISEASES AND DISORDERS OF THE RESPIRATORY SYSTEM,2,Moderate,Moderate,Medical,Private Health Insurance,,,,,true,44377.27,5799.58
Long Island,Nassau,2908000,000511,NYU Langone Hospital-Long Island,70 or Older,117,M,White,Not Span/Hispanic,22,Emergency,Skilled Nursing Home,2019,RSP002,PNEUMONIA (EXCEPT THAT CAUSED BY TUBERCULOSIS),ESA004,NON-INVASIVE VENTILATION,137,MAJOR RESPIRATORY INFECTIONS & INFLAMMATIONS,04,DISEASES AND DISORDERS OF THE RESPIRATORY SYSTEM,4,Extreme,Extreme,Medical,Medicare,Medicare,Blue Cross/Blue Shield,,,true,300443.72,53996.06
Long Island,Nassau,2908000,000511,NYU Langone Hospital-Long Island,70 or Older,117,M,White,Not Span/Hispanic,7,Emergency,Skilled Nursing Home,2019,RSP010,ASPIRATION PNEUMONITIS,GIS017,GASTROSTOMY,137,MAJOR RESPIRATORY INFECTIONS & INFLAMMATIONS,04,DISEASES AND DISORDERS OF THE RESPIRATORY SYSTEM,4,Extreme,Major,Medical,Medicare,Medicare,Blue Cross/Blue Shield,,,true,89738.89,16989.78
Long Island,Nassau,2908000,000511,NYU Langone Hospital-Long Island,70 or Older,117,M,White,Not Span/Hispanic,5,Emergency,Home w/ Home Health Services,2019,RSP010,ASPIRATION PNEUMONITIS,,,137,MAJOR RESPIRATORY INFECTIONS & INFLAMMATIONS,04,DISEASES AND DISORDERS OF THE RESPIRATORY SYSTEM,3,Major,Major,Medical,Medicare,Medicare,Blue Cross/Blue Shield,,,true,57155.39,11809.21
Long Island,Nassau,2908000,000511,NYU Langone Hospital-Long Island,70 or Older,115,M,White,Not Span/Hispanic,4,Emergency,Home w/ Home Health Services,2019,RSP010,ASPIRATION PNEUMONITIS,,,137,MAJOR RESPIRATORY INFECTIONS & INFLAMMATIONS,04,DISEASES AND DISORDERS OF THE RESPIRATORY SYSTEM,3,Major,Major,Medical,Medicare,Medicare,,,,true,50141.03,9414.51
Long Island,Nassau,2908000,000511,NYU Langone Hospital-Long Island,50 to 69,115,M,White,Not Span/Hispanic,2,Emergency,Home or Self Care,2019,RSP010,ASPIRATION PNEUMONITIS,,,137,MAJOR RESPIRATORY INFECTIONS & INFLAMMATIONS,04,DISEASES AND DISORDERS OF THE RESPIRATORY SYSTEM,2,Moderate,Moderate,Medical,Medicare,Medicare,Medicaid,,,true,44065.53,6843.08
Long Island,Nassau,2908000,000511,NYU Langone Hospital-Long Island,70 or Older,118,M,White,Not Span/Hispanic,6,Emergency,Home w/ Home Health Services,2019,RSP002,PNEUMONIA (EXCEPT THAT CAUSED BY TUBERCULOSIS),MAM004,CARDIAC STRESS TESTS,137,MAJOR RESPIRATORY INFECTIONS & INFLAMMATIONS,04,DISEASES AND DISORDERS OF THE RESPIRATORY SYSTEM,4,Extreme,Extreme,Medical,Medicare,Medicare,Blue Cross/Blue Shield,,,true,123224.33,18205.74
Long Island,Nassau,2908000,000511,NYU Langone Hospital-Long Island,30 to 49,115,M,White,Not Span/Hispanic,4,Emergency,Home or Self Care,2019,CIR028,GANGRENE,OTR004,ISOLATION PROCEDURES,137,MAJOR RESPIRATORY INFECTIONS & INFLAMMATIONS,04,DISEASES AND DISORDERS OF THE RESPIRATORY SYSTEM,2,Moderate,Minor,Medical,Federal/State/Local/VA,,,,,true,70219.46,11194.84
Long Island,Nassau,2908000,000511,NYU Langone Hospital-Long Island,0 to 17,115,F,White,Spanish/Hispanic,22,Emergency,Home or Self Care,2019,INF001,TUBERCULOSIS,OTR004,ISOLATION PROCEDURES,137,MAJOR RESPIRATORY INFECTIONS & INFLAMMATIONS,04,DISEASES AND DISORDERS OF THE RESPIRATORY SYSTEM,2,Moderate,Minor,Medical,Medicaid,Medicaid,,,,true,155543.84,38945.46
Long Island,Nassau,2908000,000511,NYU Langone Hospital-Long Island,70 or Older,117,M,White,Not Span/Hispanic,1,Emergency,Expired,2019,RSP010,ASPIRATION PNEUMONITIS,,,137,MAJOR RESPIRATORY INFECTIONS & INFLAMMATIONS,04,DISEASES AND DISORDERS OF THE RESPIRATORY SYSTEM,4,Extreme,Extreme,Medical,Medicare,Medicare,Private Health Insurance,,,true,27105.16,4128.14
Long Island,Nassau,2908000,000511,NYU Langone Hospital-Long Island,50 to 69,117,F,White,Not Span/Hispanic,4,Emergency,Home or Self Care,2019,RSP010,ASPIRATION PNEUMONITIS,,,137,MAJOR RESPIRATORY INFECTIONS & INFLAMMATIONS,04,DISEASES AND DISORDERS OF THE RESPIRATORY SYSTEM,2,Moderate,Moderate,Medical,Medicaid,,,,,true,54656.7,9796.94
Long Island,Nassau,2908000,000511,NYU Langone Hospital-Long Island,70 or Older,115,F,Other Race,Not Span/Hispanic,13,Emergency,Home w/ Home Health Services,2019,RSP010,ASPIRATION PNEUMONITIS,GIS001,ESOPHAGOGASTRODUODENOSCOPY (EGD) WITH BIOPSY,137,MAJOR RESPIRATORY INFECTIONS & INFLAMMATIONS,04,DISEASES AND DISORDERS OF THE RESPIRATORY SYSTEM,3,Major,Major,Medical,Medicare,Medicare,Blue Cross/Blue Shield,,,true,153856.97,29113.85
Long Island,Nassau,2908000,000511,NYU Langone Hospital-Long Island,50 to 69,115,M,White,Not Span/Hispanic,7,Emergency,Skilled Nursing Home,2019,RSP010,ASPIRATION PNEUMONITIS,SUD001,SUBSTANCE USE DETOXIFICATION,137,MAJOR RESPIRATORY INFECTIONS & INFLAMMATIONS,04,DISEASES AND DISORDERS OF THE RESPIRATORY SYSTEM,3,Major,Moderate,Medical,Medicaid,Medicaid,,,,true,97895.52,18040.85
Long Island,Nassau,2908000,000511,NYU Langone Hospital-Long Island,70 or Older,115,F,White,Not Span/Hispanic,11,Emergency,Home w/ Home Health Services,2019,RSP010,ASPIRATION PNEUMONITIS,RES007,AIRWAY INTUBATION,137,MAJOR RESPIRATORY INFECTIONS & INFLAMMATIONS,04,DISEASES AND DISORDERS OF THE RESPIRATORY SYSTEM,4,Extreme,Extreme,Medical,Medicare,Medicare,,,,true,140944.75,27742.97
Long Island,Nassau,2908000,000511,NYU Langone Hospital-Long Island,70 or Older,115,M,White,Not Span/Hispanic,3,Emergency,Home or Self Care,2019,RSP002,PNEUMONIA (EXCEPT THAT CAUSED BY TUBERCULOSIS),,,137,MAJOR RESPIRATORY INFECTIONS & INFLAMMATIONS,04,DISEASES AND DISORDERS OF THE RESPIRATORY SYSTEM,2,Moderate,Moderate,Medical,Medicare,Medicare,Private Health Insurance,,,true,38022.08,7233.15
Long Island,Nassau,2908000,000511,NYU Langone Hospital-Long Island,50 to 69,117,F,Black/African American,Not Span/Hispanic,11,Emergency,Home w/ Home Health Services,2019,RSP010,ASPIRATION PNEUMONITIS,GIS017,GASTROSTOMY,137,MAJOR RESPIRATORY INFECTIONS & INFLAMMATIONS,04,DISEASES AND DISORDERS OF THE RESPIRATORY SYSTEM,4,Extreme,Moderate,Medical,Blue Cross/Blue Shield,,,,,true,179286.8,28075.43
Long Island,Nassau,2908000,000511,NYU Langone Hospital-Long Island,70 or Older,115,F,White,Not Span/Hispanic,5,Emergency,Expired,2019,RSP010,ASPIRATION PNEUMONITIS,,,137,MAJOR RESPIRATORY INFECTIONS & INFLAMMATIONS,04,DISEASES AND DISORDERS OF THE RESPIRATORY SYSTEM,4,Extreme,Extreme,Medical,Medicare,Medicare,Private Health Insurance,,,true,55826.71,11224.18
Long Island,Nassau,2908000,000511,NYU Langone Hospital-Long Island,70 or Older,115,M,Black/African American,Not Span/Hispanic,9,Emergency,Hospice - Home,2019,RSP010,ASPIRATION PNEUMONITIS,ADM001,TRANSFUSION OF BLOOD AND BLOOD PRODUCTS,137,MAJOR RESPIRATORY INFECTIONS & INFLAMMATIONS,04,DISEASES AND DISORDERS OF THE RESPIRATORY SYSTEM,4,Extreme,Major,Medical,Medicare,Medicare,Medicaid,,,true,94015.69,19542.84
Long Island,Nassau,2908000,000511,NYU Langone Hospital-Long Island,50 to 69,115,M,Other Race,Not Span/Hispanic,6,Emergency,Home or Self Care,2019,RSP010,ASPIRATION PNEUMONITIS,,,137,MAJOR RESPIRATORY INFECTIONS & INFLAMMATIONS,04,DISEASES AND DISORDERS OF THE RESPIRATORY SYSTEM,3,Major,Moderate,Medical,Blue Cross/Blue Shield,,,,,true,63699.61,12773.97
Long Island,Nassau,2908000,000511,NYU Langone Hospital-Long Island,50 to 69,117,M,White,Not Span/Hispanic,8,Emergency,Home w/ Home Health Services,2019,RSP010,ASPIRATION PNEUMONITIS,ESA004,NON-INVASIVE VENTILATION,137,MAJOR RESPIRATORY INFECTIONS & INFLAMMATIONS,04,DISEASES AND DISORDERS OF THE RESPIRATORY SYSTEM,3,Major,Major,Medical,Federal/State/Local/VA,,,,,true,115938.65,19025.84