Hospital Service Area,Hospital County,Operating Certificate Number,Permanent Facility Id,Facility Name,Age Group,Zip Code - 3 digits,Gender,Race,Ethnicity,Length of Stay,Type of Admission,Patient Disposition,Discharge Year,CCS Diagnosis Code,CCS Diagnosis Description,CCS Procedure Code,CCS Procedure Description,APR DRG Code,APR DRG Description,APR MDC Code,APR MDC Description,APR Severity of Illness Code,APR Severity of Illness Description,APR Risk of Mortality,APR Medical Surgical Description,Payment Typology 1,Payment Typology 2,Payment Typology 3,Birth Weight,Abortion Edit Indicator,Emergency Department Indicator,Total Charges,Total Costs
New York City,Manhattan,7002053,001463,NYU Langone Hospitals,70 or Older,OOS,M,Other Race,Not Span/Hispanic,5,Emergency,Home or Self Care,2020,RSP002,PNEUMONIA (EXCEPT THAT CAUSED BY TUBERCULOSIS),,,137,MAJOR RESPIRATORY INFECTIONS & INFLAMMATIONS,04,DISEASES AND DISORDERS OF THE RESPIRATORY SYSTEM,3,Major,Moderate,Medical,Medicare,Medicare,,,,N,74343.05,19241.99
New York City,Manhattan,7002053,001463,NYU Langone Hospitals,70 or Older,112,F,White,Not Span/Hispanic,18,Emergency,Home w/ Home Health Services,2020,RSP010,ASPIRATION PNEUMONITIS,,,137,MAJOR RESPIRATORY INFECTIONS & INFLAMMATIONS,04,DISEASES AND DISORDERS OF THE RESPIRATORY SYSTEM,4,Extreme,Major,Medical,Medicare,Medicaid,,,,Y,177154.55,59107.93
New York City,Manhattan,7002053,001463,NYU Langone Hospitals,70 or Older,100,F,Other Race,Unknown,4,Emergency,Home w/ Home Health Services,2020,RSP002,PNEUMONIA (EXCEPT THAT CAUSED BY TUBERCULOSIS),,,137,MAJOR RESPIRATORY INFECTIONS & INFLAMMATIONS,04,DISEASES AND DISORDERS OF THE RESPIRATORY SYSTEM,2,Moderate,Moderate,Medical,Medicare,Blue Cross/Blue Shield,,,,Y,47689.76,14668.74
New York City,Manhattan,7002053,001463,NYU Langone Hospitals,70 or Older,100,M,White,Not Span/Hispanic,15,Emergency,Skilled Nursing Home,2020,RSP011,"PLEURISY, PLEURAL EFFUSION AND PULMONARY COLLAPSE",RES003,THORACENTESIS (DIAGNOSTIC),137,MAJOR RESPIRATORY INFECTIONS & INFLAMMATIONS,04,DISEASES AND DISORDERS OF THE RESPIRATORY SYSTEM,4,Extreme,Extreme,Medical,Medicare,Blue Cross/Blue Shield,,,,Y,376260.16,119401.34
New York City,Manhattan,7002053,001463,NYU Langone Hospitals,70 or Older,100,F,White,Not Span/Hispanic,2,Emergency,Home w/ Home Health Services,2020,RSP010,ASPIRATION PNEUMONITIS,RES005,CHEST TUBE PLACEMENT AND THERAPEUTIC THORACENTESIS,137,MAJOR RESPIRATORY INFECTIONS & INFLAMMATIONS,04,DISEASES AND DISORDERS OF THE RESPIRATORY SYSTEM,4,Extreme,Extreme,Medical,Medicare,Blue Cross/Blue Shield,,,,Y,57099.29,11711.88
New York City,Manhattan,7002053,001463,NYU Langone Hospitals,70 or Older,100,M,Other Race,Not Span/Hispanic,5,Emergency,Home w/ Home Health Services,2020,RSP002,PNEUMONIA (EXCEPT THAT CAUSED BY TUBERCULOSIS),RES001,BRONCHOSCOPY (DIAGNOSTIC),137,MAJOR RESPIRATORY INFECTIONS & INFLAMMATIONS,04,DISEASES AND DISORDERS OF THE RESPIRATORY SYSTEM,3,Major,Major,Medical,Medicare,Medicaid,,,,Y,81487.99,23863.63
New York City,Manhattan,7002053,001463,NYU Langone Hospitals,70 or Older,OOS,F,White,Not Span/Hispanic,1,Emergency,Home or Self Care,2020,RSP010,ASPIRATION PNEUMONITIS,MAM011,ELECTROENCEPHALOGRAM (EEG),137,MAJOR RESPIRATORY INFECTIONS & INFLAMMATIONS,04,DISEASES AND DISORDERS OF THE RESPIRATORY SYSTEM,3,Major,Extreme,Medical,Medicare,Blue Cross/Blue Shield,,,,Y,40355.76,11481.76
New York City,Manhattan,7002053,001463,NYU Langone Hospitals,50 to 69,113,M,White,Not Span/Hispanic,7,Emergency,Home or Self Care,2020,RSP002,PNEUMONIA (EXCEPT THAT CAUSED BY TUBERCULOSIS),,,137,MAJOR RESPIRATORY INFECTIONS & INFLAMMATIONS,04,DISEASES AND DISORDERS OF THE RESPIRATORY SYSTEM,3,Major,Major,Medical,Private Health Insurance,Medicare,Private Health Insurance,,,N,69569.02,24779.36
New York City,Manhattan,7002053,001463,NYU Langone Hospitals,70 or Older,100,M,White,Not Span/Hispanic,11,Emergency,Home w/ Home Health Services,2020,RSP010,ASPIRATION PNEUMONITIS,,,137,MAJOR RESPIRATORY INFECTIONS & INFLAMMATIONS,04,DISEASES AND DISORDERS OF THE RESPIRATORY SYSTEM,3,Major,Extreme,Medical,Medicare,Medicare,,,,Y,140323.74,43051.16
New York City,Manhattan,7002053,001463,NYU Langone Hospitals,0 to 17,OOS,M,Other Race,Spanish/Hispanic,22,Emergency,Home w/ Home Health Services,2020,RSP010,ASPIRATION PNEUMONITIS,ESA004,NON-INVASIVE VENTILATION,137,MAJOR RESPIRATORY INFECTIONS & INFLAMMATIONS,04,DISEASES AND DISORDERS OF THE RESPIRATORY SYSTEM,4,Extreme,Major,Medical,Blue Cross/Blue Shield,Blue Cross/Blue Shield,,,,Y,509409.04,132279.76
New York City,Manhattan,7002053,001463,NYU Langone Hospitals,50 to 69,100,M,Black/African American,Not Span/Hispanic,8,Emergency,Home w/ Home Health Services,2020,RSP010,ASPIRATION PNEUMONITIS,RES001,BRONCHOSCOPY (DIAGNOSTIC),137,MAJOR RESPIRATORY INFECTIONS & INFLAMMATIONS,04,DISEASES AND DISORDERS OF THE RESPIRATORY SYSTEM,2,Moderate,Major,Medical,Medicare,Medicaid,,,,Y,110323.72,32360.72
New York City,Manhattan,7002053,001463,NYU Langone Hospitals,70 or Older,112,F,White,Not Span/Hispanic,5,Emergency,Inpatient Rehabilitation Facility,2020,RSP002,PNEUMONIA (EXCEPT THAT CAUSED BY TUBERCULOSIS),,,137,MAJOR RESPIRATORY INFECTIONS & INFLAMMATIONS,04,DISEASES AND DISORDERS OF THE RESPIRATORY SYSTEM,4,Extreme,Major,Medical,Medicare,Medicare,,,,Y,53749.08,18076.38
New York City,Manhattan,7002053,001463,NYU Langone Hospitals,70 or Older,112,F,White,Not Span/Hispanic,4,Emergency,Skilled Nursing Home,2020,RSP010,ASPIRATION PNEUMONITIS,ESA004,NON-INVASIVE VENTILATION,137,MAJOR RESPIRATORY INFECTIONS & INFLAMMATIONS,04,DISEASES AND DISORDERS OF THE RESPIRATORY SYSTEM,4,Extreme,Major,Medical,Medicare,Medicaid,,,,Y,72400.69,16457.88
New York City,Manhattan,7002053,001463,NYU Langone Hospitals,30 to 49,100,F,Other Race,Unknown,6,Emergency,Home or Self Care,2020,RSP010,ASPIRATION PNEUMONITIS,GIS006,PARACENTESIS,137,MAJOR RESPIRATORY INFECTIONS & INFLAMMATIONS,04,DISEASES AND DISORDERS OF THE RESPIRATORY SYSTEM,4,Extreme,Major,Medical,Self-Pay,,,,,Y,89264.23,20956.55
New York City,Manhattan,7002053,001463,NYU Langone Hospitals,70 or Older,100,M,White,Not Span/Hispanic,19,Emergency,Inpatient Rehabilitation Facility,2020,RSP002,PNEUMONIA (EXCEPT THAT CAUSED BY TUBERCULOSIS),RES005,CHEST TUBE PLACEMENT AND THERAPEUTIC THORACENTESIS,137,MAJOR RESPIRATORY INFECTIONS & INFLAMMATIONS,04,DISEASES AND DISORDERS OF THE RESPIRATORY SYSTEM,4,Extreme,Major,Medical,Medicare,,,,,N,391285.5,114569.56
New York City,Manhattan,7002053,001463,NYU Langone Hospitals,30 to 49,100,M,Other Race,Not Span/Hispanic,6,Emergency,Home or Self Care,2020,RSP011,"PLEURISY, PLEURAL EFFUSION AND PULMONARY COLLAPSE",RES005,CHEST TUBE PLACEMENT AND THERAPEUTIC THORACENTESIS,137,MAJOR RESPIRATORY INFECTIONS & INFLAMMATIONS,04,DISEASES AND DISORDERS OF THE RESPIRATORY SYSTEM,3,Major,Major,Medical,Blue Cross/Blue Shield,,,,,Y,232543.51,40592.25
New York City,Manhattan,7002053,001463,NYU Langone Hospitals,30 to 49,112,M,White,Not Span/Hispanic,1,Emergency,Home or Self Care,2020,RSP010,ASPIRATION PNEUMONITIS,,,137,MAJOR RESPIRATORY INFECTIONS & INFLAMMATIONS,04,DISEASES AND DISORDERS OF THE RESPIRATORY SYSTEM,3,Major,Major,Medical,Medicare,Medicaid,,,,Y,28042.41,5689.53
New York City,Manhattan,7002053,001463,NYU Langone Hospitals,70 or Older,100,M,Other Race,Not Span/Hispanic,15,Emergency,Home w/ Home Health Services,2020,RSP010,ASPIRATION PNEUMONITIS,CAR024,VENOUS AND ARTERIAL CATHETER PLACEMENT,137,MAJOR RESPIRATORY INFECTIONS & INFLAMMATIONS,04,DISEASES AND DISORDERS OF THE RESPIRATORY SYSTEM,3,Major,Major,Medical,Medicare,Medicaid,,,,Y,140363.12,50887.44
New York City,Manhattan,7002053,001463,NYU Langone Hospitals,0 to 17,112,M,White,Not Span/Hispanic,5,Emergency,Home or Self Care,2020,RSP010,ASPIRATION PNEUMONITIS,,,137,MAJOR RESPIRATORY INFECTIONS & INFLAMMATIONS,04,DISEASES AND DISORDERS OF THE RESPIRATORY SYSTEM,2,Moderate,Moderate,Medical,Medicaid,,,,,Y,48234.02,13341.24
New York City,Manhattan,7002053,001463,NYU Langone Hospitals,18 to 29,113,M,White,Not Span/Hispanic,7,Emergency,Home w/ Home Health Services,2020,RSP010,ASPIRATION PNEUMONITIS,ADM017,ADMINISTRATION OF NUTRITIONAL AND ELECTROLYTIC SUBSTANCES,137,MAJOR RESPIRATORY INFECTIONS & INFLAMMATIONS,04,DISEASES AND DISORDERS OF THE RESPIRATORY SYSTEM,3,Major,Major,Medical,Blue Cross/Blue Shield,,,,,N,156437.21,43958.47
New York City,Manhattan,7002053,001463,NYU Langone Hospitals,70 or Older,100,F,Other Race,Unknown,4,Emergency,Home or Self Care,2020,RSP002,PNEUMONIA (EXCEPT THAT CAUSED BY TUBERCULOSIS),,,137,MAJOR RESPIRATORY INFECTIONS & INFLAMMATIONS,04,DISEASES AND DISORDERS OF THE RESPIRATORY SYSTEM,4,Extreme,Major,Medical,Medicare,Blue Cross/Blue Shield,,,,Y,45633.27,14790.6
New York City,Manhattan,7002053,001463,NYU Langone Hospitals,70 or Older,112,M,White,Not Span/Hispanic,2,Emergency,Home w/ Home Health Services,2020,RSP010,ASPIRATION PNEUMONITIS,GIS025,OTHER GI SYSTEM DEVICE PROCEDURES,137,MAJOR RESPIRATORY INFECTIONS & INFLAMMATIONS,04,DISEASES AND DISORDERS OF THE RESPIRATORY SYSTEM,4,Extreme,Extreme,Medical,Medicare,Medicaid,,,,Y,34308.89,8348.77
New York City,Manhattan,7002053,001463,NYU Langone Hospitals,50 to 69,110,F,White,Not Span/Hispanic,49,Emergency,Skilled Nursing Home,2020,RSP010,ASPIRATION PNEUMONITIS,MAM011,ELECTROENCEPHALOGRAM (EEG),137,MAJOR RESPIRATORY INFECTIONS & INFLAMMATIONS,04,DISEASES AND DISORDERS OF THE RESPIRATORY SYSTEM,4,Extreme,Extreme,Medical,Medicare,Medicaid,,,,Y,723019.13,239204.95
New York City,Manhattan,7002053,001463,NYU Langone Hospitals,70 or Older,OOS,F,White,Not Span/Hispanic,1,Emergency,Home or Self Care,2020,RSP002,PNEUMONIA (EXCEPT THAT CAUSED BY TUBERCULOSIS),,,137,MAJOR RESPIRATORY INFECTIONS & INFLAMMATIONS,04,DISEASES AND DISORDERS OF THE RESPIRATORY SYSTEM,2,Moderate,Minor,Medical,Medicare,Medicare,,,,N,16162.14,7048.01
New York City,Manhattan,7002053,001463,NYU Langone Hospitals,30 to 49,112,M,White,Not Span/Hispanic,3,Emergency,Home w/ Home Health Services,2020,RSP002,PNEUMONIA (EXCEPT THAT CAUSED BY TUBERCULOSIS),CAR024,VENOUS AND ARTERIAL CATHETER PLACEMENT,137,MAJOR RESPIRATORY INFECTIONS & INFLAMMATIONS,04,DISEASES AND DISORDERS OF THE RESPIRATORY SYSTEM,3,Major,Moderate,Medical,Blue Cross/Blue Shield,,,,,N,52072.03,13187.69
New York City,Manhattan,7002053,001463,NYU Langone Hospitals,70 or Older,100,M,White,Not Span/Hispanic,4,Emergency,Home w/ Home Health Services,2020,RSP010,ASPIRATION PNEUMONITIS,GIS017,GASTROSTOMY,137,MAJOR RESPIRATORY INFECTIONS & INFLAMMATIONS,04,DISEASES AND DISORDERS OF THE RESPIRATORY SYSTEM,3,Major,Moderate,Medical,Medicare,Medicare,,,,Y,74691.52,21307.49
New York City,Manhattan,7002053,001463,NYU Langone Hospitals,0 to 17,112,M,Other Race,Not Span/Hispanic,6,Emergency,Home or Self Care,2020,CIR028,GANGRENE,RES005,CHEST TUBE PLACEMENT AND THERAPEUTIC THORACENTESIS,137,MAJOR RESPIRATORY INFECTIONS & INFLAMMATIONS,04,DISEASES AND DISORDERS OF THE RESPIRATORY SYSTEM,4,Extreme,Major,Medical,Medicaid,,,,,Y,92350.29,21653.27
New York City,Manhattan,7002053,001463,NYU Langone Hospitals,18 to 29,112,F,Other Race,Spanish/Hispanic,2,Elective,Home w/ Home Health Services,2020,RSP010,ASPIRATION PNEUMONITIS,RES001,BRONCHOSCOPY (DIAGNOSTIC),137,MAJOR RESPIRATORY INFECTIONS & INFLAMMATIONS,04,DISEASES AND DISORDERS OF THE RESPIRATORY SYSTEM,3,Major,Moderate,Medical,Medicaid,,,,,N,71199.84,15878.02
New York City,Manhattan,7002053,001463,NYU Langone Hospitals,70 or Older,100,M,Other Race,Not Span/Hispanic,4,Emergency,Home w/ Home Health Services,2020,RSP002,PNEUMONIA (EXCEPT THAT CAUSED BY TUBERCULOSIS),ESA001,HEMODIALYSIS,137,MAJOR RESPIRATORY INFECTIONS & INFLAMMATIONS,04,DISEASES AND DISORDERS OF THE RESPIRATORY SYSTEM,4,Extreme,Extreme,Medical,Medicare,Medicare,,,,Y,69362.21,18315.91
New York City,Manhattan,7002053,001463,NYU Langone Hospitals,50 to 69,100,M,White,Not Span/Hispanic,10,Emergency,Expired,2020,RSP002,PNEUMONIA (EXCEPT THAT CAUSED BY TUBERCULOSIS),,,137,MAJOR RESPIRATORY INFECTIONS & INFLAMMATIONS,04,DISEASES AND DISORDERS OF THE RESPIRATORY SYSTEM,4,Extreme,Extreme,Medical,Medicare,Medicare,,,,N,167874.72,44921.88
New York City,Manhattan,7002053,001463,NYU Langone Hospitals,70 or Older,100,M,White,Not Span/Hispanic,4,Emergency,Skilled Nursing Home,2020,RSP010,ASPIRATION PNEUMONITIS,ESA004,NON-INVASIVE VENTILATION,137,MAJOR RESPIRATORY INFECTIONS & INFLAMMATIONS,04,DISEASES AND DISORDERS OF THE RESPIRATORY SYSTEM,4,Extreme,Extreme,Medical,Medicare,Medicaid,,,,Y,70164.79,17238.41
New York City,Manhattan,7002053,001463,NYU Langone Hospitals,70 or Older,100,F,White,Not Span/Hispanic,12,Emergency,Skilled Nursing Home,2020,RSP002,PNEUMONIA (EXCEPT THAT CAUSED BY TUBERCULOSIS),,,137,MAJOR RESPIRATORY INFECTIONS & INFLAMMATIONS,04,DISEASES AND DISORDERS OF THE RESPIRATORY SYSTEM,2,Moderate,Moderate,Medical,Medicare,,,,,Y,132748.44,41447.18
New York City,Manhattan,7002053,001463,NYU Langone Hospitals,70 or Older,100,M,White,Not Span/Hispanic,11,Emergency,Inpatient Rehabilitation Facility,2020,RSP011,"PLEURISY, PLEURAL EFFUSION AND PULMONARY COLLAPSE",RES006,OPEN AND THORACOSCOPIC PLEURAL DRAINAGE,137,MAJOR RESPIRATORY INFECTIONS & INFLAMMATIONS,04,DISEASES AND DISORDERS OF THE RESPIRATORY SYSTEM,3,Major,Major,Medical,Private Health Insurance,Medicare,,,,Y,204308.92,50907.88
New York City,Manhattan,7002053,001463,NYU Langone Hospitals,30 to 49,112,M,Other Race,Unknown,4,Emergency,Home or Self Care,2020,INF001,TUBERCULOSIS,,,137,MAJOR RESPIRATORY INFECTIONS & INFLAMMATIONS,04,DISEASES AND DISORDERS OF THE RESPIRATORY SYSTEM,2,Moderate,Minor,Medical,Private Health Insurance,,,,,Y,37144.05,13900.97
New York City,Manhattan,7002053,001463,NYU Langone Hospitals,70 or Older,101,M,White,Not Span/Hispanic,4,Emergency,Home w/ Home Health Services,2020,RSP010,ASPIRATION PNEUMONITIS,,,137,MAJOR RESPIRATORY INFECTIONS & INFLAMMATIONS,04,DISEASES AND DISORDERS OF THE RESPIRATORY SYSTEM,4,Extreme,Extreme,Medical,Medicare,Private Health Insurance,,,,Y,55117.14,15809.32
New York City,Manhattan,7002053,001463,NYU Langone Hospitals,70 or Older,114,F,White,Not Span/Hispanic,5,Emergency,Skilled Nursing Home,2020,RSP016,OTHER SPECIFIED AND UNSPECIFIED LOWER RESPIRATORY DISEASE,CAR024,VENOUS AND ARTERIAL CATHETER PLACEMENT,137,MAJOR RESPIRATORY INFECTIONS & INFLAMMATIONS,04,DISEASES AND DISORDERS OF THE RESPIRATORY SYSTEM,2,Moderate,Minor,Medical,Medicare,Medicaid,,,,Y,55161.48,17841.38
New York City,Manhattan,7002053,001463,NYU Langone Hospitals,70 or Older,115,M,White,Not Span/Hispanic,8,Emergency,Skilled Nursing Home,2020,RSP010,ASPIRATION PNEUMONITIS,ADM017,ADMINISTRATION OF NUTRITIONAL AND ELECTROLYTIC SUBSTANCES,137,MAJOR RESPIRATORY INFECTIONS & INFLAMMATIONS,04,DISEASES AND DISORDERS OF THE RESPIRATORY SYSTEM,3,Major,Major,Medical,Medicare,Medicare,,,,Y,95742.56,29924.4
New York City,Manhattan,7002053,001463,NYU Langone Hospitals,70 or Older,101,F,White,Not Span/Hispanic,6,Elective,Home w/ Home Health Services,2020,RSP010,ASPIRATION PNEUMONITIS,,,137,MAJOR RESPIRATORY INFECTIONS & INFLAMMATIONS,04,DISEASES AND DISORDERS OF THE RESPIRATORY SYSTEM,4,Extreme,Extreme,Medical,Medicare,Medicare,,,,N,90310.06,23807.16
New York City,Manhattan,7002053,001463,NYU Langone Hospitals,70 or Older,100,M,White,Not Span/Hispanic,2,Emergency,Hospice - Home,2020,RSP010,ASPIRATION PNEUMONITIS,,,137,MAJOR RESPIRATORY INFECTIONS & INFLAMMATIONS,04,DISEASES AND DISORDERS OF THE RESPIRATORY SYSTEM,3,Major,Moderate,Medical,Medicare,Blue Cross/Blue Shield,,,,Y,36693.74,8549.32
New York City,Manhattan,7002053,001463,NYU Langone Hospitals,18 to 29,104,M,Other Race,Not Span/Hispanic,12,Emergency,Home or Self Care,2020,RSP002,PNEUMONIA (EXCEPT THAT CAUSED BY TUBERCULOSIS),RES002,"LUNG, PLEURA, OR DIAPHRAGM BIOPSY (NON-ENDOSCOPIC)",137,MAJOR RESPIRATORY INFECTIONS & INFLAMMATIONS,04,DISEASES AND DISORDERS OF THE RESPIRATORY SYSTEM,3,Major,Major,Medical,Medicaid,,,,,Y,177497.36,45057.6
New York City,Manhattan,7002053,001463,NYU Langone Hospitals,18 to 29,104,M,Other Race,Not Span/Hispanic,4,Emergency,Home or Self Care,2020,RSP002,PNEUMONIA (EXCEPT THAT CAUSED BY TUBERCULOSIS),,,137,MAJOR RESPIRATORY INFECTIONS & INFLAMMATIONS,04,DISEASES AND DISORDERS OF THE RESPIRATORY SYSTEM,3,Major,Moderate,Medical,Medicaid,,,,,Y,51128.24,14706.36
New York City,Manhattan,7002053,001463,NYU Langone Hospitals,50 to 69,112,F,Other Race,Spanish/Hispanic,23,Emergency,Inpatient Rehabilitation Facility,2020,RSP011,"PLEURISY, PLEURAL EFFUSION AND PULMONARY COLLAPSE",RES012,RELEASE OF LUNG AND PLEURA,137,MAJOR RESPIRATORY INFECTIONS & INFLAMMATIONS,04,DISEASES AND DISORDERS OF THE RESPIRATORY SYSTEM,4,Extreme,Extreme,Medical,Medicaid,,,,,N,611204.03,134506.27
New York City,Manhattan,7002053,001463,NYU Langone Hospitals,70 or Older,100,F,Other Race,Not Span/Hispanic,1,Emergency,Home w/ Home Health Services,2020,RSP010,ASPIRATION PNEUMONITIS,,,137,MAJOR RESPIRATORY INFECTIONS & INFLAMMATIONS,04,DISEASES AND DISORDERS OF THE RESPIRATORY SYSTEM,2,Moderate,Moderate,Medical,Medicare,,,,,Y,33751.18,8468.52
New York City,Manhattan,7002053,001463,NYU Langone Hospitals,70 or Older,100,F,White,Not Span/Hispanic,8,Emergency,Facility w/ Custodial/Supportive Care,2020,RSP010,ASPIRATION PNEUMONITIS,GIS025,OTHER GI SYSTEM DEVICE PROCEDURES,137,MAJOR RESPIRATORY INFECTIONS & INFLAMMATIONS,04,DISEASES AND DISORDERS OF THE RESPIRATORY SYSTEM,4,Extreme,Extreme,Medical,Medicare,,,,,Y,111650.13,29161.89
New York City,Manhattan,7002053,001463,NYU Langone Hospitals,70 or Older,100,F,White,Not Span/Hispanic,2,Emergency,Home or Self Care,2020,RSP010,ASPIRATION PNEUMONITIS,OTR004,ISOLATION PROCEDURES,137,MAJOR RESPIRATORY INFECTIONS & INFLAMMATIONS,04,DISEASES AND DISORDERS OF THE RESPIRATORY SYSTEM,2,Moderate,Moderate,Medical,Medicare,Medicare,,,,Y,29056.08,8098.01
New York City,Manhattan,7002053,001463,NYU Langone Hospitals,70 or Older,100,M,White,Not Span/Hispanic,11,Emergency,Home w/ Home Health Services,2020,RSP002,PNEUMONIA (EXCEPT THAT CAUSED BY TUBERCULOSIS),RES001,BRONCHOSCOPY (DIAGNOSTIC),137,MAJOR RESPIRATORY INFECTIONS & INFLAMMATIONS,04,DISEASES AND DISORDERS OF THE RESPIRATORY SYSTEM,4,Extreme,Extreme,Medical,Private Health Insurance,Medicare,,,,Y,193089.93,47135.58
New York City,Manhattan,7002053,001463,NYU Langone Hospitals,0 to 17,100,M,Other Race,Spanish/Hispanic,9,Elective,Home w/ Home Health Services,2020,RSP011,"PLEURISY, PLEURAL EFFUSION AND PULMONARY COLLAPSE",CAR024,VENOUS AND ARTERIAL CATHETER PLACEMENT,137,MAJOR RESPIRATORY INFECTIONS & INFLAMMATIONS,04,DISEASES AND DISORDERS OF THE RESPIRATORY SYSTEM,4,Extreme,Major,Medical,Medicaid,,,,,N,177429.3,46072.72
New York City,Manhattan,7002053,001463,NYU Langone Hospitals,30 to 49,112,F,White,Not Span/Hispanic,14,Emergency,Left Against Medical Advice,2020,RSP010,ASPIRATION PNEUMONITIS,,,137,MAJOR RESPIRATORY INFECTIONS & INFLAMMATIONS,04,DISEASES AND DISORDERS OF THE RESPIRATORY SYSTEM,4,Extreme,Major,Medical,Medicare,Medicaid,,,,Y,194713.48,52364.61
New York City,Manhattan,7002053,001463,NYU Langone Hospitals,50 to 69,113,M,Other Race,Not Span/Hispanic,5,Emergency,Home w/ Home Health Services,2020,RSP010,ASPIRATION PNEUMONITIS,,,137,MAJOR RESPIRATORY INFECTIONS & INFLAMMATIONS,04,DISEASES AND DISORDERS OF THE RESPIRATORY SYSTEM,2,Moderate,Moderate,Medical,Medicaid,,,,,Y,57751.02,18574.9
New York City,Manhattan,7002053,001463,NYU Langone Hospitals,70 or Older,104,M,White,Not Span/Hispanic,8,Elective,Short-term Hospital,2020,RSP010,ASPIRATION PNEUMONITIS,RHB002,"PHYSICAL, OCCUPATIONAL, AND RESPIRATORY THERAPY TREATMENT",137,MAJOR RESPIRATORY INFECTIONS & INFLAMMATIONS,04,DISEASES AND DISORDERS OF THE RESPIRATORY SYSTEM,3,Major,Major,Medical,Medicare,Medicare,,,,N,96387.47,28306.61
New York City,Manhattan,7002053,001463,NYU Langone Hospitals,70 or Older,100,M,White,Not Span/Hispanic,6,Emergency,Inpatient Rehabilitation Facility,2020,RSP002,PNEUMONIA (EXCEPT THAT CAUSED BY TUBERCULOSIS),ESA001,HEMODIALYSIS,137,MAJOR RESPIRATORY INFECTIONS & INFLAMMATIONS,04,DISEASES AND DISORDERS OF THE RESPIRATORY SYSTEM,3,Major,Major,Medical,Medicare,Medicaid,,,,Y,74119.64,30327.39
New York City,Manhattan,7002053,001463,NYU Langone Hospitals,70 or Older,112,F,White,Not Span/Hispanic,8,Emergency,Home w/ Home Health Services,2020,RSP002,PNEUMONIA (EXCEPT THAT CAUSED BY TUBERCULOSIS),CAR024,VENOUS AND ARTERIAL CATHETER PLACEMENT,137,MAJOR RESPIRATORY INFECTIONS & INFLAMMATIONS,04,DISEASES AND DISORDERS OF THE RESPIRATORY SYSTEM,3,Major,Major,Medical,Medicare,Medicare,,,,Y,89893.81,29720.56
New York City,Manhattan,7002053,001463,NYU Langone Hospitals,50 to 69,100,M,White,Not Span/Hispanic,2,Emergency,Home or Self Care,2020,RSP010,ASPIRATION PNEUMONITIS,OTR004,ISOLATION PROCEDURES,137,MAJOR RESPIRATORY INFECTIONS & INFLAMMATIONS,04,DISEASES AND DISORDERS OF THE RESPIRATORY SYSTEM,4,Extreme,Major,Medical,Medicare,Medicaid,,,,Y,38735.32,8238.15
New York City,Manhattan,7002053,001463,NYU Langone Hospitals,50 to 69,112,F,Black/African American,Unknown,9,Emergency,Home or Self Care,2020,RSP010,ASPIRATION PNEUMONITIS,ESA004,NON-INVASIVE VENTILATION,137,MAJOR RESPIRATORY INFECTIONS & INFLAMMATIONS,04,DISEASES AND DISORDERS OF THE RESPIRATORY SYSTEM,3,Major,Major,Medical,Medicaid,,,,,Y,136466.01,40778.65
New York City,Manhattan,7002053,001463,NYU Langone Hospitals,18 to 29,OOS,M,White,Not Span/Hispanic,10,Emergency,Home or Self Care,2020,RSP011,"PLEURISY, PLEURAL EFFUSION AND PULMONARY COLLAPSE",RES005,CHEST TUBE PLACEMENT AND THERAPEUTIC THORACENTESIS,137,MAJOR RESPIRATORY INFECTIONS & INFLAMMATIONS,04,DISEASES AND DISORDERS OF THE RESPIRATORY SYSTEM,3,Major,Minor,Medical,Private Health Insurance,,,,,Y,179917.34,38823.34
New York City,Manhattan,7002053,001463,NYU Langone Hospitals,50 to 69,100,M,White,Not Span/Hispanic,2,Emergency,Home or Self Care,2020,RSP010,ASPIRATION PNEUMONITIS,RES007,AIRWAY INTUBATION,137,MAJOR RESPIRATORY INFECTIONS & INFLAMMATIONS,04,DISEASES AND DISORDERS OF THE RESPIRATORY SYSTEM,4,Extreme,Extreme,Medical,Private Health Insurance,,,,,Y,66988.14,14676.17
New York City,Manhattan,7002053,001463,NYU Langone Hospitals,70 or Older,100,M,White,Not Span/Hispanic,9,Emergency,Skilled Nursing Home,2020,RSP010,ASPIRATION PNEUMONITIS,,,137,MAJOR RESPIRATORY INFECTIONS & INFLAMMATIONS,04,DISEASES AND DISORDERS OF THE RESPIRATORY SYSTEM,2,Moderate,Moderate,Medical,Medicare,Private Health Insurance,,,,Y,140898.11,37326.87
New York City,Manhattan,7002053,001463,NYU Langone Hospitals,70 or Older,100,M,Other Race,Not Span/Hispanic,4,Urgent,Inpatient Rehabilitation Facility,2020,RSP010,ASPIRATION PNEUMONITIS,,,137,MAJOR RESPIRATORY INFECTIONS & INFLAMMATIONS,04,DISEASES AND DISORDERS OF THE RESPIRATORY SYSTEM,3,Major,Major,Medical,Medicare,Medicaid,,,,N,50534.43,13751.57
New York City,Manhattan,7002053,001463,NYU Langone Hospitals,0 to 17,111,M,Other Race,Not Span/Hispanic,10,Emergency,Home or Self Care,2020,RSP010,ASPIRATION PNEUMONITIS,MAM015,"MEASUREMENT AND MONITORING, NEC",137,MAJOR RESPIRATORY INFECTIONS & INFLAMMATIONS,04,DISEASES AND DISORDERS OF THE RESPIRATORY SYSTEM,3,Major,Moderate,Medical,Medicaid,,,,,Y,90522.25,24587.3
New York City,Manhattan,7002053,001463,NYU Langone Hospitals,30 to 49,104,F,Black/African American,Not Span/Hispanic,3,Emergency,Home or Self Care,2020,RSP002,PNEUMONIA (EXCEPT THAT CAUSED BY TUBERCULOSIS),OTR004,ISOLATION PROCEDURES,137,MAJOR RESPIRATORY INFECTIONS & INFLAMMATIONS,04,DISEASES AND DISORDERS OF THE RESPIRATORY SYSTEM,1,Minor,Minor,Medical,Blue Cross/Blue Shield,,,,,Y,48740.88,12266.78
New York City,Manhattan,7002053,001463,NYU Langone Hospitals,70 or Older,104,M,White,Not Span/Hispanic,7,Emergency,Inpatient Rehabilitation Facility,2020,RSP010,ASPIRATION PNEUMONITIS,ESA004,NON-INVASIVE VENTILATION,137,MAJOR RESPIRATORY INFECTIONS & INFLAMMATIONS,04,DISEASES AND DISORDERS OF THE RESPIRATORY SYSTEM,3,Major,Major,Medical,Medicare,Medicare,,,,Y,119390.11,35003.37