Hospital Service Area,Hospital County,Operating Certificate Number,Permanent Facility Id,Facility Name,Age Group,Zip Code - 3 digits,Gender,Race,Ethnicity,Length of Stay,Type of Admission,Patient Disposition,Discharge Year,CCS Diagnosis Code,CCS Diagnosis Description,CCS Procedure Code,CCS Procedure Description,APR DRG Code,APR DRG Description,APR MDC Code,APR MDC Description,APR Severity of Illness Code,APR Severity of Illness Description,APR Risk of Mortality,APR Medical Surgical Description,Payment Typology 1,Payment Typology 2,Payment Typology 3,Birth Weight,Abortion Edit Indicator,Emergency Department Indicator,Total Charges,Total Costs
Hudson Valley,Sullivan,5263000,000971,Catskill Regional Medical Center,0 to 17,127,F,White,Not Span/Hispanic,2,Emergency,Home or Self Care,2017,125,Acute bronchitis,000,NO PROC,138,Bronchiolitis & RSV pneumonia,04,Diseases and Disorders of the Respiratory System,1,Minor,Minor,Medical,Blue Cross/Blue Shield,,,,N,Y,11148.97,3240.32
New York City,Manhattan,7002024,001456,Mount Sinai Hospital,0 to 17,100,M,Other Race,Not Span/Hispanic,2,Urgent,Home or Self Care,2017,125,Acute bronchitis,000,NO PROC,138,Bronchiolitis & RSV pneumonia,04,Diseases and Disorders of the Respiratory System,2,Moderate,Minor,Medical,Medicaid,Medicaid,Self-Pay,,N,N,14229.24,11285.29
New York City,Manhattan,7002024,001456,Mount Sinai Hospital,0 to 17,104,M,Other Race,Not Span/Hispanic,2,Urgent,Home or Self Care,2017,125,Acute bronchitis,000,NO PROC,138,Bronchiolitis & RSV pneumonia,04,Diseases and Disorders of the Respiratory System,2,Moderate,Moderate,Medical,Private Health Insurance,Self-Pay,,,N,N,13051.98,10714.96
New York City,Manhattan,7002024,001456,Mount Sinai Hospital,0 to 17,100,M,Other Race,Not Span/Hispanic,10,Emergency,Home or Self Care,2017,125,Acute bronchitis,216,RESP INTUB/MECH VENTIL,138,Bronchiolitis & RSV pneumonia,04,Diseases and Disorders of the Respiratory System,3,Major,Moderate,Medical,Medicaid,Medicaid,Self-Pay,,N,Y,100638.43,49914.91
New York City,Manhattan,7002024,001456,Mount Sinai Hospital,70 or Older,100,F,White,Not Span/Hispanic,5,Emergency,Home w/ Home Health Services,2017,122,Pneumonia (except that caused by tuberculosis or sexually transmitted disease),000,NO PROC,138,Bronchiolitis & RSV pneumonia,04,Diseases and Disorders of the Respiratory System,2,Moderate,Moderate,Medical,Medicare,Private Health Insurance,Self-Pay,,N,Y,41010.50,14028.65
New York City,Manhattan,7002024,001456,Mount Sinai Hospital,0 to 17,100,M,Black/African American,Not Span/Hispanic,6,Emergency,Home or Self Care,2017,125,Acute bronchitis,000,NO PROC,138,Bronchiolitis & RSV pneumonia,04,Diseases and Disorders of the Respiratory System,2,Moderate,Minor,Medical,Medicaid,Medicaid,Self-Pay,,N,Y,54489.00,30673.59
New York City,Manhattan,7002024,001456,Mount Sinai Hospital,0 to 17,111,F,Other Race,Not Span/Hispanic,2,Emergency,Home or Self Care,2017,125,Acute bronchitis,000,NO PROC,138,Bronchiolitis & RSV pneumonia,04,Diseases and Disorders of the Respiratory System,2,Moderate,Minor,Medical,Private Health Insurance,Self-Pay,,,N,Y,23896.54,9831.87
New York City,Manhattan,7002032,001469,Mount Sinai St. Luke's,50 to 69,100,F,Black/African American,Spanish/Hispanic,2,Emergency,Home w/ Home Health Services,2017,125,Acute bronchitis,231,OTHER THERAPEUTIC PRCS,138,Bronchiolitis & RSV pneumonia,04,Diseases and Disorders of the Respiratory System,2,Moderate,Moderate,Medical,Medicare,Medicaid,Self-Pay,,N,Y,20198.35,6334.81
New York City,Bronx,7000006,001168,Montefiore Medical Center-Wakefield Hospital,0 to 17,104,M,Other Race,Spanish/Hispanic,8,Emergency,Home or Self Care,2017,125,Acute bronchitis,217,OTHER RESP THERAPY,138,Bronchiolitis & RSV pneumonia,04,Diseases and Disorders of the Respiratory System,3,Major,Moderate,Medical,Medicaid,,,,N,Y,61189.70,18410.78
New York City,Bronx,7000006,001168,Montefiore Medical Center-Wakefield Hospital,0 to 17,,F,Multi-racial,Not Span/Hispanic,2,Emergency,Home or Self Care,2017,125,Acute bronchitis,041,OT NON-OR THER PRC RESP,138,Bronchiolitis & RSV pneumonia,04,Diseases and Disorders of the Respiratory System,2,Moderate,Minor,Medical,Medicaid,,,,N,Y,19305.42,5406.98
New York City,Bronx,7000006,001168,Montefiore Medical Center-Wakefield Hospital,0 to 17,104,M,Other Race,Not Span/Hispanic,1,Emergency,Home or Self Care,2017,125,Acute bronchitis,041,OT NON-OR THER PRC RESP,138,Bronchiolitis & RSV pneumonia,04,Diseases and Disorders of the Respiratory System,1,Minor,Minor,Medical,Medicaid,,,,N,Y,13837.23,3580.12
New York City,Bronx,7000006,001168,Montefiore Medical Center-Wakefield Hospital,0 to 17,104,M,Black/African American,Not Span/Hispanic,2,Emergency,Home or Self Care,2017,125,Acute bronchitis,041,OT NON-OR THER PRC RESP,138,Bronchiolitis & RSV pneumonia,04,Diseases and Disorders of the Respiratory System,1,Minor,Minor,Medical,Medicaid,,,,N,Y,20114.52,5784.52
New York City,Bronx,7000006,001168,Montefiore Medical Center-Wakefield Hospital,0 to 17,104,F,Black/African American,Not Span/Hispanic,1,Emergency,Home or Self Care,2017,122,Pneumonia (except that caused by tuberculosis or sexually transmitted disease),231,OTHER THERAPEUTIC PRCS,138,Bronchiolitis & RSV pneumonia,04,Diseases and Disorders of the Respiratory System,2,Moderate,Minor,Medical,Medicaid,,,,N,Y,8073.59,1434.37
New York City,Bronx,7000006,001168,Montefiore Medical Center-Wakefield Hospital,0 to 17,104,M,Other Race,Spanish/Hispanic,1,Emergency,Home or Self Care,2017,122,Pneumonia (except that caused by tuberculosis or sexually transmitted disease),231,OTHER THERAPEUTIC PRCS,138,Bronchiolitis & RSV pneumonia,04,Diseases and Disorders of the Respiratory System,2,Moderate,Minor,Medical,Private Health Insurance,,,,N,Y,5940.06,1035.85
New York City,Bronx,7000006,001168,Montefiore Medical Center-Wakefield Hospital,0 to 17,,M,Other Race,Spanish/Hispanic,1,Emergency,Home or Self Care,2017,125,Acute bronchitis,041,OT NON-OR THER PRC RESP,138,Bronchiolitis & RSV pneumonia,04,Diseases and Disorders of the Respiratory System,1,Minor,Minor,Medical,Medicaid,,,,N,Y,15840.60,3859.18
New York City,Bronx,7000006,001169,Montefiore Medical Center - Henry & Lucy Moses Div,70 or Older,104,F,Other Race,Spanish/Hispanic,13,Emergency,Home w/ Home Health Services,2017,122,Pneumonia (except that caused by tuberculosis or sexually transmitted disease),041,OT NON-OR THER PRC RESP,138,Bronchiolitis & RSV pneumonia,04,Diseases and Disorders of the Respiratory System,3,Major,Major,Medical,Medicare,Medicaid,,,N,Y,114875.54,25045.17
New York City,Bronx,7000006,001169,Montefiore Medical Center - Henry & Lucy Moses Div,0 to 17,104,F,Other Race,Not Span/Hispanic,4,Emergency,Home or Self Care,2017,125,Acute bronchitis,216,RESP INTUB/MECH VENTIL,138,Bronchiolitis & RSV pneumonia,04,Diseases and Disorders of the Respiratory System,3,Major,Moderate,Medical,Medicaid,,,,N,N,30435.50,9559.72
New York City,Bronx,7000006,001169,Montefiore Medical Center - Henry & Lucy Moses Div,0 to 17,104,M,Other Race,Not Span/Hispanic,3,Emergency,Home or Self Care,2017,125,Acute bronchitis,217,OTHER RESP THERAPY,138,Bronchiolitis & RSV pneumonia,04,Diseases and Disorders of the Respiratory System,3,Major,Moderate,Medical,Medicaid,,,,N,Y,21655.39,5943.81
New York City,Bronx,7000006,001169,Montefiore Medical Center - Henry & Lucy Moses Div,50 to 69,104,F,Black/African American,Not Span/Hispanic,4,Emergency,Home w/ Home Health Services,2017,122,Pneumonia (except that caused by tuberculosis or sexually transmitted disease),231,OTHER THERAPEUTIC PRCS,138,Bronchiolitis & RSV pneumonia,04,Diseases and Disorders of the Respiratory System,2,Moderate,Moderate,Medical,Private Health Insurance,,,,N,Y,35847.09,7548.02
New York City,Bronx,7000006,001169,Montefiore Medical Center - Henry & Lucy Moses Div,0 to 17,104,M,Other Race,Spanish/Hispanic,3,Emergency,Home or Self Care,2017,125,Acute bronchitis,217,OTHER RESP THERAPY,138,Bronchiolitis & RSV pneumonia,04,Diseases and Disorders of the Respiratory System,3,Major,Moderate,Medical,Medicaid,,,,N,Y,35227.82,8777.25
New York City,Bronx,7000006,001169,Montefiore Medical Center - Henry & Lucy Moses Div,50 to 69,104,F,Black/African American,Not Span/Hispanic,5,Emergency,Home or Self Care,2017,125,Acute bronchitis,231,OTHER THERAPEUTIC PRCS,138,Bronchiolitis & RSV pneumonia,04,Diseases and Disorders of the Respiratory System,3,Major,Moderate,Medical,Private Health Insurance,,,,N,Y,62414.93,12660.31
New York City,Bronx,7000006,001169,Montefiore Medical Center - Henry & Lucy Moses Div,50 to 69,104,F,White,Not Span/Hispanic,4,Emergency,Home w/ Home Health Services,2017,007,Viral infection,000,NO PROC,138,Bronchiolitis & RSV pneumonia,04,Diseases and Disorders of the Respiratory System,2,Moderate,Minor,Medical,Medicaid,,,,N,Y,43624.13,8614.99
New York City,Bronx,7000006,001169,Montefiore Medical Center - Henry & Lucy Moses Div,0 to 17,104,M,Black/African American,Not Span/Hispanic,8,Emergency,Home or Self Care,2017,125,Acute bronchitis,041,OT NON-OR THER PRC RESP,138,Bronchiolitis & RSV pneumonia,04,Diseases and Disorders of the Respiratory System,3,Major,Moderate,Medical,Medicaid,,,,N,Y,94857.68,26077.53
New York City,Bronx,7000006,001169,Montefiore Medical Center - Henry & Lucy Moses Div,0 to 17,104,F,Other Race,Not Span/Hispanic,7,Emergency,Home or Self Care,2017,125,Acute bronchitis,041,OT NON-OR THER PRC RESP,138,Bronchiolitis & RSV pneumonia,04,Diseases and Disorders of the Respiratory System,3,Major,Minor,Medical,Private Health Insurance,,,03200,N,Y,54391.40,16731.64
New York City,Bronx,7000006,001169,Montefiore Medical Center - Henry & Lucy Moses Div,0 to 17,104,M,Other Race,Spanish/Hispanic,2,Emergency,Home or Self Care,2017,125,Acute bronchitis,231,OTHER THERAPEUTIC PRCS,138,Bronchiolitis & RSV pneumonia,04,Diseases and Disorders of the Respiratory System,1,Minor,Minor,Medical,Medicaid,,,,N,Y,19915.39,5487.60
New York City,Bronx,7000006,001169,Montefiore Medical Center - Henry & Lucy Moses Div,0 to 17,104,M,Other Race,Not Span/Hispanic,3,Emergency,Home or Self Care,2017,125,Acute bronchitis,041,OT NON-OR THER PRC RESP,138,Bronchiolitis & RSV pneumonia,04,Diseases and Disorders of the Respiratory System,3,Major,Moderate,Medical,Medicaid,,,,N,Y,24553.55,6753.70
New York City,Bronx,7000006,001169,Montefiore Medical Center - Henry & Lucy Moses Div,0 to 17,104,M,Other Race,Not Span/Hispanic,1,Emergency,Home or Self Care,2017,125,Acute bronchitis,041,OT NON-OR THER PRC RESP,138,Bronchiolitis & RSV pneumonia,04,Diseases and Disorders of the Respiratory System,2,Moderate,Minor,Medical,Medicaid,,,,N,Y,14909.78,3735.39
New York City,Bronx,7000006,001169,Montefiore Medical Center - Henry & Lucy Moses Div,0 to 17,104,M,Other Race,Not Span/Hispanic,3,Emergency,Home or Self Care,2017,125,Acute bronchitis,041,OT NON-OR THER PRC RESP,138,Bronchiolitis & RSV pneumonia,04,Diseases and Disorders of the Respiratory System,3,Major,Moderate,Medical,Medicaid,,,,N,Y,29724.82,8829.10
New York City,Bronx,7000006,001169,Montefiore Medical Center - Henry & Lucy Moses Div,0 to 17,104,M,Other Race,Spanish/Hispanic,1,Emergency,Home or Self Care,2017,122,Pneumonia (except that caused by tuberculosis or sexually transmitted disease),231,OTHER THERAPEUTIC PRCS,138,Bronchiolitis & RSV pneumonia,04,Diseases and Disorders of the Respiratory System,2,Moderate,Minor,Medical,Medicaid,,,,N,Y,12686.20,3101.86
New York City,Bronx,7000006,001169,Montefiore Medical Center - Henry & Lucy Moses Div,0 to 17,104,M,Other Race,Spanish/Hispanic,2,Emergency,Home or Self Care,2017,125,Acute bronchitis,041,OT NON-OR THER PRC RESP,138,Bronchiolitis & RSV pneumonia,04,Diseases and Disorders of the Respiratory System,2,Moderate,Minor,Medical,Private Health Insurance,,,,N,Y,19655.45,5807.90
New York City,Bronx,7000006,001169,Montefiore Medical Center - Henry & Lucy Moses Div,0 to 17,104,M,Other Race,Spanish/Hispanic,7,Emergency,Home or Self Care,2017,125,Acute bronchitis,041,OT NON-OR THER PRC RESP,138,Bronchiolitis & RSV pneumonia,04,Diseases and Disorders of the Respiratory System,2,Moderate,Minor,Medical,Medicaid,,,,N,Y,60149.46,17197.31
New York City,Bronx,7000006,001169,Montefiore Medical Center - Henry & Lucy Moses Div,0 to 17,104,M,White,Spanish/Hispanic,3,Emergency,Home or Self Care,2017,125,Acute bronchitis,041,OT NON-OR THER PRC RESP,138,Bronchiolitis & RSV pneumonia,04,Diseases and Disorders of the Respiratory System,3,Major,Moderate,Medical,Medicaid,,,,N,Y,29724.43,8623.65
Finger Lakes,Livingston,2527000,000393,Nicholas H Noyes Memorial Hospital,0 to 17,,M,White,Not Span/Hispanic,1,Emergency,Home or Self Care,2017,125,Acute bronchitis,000,NO PROC,138,Bronchiolitis & RSV pneumonia,04,Diseases and Disorders of the Respiratory System,1,Minor,Minor,Medical,Medicaid,,,,N,Y,2545.58,1714.85
New York City,Bronx,7000006,001169,Montefiore Medical Center - Henry & Lucy Moses Div,0 to 17,104,M,Other Race,Spanish/Hispanic,1,Emergency,Home or Self Care,2017,125,Acute bronchitis,041,OT NON-OR THER PRC RESP,138,Bronchiolitis & RSV pneumonia,04,Diseases and Disorders of the Respiratory System,2,Moderate,Minor,Medical,Medicaid,,,,N,Y,10721.70,2825.31
New York City,Bronx,7000006,001169,Montefiore Medical Center - Henry & Lucy Moses Div,0 to 17,104,F,Other Race,Not Span/Hispanic,2,Emergency,Home or Self Care,2017,125,Acute bronchitis,041,OT NON-OR THER PRC RESP,138,Bronchiolitis & RSV pneumonia,04,Diseases and Disorders of the Respiratory System,2,Moderate,Minor,Medical,Medicaid,,,03700,N,Y,17933.40,5128.80
New York City,Bronx,7000006,001169,Montefiore Medical Center - Henry & Lucy Moses Div,0 to 17,104,M,Black/African American,Not Span/Hispanic,1,Emergency,Home or Self Care,2017,122,Pneumonia (except that caused by tuberculosis or sexually transmitted disease),227,"OT DX PRC (INTERVW,EVAL",138,Bronchiolitis & RSV pneumonia,04,Diseases and Disorders of the Respiratory System,2,Moderate,Minor,Medical,Medicaid,,,,N,Y,13003.70,3274.11
New York City,Bronx,7000006,001169,Montefiore Medical Center - Henry & Lucy Moses Div,0 to 17,104,F,Other Race,Spanish/Hispanic,4,Emergency,Home or Self Care,2017,125,Acute bronchitis,041,OT NON-OR THER PRC RESP,138,Bronchiolitis & RSV pneumonia,04,Diseases and Disorders of the Respiratory System,2,Moderate,Minor,Medical,Medicaid,,,,N,Y,42046.61,11823.79
New York City,Bronx,7000006,001169,Montefiore Medical Center - Henry & Lucy Moses Div,0 to 17,104,F,Black/African American,Not Span/Hispanic,3,Emergency,Home or Self Care,2017,125,Acute bronchitis,041,OT NON-OR THER PRC RESP,138,Bronchiolitis & RSV pneumonia,04,Diseases and Disorders of the Respiratory System,3,Major,Moderate,Medical,Medicaid,,,,N,Y,56805.77,14197.61
New York City,Bronx,7000006,001169,Montefiore Medical Center - Henry & Lucy Moses Div,0 to 17,112,F,Other Race,Spanish/Hispanic,1,Emergency,Home or Self Care,2017,125,Acute bronchitis,000,NO PROC,138,Bronchiolitis & RSV pneumonia,04,Diseases and Disorders of the Respiratory System,1,Minor,Minor,Medical,Medicaid,,,,N,Y,11078.42,2851.74
New York City,Bronx,7000006,001169,Montefiore Medical Center - Henry & Lucy Moses Div,0 to 17,104,M,Other Race,Not Span/Hispanic,2,Emergency,Home or Self Care,2017,125,Acute bronchitis,008,OT NON-OR THER NERV SYS,138,Bronchiolitis & RSV pneumonia,04,Diseases and Disorders of the Respiratory System,1,Minor,Minor,Medical,Medicaid,,,,N,Y,23422.54,5785.77
New York City,Bronx,7000006,001169,Montefiore Medical Center - Henry & Lucy Moses Div,0 to 17,104,F,Other Race,Spanish/Hispanic,1,Emergency,Home or Self Care,2017,125,Acute bronchitis,231,OTHER THERAPEUTIC PRCS,138,Bronchiolitis & RSV pneumonia,04,Diseases and Disorders of the Respiratory System,1,Minor,Minor,Medical,Medicaid,,,,N,Y,12777.89,3177.32
New York City,Bronx,7000006,001169,Montefiore Medical Center - Henry & Lucy Moses Div,0 to 17,104,F,Other Race,Not Span/Hispanic,1,Emergency,Home or Self Care,2017,125,Acute bronchitis,041,OT NON-OR THER PRC RESP,138,Bronchiolitis & RSV pneumonia,04,Diseases and Disorders of the Respiratory System,1,Minor,Minor,Medical,Private Health Insurance,,,,N,Y,10019.36,2781.94
New York City,Bronx,7000006,001169,Montefiore Medical Center - Henry & Lucy Moses Div,0 to 17,104,M,Other Race,Not Span/Hispanic,2,Emergency,Home or Self Care,2017,122,Pneumonia (except that caused by tuberculosis or sexually transmitted disease),217,OTHER RESP THERAPY,138,Bronchiolitis & RSV pneumonia,04,Diseases and Disorders of the Respiratory System,4,Extreme,Major,Medical,Medicaid,,,,N,Y,30317.86,6798.50
New York City,Bronx,7000006,001169,Montefiore Medical Center - Henry & Lucy Moses Div,0 to 17,104,M,Other Race,Spanish/Hispanic,3,Emergency,Home or Self Care,2017,125,Acute bronchitis,041,OT NON-OR THER PRC RESP,138,Bronchiolitis & RSV pneumonia,04,Diseases and Disorders of the Respiratory System,3,Major,Moderate,Medical,Medicaid,,,,N,Y,33990.62,8161.49
New York City,Bronx,7000006,001169,Montefiore Medical Center - Henry & Lucy Moses Div,0 to 17,104,F,Black/African American,Not Span/Hispanic,2,Emergency,Home or Self Care,2017,125,Acute bronchitis,041,OT NON-OR THER PRC RESP,138,Bronchiolitis & RSV pneumonia,04,Diseases and Disorders of the Respiratory System,3,Major,Moderate,Medical,Medicaid,,,,N,Y,18480.55,5340.01
New York City,Bronx,7000006,001169,Montefiore Medical Center - Henry & Lucy Moses Div,0 to 17,104,M,Black/African American,Not Span/Hispanic,1,Emergency,Home or Self Care,2017,125,Acute bronchitis,041,OT NON-OR THER PRC RESP,138,Bronchiolitis & RSV pneumonia,04,Diseases and Disorders of the Respiratory System,1,Minor,Minor,Medical,Blue Cross/Blue Shield,,,,N,Y,13824.59,3449.28
New York City,Bronx,7000006,001169,Montefiore Medical Center - Henry & Lucy Moses Div,0 to 17,107,F,Other Race,Not Span/Hispanic,1,Emergency,Home or Self Care,2017,125,Acute bronchitis,041,OT NON-OR THER PRC RESP,138,Bronchiolitis & RSV pneumonia,04,Diseases and Disorders of the Respiratory System,1,Minor,Minor,Medical,Medicaid,,,,N,Y,11506.21,2993.44
New York City,Bronx,7000006,003058,Montefiore Med Center - Jack D Weiler Hosp of A Einstein College Div,30 to 49,104,F,Other Race,Spanish/Hispanic,9,Emergency,Home or Self Care,2017,125,Acute bronchitis,000,NO PROC,138,Bronchiolitis & RSV pneumonia,04,Diseases and Disorders of the Respiratory System,3,Major,Major,Medical,Medicare,Medicaid,,,N,Y,104276.92,20468.71
New York City,Bronx,7000006,003058,Montefiore Med Center - Jack D Weiler Hosp of A Einstein College Div,70 or Older,104,F,Other Race,Spanish/Hispanic,7,Emergency,Home w/ Home Health Services,2017,122,Pneumonia (except that caused by tuberculosis or sexually transmitted disease),231,OTHER THERAPEUTIC PRCS,138,Bronchiolitis & RSV pneumonia,04,Diseases and Disorders of the Respiratory System,2,Moderate,Moderate,Medical,Medicare,Medicaid,,,N,Y,57823.02,12437.47
New York City,Bronx,7000006,003058,Montefiore Med Center - Jack D Weiler Hosp of A Einstein College Div,0 to 17,104,F,Other Race,Not Span/Hispanic,2,Emergency,Home or Self Care,2017,125,Acute bronchitis,231,OTHER THERAPEUTIC PRCS,138,Bronchiolitis & RSV pneumonia,04,Diseases and Disorders of the Respiratory System,1,Minor,Minor,Medical,Medicaid,,,,N,Y,22738.56,6271.95
New York City,Bronx,7000006,003058,Montefiore Med Center - Jack D Weiler Hosp of A Einstein College Div,0 to 17,104,F,Other Race,Not Span/Hispanic,2,Emergency,Home or Self Care,2017,125,Acute bronchitis,041,OT NON-OR THER PRC RESP,138,Bronchiolitis & RSV pneumonia,04,Diseases and Disorders of the Respiratory System,2,Moderate,Minor,Medical,Medicaid,,,03100,N,Y,19892.82,5753.56
New York City,Bronx,7000006,003058,Montefiore Med Center - Jack D Weiler Hosp of A Einstein College Div,70 or Older,104,F,Other Race,Spanish/Hispanic,2,Emergency,Home w/ Home Health Services,2017,122,Pneumonia (except that caused by tuberculosis or sexually transmitted disease),041,OT NON-OR THER PRC RESP,138,Bronchiolitis & RSV pneumonia,04,Diseases and Disorders of the Respiratory System,2,Moderate,Major,Medical,Medicare,,,,N,Y,16191.09,2958.69
New York City,Manhattan,7002002,001439,Mount Sinai Beth Israel,0 to 17,100,M,Other Race,Not Span/Hispanic,2,Urgent,Home or Self Care,2017,125,Acute bronchitis,212,DX PHYSICAL THERAPY,138,Bronchiolitis & RSV pneumonia,04,Diseases and Disorders of the Respiratory System,1,Minor,Minor,Medical,Medicaid,Medicaid,Self-Pay,,N,N,12000.00,9146.93
New York City,Manhattan,7002002,001439,Mount Sinai Beth Israel,0 to 17,100,M,Other Race,Not Span/Hispanic,1,Urgent,Home or Self Care,2017,125,Acute bronchitis,041,OT NON-OR THER PRC RESP,138,Bronchiolitis & RSV pneumonia,04,Diseases and Disorders of the Respiratory System,2,Moderate,Minor,Medical,Medicaid,Medicaid,Self-Pay,,N,N,6006.20,4575.91
New York City,Manhattan,7002024,001456,Mount Sinai Hospital,0 to 17,104,M,Black/African American,Not Span/Hispanic,12,Urgent,Home or Self Care,2017,125,Acute bronchitis,000,NO PROC,138,Bronchiolitis & RSV pneumonia,04,Diseases and Disorders of the Respiratory System,3,Major,Moderate,Medical,Medicaid,Medicaid,Self-Pay,,N,N,114105.91,58190.09
New York City,Manhattan,7002024,001456,Mount Sinai Hospital,0 to 17,113,F,Other Race,Not Span/Hispanic,5,Urgent,Home or Self Care,2017,125,Acute bronchitis,216,RESP INTUB/MECH VENTIL,138,Bronchiolitis & RSV pneumonia,04,Diseases and Disorders of the Respiratory System,4,Extreme,Major,Medical,Medicaid,Medicaid,Self-Pay,,N,N,50746.04,24054.68
New York City,Manhattan,7002024,001456,Mount Sinai Hospital,70 or Older,100,F,White,Not Span/Hispanic,9,Emergency,Inpatient Rehabilitation Facility,2017,122,Pneumonia (except that caused by tuberculosis or sexually transmitted disease),000,NO PROC,138,Bronchiolitis & RSV pneumonia,04,Diseases and Disorders of the Respiratory System,4,Extreme,Extreme,Medical,Medicare,Self-Pay,,,N,Y,71504.90,24567.44
New York City,Manhattan,7002024,001456,Mount Sinai Hospital,0 to 17,104,F,Other Race,Not Span/Hispanic,6,Emergency,Home or Self Care,2017,125,Acute bronchitis,004,DIAGNOSTIC SPINAL TAP,138,Bronchiolitis & RSV pneumonia,04,Diseases and Disorders of the Respiratory System,2,Moderate,Minor,Medical,Medicaid,Medicaid,Self-Pay,03300,N,Y,50315.53,31482.24
New York City,Manhattan,7002024,001456,Mount Sinai Hospital,0 to 17,112,M,White,Not Span/Hispanic,2,Emergency,Home or Self Care,2017,125,Acute bronchitis,000,NO PROC,138,Bronchiolitis & RSV pneumonia,04,Diseases and Disorders of the Respiratory System,1,Minor,Minor,Medical,Private Health Insurance,Self-Pay,,,N,Y,14941.92,11357.78
New York City,Manhattan,7002024,001456,Mount Sinai Hospital,0 to 17,107,M,White,Not Span/Hispanic,3,Emergency,Home or Self Care,2017,125,Acute bronchitis,000,NO PROC,138,Bronchiolitis & RSV pneumonia,04,Diseases and Disorders of the Respiratory System,1,Minor,Minor,Medical,Private Health Insurance,Self-Pay,,,N,Y,29725.70,14868.36
New York City,Manhattan,7002024,001456,Mount Sinai Hospital,70 or Older,100,M,White,Not Span/Hispanic,4,Emergency,Home w/ Home Health Services,2017,122,Pneumonia (except that caused by tuberculosis or sexually transmitted disease),054,OT VASC CATH; NOT HEART,138,Bronchiolitis & RSV pneumonia,04,Diseases and Disorders of the Respiratory System,4,Extreme,Extreme,Medical,Medicare,Private Health Insurance,Self-Pay,,N,Y,60491.89,12241.70
New York City,Manhattan,7002024,001456,Mount Sinai Hospital,0 to 17,100,F,Other Race,Not Span/Hispanic,2,Emergency,Home or Self Care,2017,125,Acute bronchitis,000,NO PROC,138,Bronchiolitis & RSV pneumonia,04,Diseases and Disorders of the Respiratory System,2,Moderate,Minor,Medical,Medicaid,Medicaid,Self-Pay,,N,Y,15954.68,11474.49
New York City,Manhattan,7002032,001466,Mount Sinai West,70 or Older,100,F,Black/African American,Not Span/Hispanic,2,Emergency,Home or Self Care,2017,122,Pneumonia (except that caused by tuberculosis or sexually transmitted disease),231,OTHER THERAPEUTIC PRCS,138,Bronchiolitis & RSV pneumonia,04,Diseases and Disorders of the Respiratory System,2,Moderate,Minor,Medical,Medicare,Self-Pay,,,N,Y,21254.49,5562.94