Hospital Service Area,Hospital County,Operating Certificate Number,Permanent Facility Id,Facility Name,Age Group,Zip Code - 3 digits,Gender,Race,Ethnicity,Length of Stay,Type of Admission,Patient Disposition,Discharge Year,CCS Diagnosis Code,CCS Diagnosis Description,CCS Procedure Code,CCS Procedure Description,APR DRG Code,APR DRG Description,APR MDC Code,APR MDC Description,APR Severity of Illness Code,APR Severity of Illness Description,APR Risk of Mortality,APR Medical Surgical Description,Payment Typology 1,Payment Typology 2,Payment Typology 3,Birth Weight,Abortion Edit Indicator,Emergency Department Indicator,Total Charges,Total Costs
New York City,Kings,7002053,001304,NYU Langone Hospital-Brooklyn,0 to 17,112,M,Black/African American,Not Span/Hispanic,3,Emergency,Home or Self Care,2017,125,Acute bronchitis,000,NO PROC,138,Bronchiolitis & RSV pneumonia,04,Diseases and Disorders of the Respiratory System,1,Minor,Minor,Medical,Private Health Insurance,,,,N,Y,13849.00,6187.40
New York City,Kings,7002053,001304,NYU Langone Hospital-Brooklyn,0 to 17,112,M,Other Race,Unknown,2,Emergency,Home or Self Care,2017,125,Acute bronchitis,231,OTHER THERAPEUTIC PRCS,138,Bronchiolitis & RSV pneumonia,04,Diseases and Disorders of the Respiratory System,1,Minor,Minor,Medical,Private Health Insurance,,,,N,Y,14301.00,6226.52
New York City,Kings,7002053,001304,NYU Langone Hospital-Brooklyn,0 to 17,112,M,Other Race,Not Span/Hispanic,2,Emergency,Home or Self Care,2017,125,Acute bronchitis,000,NO PROC,138,Bronchiolitis & RSV pneumonia,04,Diseases and Disorders of the Respiratory System,1,Minor,Minor,Medical,Medicaid,,,,N,Y,10201.00,3989.22
New York City,Kings,7002053,001304,NYU Langone Hospital-Brooklyn,0 to 17,112,M,Other Race,Not Span/Hispanic,3,Emergency,Home or Self Care,2017,125,Acute bronchitis,041,OT NON-OR THER PRC RESP,138,Bronchiolitis & RSV pneumonia,04,Diseases and Disorders of the Respiratory System,1,Minor,Minor,Medical,Medicaid,,,,N,Y,27793.41,13235.72
New York City,Kings,7002053,001304,NYU Langone Hospital-Brooklyn,0 to 17,103,F,Other Race,Not Span/Hispanic,1,Emergency,Home or Self Care,2017,125,Acute bronchitis,000,NO PROC,138,Bronchiolitis & RSV pneumonia,04,Diseases and Disorders of the Respiratory System,1,Minor,Minor,Medical,Medicaid,,,,N,Y,11227.45,4183.55
New York City,Kings,7002053,001304,NYU Langone Hospital-Brooklyn,0 to 17,112,F,Other Race,Not Span/Hispanic,5,Emergency,Home or Self Care,2017,125,Acute bronchitis,041,OT NON-OR THER PRC RESP,138,Bronchiolitis & RSV pneumonia,04,Diseases and Disorders of the Respiratory System,2,Moderate,Minor,Medical,Medicaid,,,03100,N,Y,34846.76,17296.24
New York City,Kings,7002053,001304,NYU Langone Hospital-Brooklyn,0 to 17,112,F,Other Race,Not Span/Hispanic,2,Emergency,Home or Self Care,2017,125,Acute bronchitis,231,OTHER THERAPEUTIC PRCS,138,Bronchiolitis & RSV pneumonia,04,Diseases and Disorders of the Respiratory System,2,Moderate,Minor,Medical,Private Health Insurance,,,,N,Y,19116.60,7924.78
New York City,Kings,7002053,001304,NYU Langone Hospital-Brooklyn,0 to 17,112,M,Other Race,Not Span/Hispanic,3,Emergency,Home or Self Care,2017,125,Acute bronchitis,000,NO PROC,138,Bronchiolitis & RSV pneumonia,04,Diseases and Disorders of the Respiratory System,1,Minor,Minor,Medical,Medicaid,,,,N,Y,21974.35,10781.98
New York City,Kings,7002053,001304,NYU Langone Hospital-Brooklyn,0 to 17,112,M,Other Race,Unknown,3,Emergency,Home or Self Care,2017,125,Acute bronchitis,231,OTHER THERAPEUTIC PRCS,138,Bronchiolitis & RSV pneumonia,04,Diseases and Disorders of the Respiratory System,2,Moderate,Minor,Medical,Medicaid,,,02500,N,Y,21514.60,10399.00
New York City,Kings,7002053,001304,NYU Langone Hospital-Brooklyn,0 to 17,112,F,Other Race,Unknown,2,Emergency,Home or Self Care,2017,125,Acute bronchitis,231,OTHER THERAPEUTIC PRCS,138,Bronchiolitis & RSV pneumonia,04,Diseases and Disorders of the Respiratory System,1,Minor,Minor,Medical,Medicaid,,,,N,Y,20060.25,8692.82
New York City,Kings,7002053,001304,NYU Langone Hospital-Brooklyn,0 to 17,112,M,White,Not Span/Hispanic,1,Emergency,Home or Self Care,2017,125,Acute bronchitis,000,NO PROC,138,Bronchiolitis & RSV pneumonia,04,Diseases and Disorders of the Respiratory System,1,Minor,Minor,Medical,Medicaid,,,,N,Y,13672.65,5584.51
New York City,Kings,7002053,001304,NYU Langone Hospital-Brooklyn,0 to 17,112,M,Other Race,Spanish/Hispanic,3,Emergency,Home or Self Care,2017,125,Acute bronchitis,231,OTHER THERAPEUTIC PRCS,138,Bronchiolitis & RSV pneumonia,04,Diseases and Disorders of the Respiratory System,1,Minor,Minor,Medical,Medicaid,,,,N,Y,23309.55,10504.48
New York City,Kings,7002053,001304,NYU Langone Hospital-Brooklyn,0 to 17,112,F,Other Race,Not Span/Hispanic,1,Emergency,Home or Self Care,2017,125,Acute bronchitis,000,NO PROC,138,Bronchiolitis & RSV pneumonia,04,Diseases and Disorders of the Respiratory System,1,Minor,Minor,Medical,Private Health Insurance,,,,N,Y,10969.85,4161.25
New York City,Kings,7002053,001304,NYU Langone Hospital-Brooklyn,0 to 17,112,M,Other Race,Spanish/Hispanic,5,Emergency,Home or Self Care,2017,125,Acute bronchitis,231,OTHER THERAPEUTIC PRCS,138,Bronchiolitis & RSV pneumonia,04,Diseases and Disorders of the Respiratory System,1,Minor,Minor,Medical,Medicaid,,,,N,Y,34386.95,18179.79
New York City,Kings,7002053,001304,NYU Langone Hospital-Brooklyn,0 to 17,112,M,Other Race,Spanish/Hispanic,1,Emergency,Home or Self Care,2017,125,Acute bronchitis,000,NO PROC,138,Bronchiolitis & RSV pneumonia,04,Diseases and Disorders of the Respiratory System,2,Moderate,Minor,Medical,Medicaid,,,,N,Y,13062.25,5246.79
New York City,Kings,7002053,001304,NYU Langone Hospital-Brooklyn,0 to 17,112,M,Other Race,Spanish/Hispanic,2,Emergency,Home or Self Care,2017,125,Acute bronchitis,000,NO PROC,138,Bronchiolitis & RSV pneumonia,04,Diseases and Disorders of the Respiratory System,1,Minor,Minor,Medical,Medicaid,,,,N,Y,20204.09,8436.04
New York City,Kings,7002053,001304,NYU Langone Hospital-Brooklyn,0 to 17,112,F,Other Race,Spanish/Hispanic,3,Emergency,Home or Self Care,2017,125,Acute bronchitis,000,NO PROC,138,Bronchiolitis & RSV pneumonia,04,Diseases and Disorders of the Respiratory System,1,Minor,Minor,Medical,Medicaid,,,,N,Y,30424.59,13370.66
New York City,Kings,7002053,001304,NYU Langone Hospital-Brooklyn,0 to 17,112,F,Other Race,Spanish/Hispanic,2,Emergency,Home or Self Care,2017,125,Acute bronchitis,000,NO PROC,138,Bronchiolitis & RSV pneumonia,04,Diseases and Disorders of the Respiratory System,1,Minor,Minor,Medical,Medicaid,,,,N,Y,22162.92,9921.79
New York City,Kings,7002053,001304,NYU Langone Hospital-Brooklyn,0 to 17,112,M,Other Race,Spanish/Hispanic,1,Emergency,Home or Self Care,2017,125,Acute bronchitis,000,NO PROC,138,Bronchiolitis & RSV pneumonia,04,Diseases and Disorders of the Respiratory System,1,Minor,Minor,Medical,Medicaid,,,,N,Y,11435.60,4426.87
New York City,Kings,7002053,001304,NYU Langone Hospital-Brooklyn,0 to 17,112,M,White,Not Span/Hispanic,2,Emergency,Home or Self Care,2017,125,Acute bronchitis,000,NO PROC,138,Bronchiolitis & RSV pneumonia,04,Diseases and Disorders of the Respiratory System,2,Moderate,Minor,Medical,Private Health Insurance,,,,N,Y,18554.06,7905.44
New York City,Kings,7002053,001304,NYU Langone Hospital-Brooklyn,0 to 17,112,M,White,Spanish/Hispanic,1,Emergency,Home or Self Care,2017,125,Acute bronchitis,000,NO PROC,138,Bronchiolitis & RSV pneumonia,04,Diseases and Disorders of the Respiratory System,1,Minor,Minor,Medical,Medicaid,,,,N,Y,14228.55,4445.67
New York City,Kings,7002053,001304,NYU Langone Hospital-Brooklyn,0 to 17,112,F,White,Spanish/Hispanic,1,Emergency,Home or Self Care,2017,125,Acute bronchitis,000,NO PROC,138,Bronchiolitis & RSV pneumonia,04,Diseases and Disorders of the Respiratory System,1,Minor,Minor,Medical,Private Health Insurance,,,,N,Y,12108.75,5069.60
New York City,Kings,7002053,001304,NYU Langone Hospital-Brooklyn,0 to 17,112,F,White,Spanish/Hispanic,3,Emergency,Home or Self Care,2017,125,Acute bronchitis,231,OTHER THERAPEUTIC PRCS,138,Bronchiolitis & RSV pneumonia,04,Diseases and Disorders of the Respiratory System,1,Minor,Minor,Medical,Medicaid,,,,N,Y,24101.03,10550.03
New York City,Kings,7002053,001304,NYU Langone Hospital-Brooklyn,70 or Older,112,F,White,Not Span/Hispanic,1,Emergency,Home or Self Care,2017,122,Pneumonia (except that caused by tuberculosis or sexually transmitted disease),231,OTHER THERAPEUTIC PRCS,138,Bronchiolitis & RSV pneumonia,04,Diseases and Disorders of the Respiratory System,2,Moderate,Moderate,Medical,Medicare,,,,N,Y,26244.93,3806.98
New York City,Kings,7002053,001304,NYU Langone Hospital-Brooklyn,0 to 17,112,M,Other Race,Not Span/Hispanic,1,Emergency,Home or Self Care,2017,125,Acute bronchitis,231,OTHER THERAPEUTIC PRCS,138,Bronchiolitis & RSV pneumonia,04,Diseases and Disorders of the Respiratory System,1,Minor,Minor,Medical,Medicaid,,,03500,N,Y,11745.99,4354.70
New York City,Kings,7002053,001304,NYU Langone Hospital-Brooklyn,0 to 17,112,M,Other Race,Unknown,3,Emergency,Home or Self Care,2017,125,Acute bronchitis,231,OTHER THERAPEUTIC PRCS,138,Bronchiolitis & RSV pneumonia,04,Diseases and Disorders of the Respiratory System,2,Moderate,Minor,Medical,Medicaid,,,04300,N,Y,28986.09,11796.97
New York City,Kings,7002053,001304,NYU Langone Hospital-Brooklyn,0 to 17,112,F,Other Race,Not Span/Hispanic,1,Emergency,Home or Self Care,2017,125,Acute bronchitis,000,NO PROC,138,Bronchiolitis & RSV pneumonia,04,Diseases and Disorders of the Respiratory System,1,Minor,Minor,Medical,Private Health Insurance,,,,N,Y,13355.49,5311.18
New York City,Kings,7002053,001304,NYU Langone Hospital-Brooklyn,70 or Older,112,F,Black/African American,Not Span/Hispanic,4,Emergency,Home or Self Care,2017,122,Pneumonia (except that caused by tuberculosis or sexually transmitted disease),000,NO PROC,138,Bronchiolitis & RSV pneumonia,04,Diseases and Disorders of the Respiratory System,2,Moderate,Moderate,Medical,Medicare,,,,N,Y,61255.26,15309.23
New York City,Kings,7002053,001304,NYU Langone Hospital-Brooklyn,0 to 17,103,M,Other Race,Not Span/Hispanic,2,Emergency,Home or Self Care,2017,125,Acute bronchitis,041,OT NON-OR THER PRC RESP,138,Bronchiolitis & RSV pneumonia,04,Diseases and Disorders of the Respiratory System,2,Moderate,Minor,Medical,Medicaid,,,,N,Y,19252.71,9714.07
New York City,Kings,7002053,001304,NYU Langone Hospital-Brooklyn,70 or Older,112,F,Other Race,Unknown,4,Emergency,Home w/ Home Health Services,2017,122,Pneumonia (except that caused by tuberculosis or sexually transmitted disease),000,NO PROC,138,Bronchiolitis & RSV pneumonia,04,Diseases and Disorders of the Respiratory System,3,Major,Major,Medical,Medicaid,,,,N,Y,56872.09,11288.35
New York City,Kings,7002053,001304,NYU Langone Hospital-Brooklyn,0 to 17,112,M,Other Race,Not Span/Hispanic,3,Emergency,Home or Self Care,2017,125,Acute bronchitis,004,DIAGNOSTIC SPINAL TAP,138,Bronchiolitis & RSV pneumonia,04,Diseases and Disorders of the Respiratory System,1,Minor,Minor,Medical,Medicaid,,,,N,Y,30507.79,11976.30
New York City,Kings,7002053,001304,NYU Langone Hospital-Brooklyn,0 to 17,112,M,Black/African American,Not Span/Hispanic,1,Emergency,Home or Self Care,2017,125,Acute bronchitis,000,NO PROC,138,Bronchiolitis & RSV pneumonia,04,Diseases and Disorders of the Respiratory System,1,Minor,Minor,Medical,Medicaid,,,,N,Y,18778.56,8218.65
