Hospital Service Area,Hospital County,Operating Certificate Number,Permanent Facility Id,Facility Name,Age Group,Zip Code - 3 digits,Gender,Race,Ethnicity,Length of Stay,Type of Admission,Patient Disposition,Discharge Year,CCS Diagnosis Code,CCS Diagnosis Description,CCS Procedure Code,CCS Procedure Description,APR DRG Code,APR DRG Description,APR MDC Code,APR MDC Description,APR Severity of Illness Code,APR Severity of Illness Description,APR Risk of Mortality,APR Medical Surgical Description,Payment Typology 1,Payment Typology 2,Payment Typology 3,Birth Weight,Abortion Edit Indicator,Emergency Department Indicator,Total Charges,Total Costs
New York City,Manhattan,7002001,001438,Bellevue Hospital Center,0 to 17,112,F,Black/African American,Not Span/Hispanic,1,Emergency,Home or Self Care,2017,125,Acute bronchitis,032,OT NON-OR THER PRC NOSE,138,Bronchiolitis & RSV pneumonia,04,Diseases and Disorders of the Respiratory System,1,Minor,Minor,Medical,Medicaid,,,,N,Y,6473.80,4173.97
New York City,Manhattan,7002001,001438,Bellevue Hospital Center,0 to 17,114,M,Other Race,Not Span/Hispanic,1,Emergency,Home or Self Care,2017,125,Acute bronchitis,041,OT NON-OR THER PRC RESP,138,Bronchiolitis & RSV pneumonia,04,Diseases and Disorders of the Respiratory System,1,Minor,Minor,Medical,Medicaid,Medicaid,,,N,Y,6473.80,4173.97
New York City,Manhattan,7002001,001438,Bellevue Hospital Center,0 to 17,100,F,Other Race,Not Span/Hispanic,3,Emergency,Home or Self Care,2017,125,Acute bronchitis,231,OTHER THERAPEUTIC PRCS,138,Bronchiolitis & RSV pneumonia,04,Diseases and Disorders of the Respiratory System,1,Minor,Minor,Medical,Medicaid,Medicaid,,,N,Y,19841.66,12792.87
New York City,Manhattan,7002001,001438,Bellevue Hospital Center,0 to 17,112,F,Other Race,Spanish/Hispanic,1,Emergency,Home or Self Care,2017,125,Acute bronchitis,000,NO PROC,138,Bronchiolitis & RSV pneumonia,04,Diseases and Disorders of the Respiratory System,2,Moderate,Minor,Medical,Medicaid,Medicaid,,,N,Y,6473.80,4173.97
New York City,Manhattan,7002001,001438,Bellevue Hospital Center,0 to 17,113,M,Other Race,Not Span/Hispanic,1,Emergency,Home or Self Care,2017,125,Acute bronchitis,231,OTHER THERAPEUTIC PRCS,138,Bronchiolitis & RSV pneumonia,04,Diseases and Disorders of the Respiratory System,1,Minor,Minor,Medical,Medicaid,Medicaid,,,N,Y,6838.87,4409.35
New York City,Manhattan,7002001,001438,Bellevue Hospital Center,0 to 17,113,M,Other Race,Spanish/Hispanic,3,Emergency,Home or Self Care,2017,125,Acute bronchitis,216,RESP INTUB/MECH VENTIL,138,Bronchiolitis & RSV pneumonia,04,Diseases and Disorders of the Respiratory System,2,Moderate,Moderate,Medical,Medicaid,Medicaid,,,N,Y,21518.29,13873.87
New York City,Manhattan,7002001,001438,Bellevue Hospital Center,0 to 17,112,F,Other Race,Spanish/Hispanic,2,Emergency,Home or Self Care,2017,125,Acute bronchitis,000,NO PROC,138,Bronchiolitis & RSV pneumonia,04,Diseases and Disorders of the Respiratory System,1,Minor,Minor,Medical,Medicaid,Medicaid,,,N,Y,12643.73,8152.02
New York City,Manhattan,7002001,001438,Bellevue Hospital Center,0 to 17,100,F,Other Race,Not Span/Hispanic,2,Emergency,Home or Self Care,2017,125,Acute bronchitis,000,NO PROC,138,Bronchiolitis & RSV pneumonia,04,Diseases and Disorders of the Respiratory System,1,Minor,Minor,Medical,Medicaid,Medicaid,,,N,Y,13147.40,8476.76
New York City,Manhattan,7002001,001438,Bellevue Hospital Center,0 to 17,100,F,Other Race,Not Span/Hispanic,4,Emergency,Home or Self Care,2017,125,Acute bronchitis,000,NO PROC,138,Bronchiolitis & RSV pneumonia,04,Diseases and Disorders of the Respiratory System,2,Moderate,Minor,Medical,Medicaid,,,,N,Y,26151.58,16861.18
New York City,Manhattan,7002001,001438,Bellevue Hospital Center,30 to 49,104,M,Black/African American,Not Span/Hispanic,1,Emergency,Home or Self Care,2017,125,Acute bronchitis,231,OTHER THERAPEUTIC PRCS,138,Bronchiolitis & RSV pneumonia,04,Diseases and Disorders of the Respiratory System,2,Moderate,Moderate,Medical,Medicaid,Medicaid,,,N,Y,7392.85,4766.53
New York City,Manhattan,7002001,001438,Bellevue Hospital Center,0 to 17,112,F,Other Race,Not Span/Hispanic,3,Emergency,Home or Self Care,2017,125,Acute bronchitis,063,OT NON-OR THER CARDIO,138,Bronchiolitis & RSV pneumonia,04,Diseases and Disorders of the Respiratory System,2,Moderate,Minor,Medical,Medicaid,Medicaid,,,N,Y,20173.46,13006.80
New York City,Manhattan,7002001,001438,Bellevue Hospital Center,0 to 17,100,M,Black/African American,Not Span/Hispanic,1,Emergency,Home or Self Care,2017,125,Acute bronchitis,000,NO PROC,138,Bronchiolitis & RSV pneumonia,04,Diseases and Disorders of the Respiratory System,1,Minor,Minor,Medical,Medicaid,,,,N,Y,6507.40,4195.63
New York City,Manhattan,7002001,001438,Bellevue Hospital Center,50 to 69,100,M,Other Race,Spanish/Hispanic,23,Emergency,Home or Self Care,2017,125,Acute bronchitis,041,OT NON-OR THER PRC RESP,138,Bronchiolitis & RSV pneumonia,04,Diseases and Disorders of the Respiratory System,3,Major,Major,Medical,Medicaid,Medicaid,,,N,Y,121700.70,78466.28
New York City,Manhattan,7002001,001438,Bellevue Hospital Center,70 or Older,104,F,Other Race,Spanish/Hispanic,2,Emergency,Home or Self Care,2017,125,Acute bronchitis,041,OT NON-OR THER PRC RESP,138,Bronchiolitis & RSV pneumonia,04,Diseases and Disorders of the Respiratory System,2,Moderate,Major,Medical,Medicaid,,,,N,Y,15198.84,9799.42
New York City,Manhattan,7002001,001438,Bellevue Hospital Center,0 to 17,100,M,Black/African American,Not Span/Hispanic,1,Emergency,Home or Self Care,2017,125,Acute bronchitis,041,OT NON-OR THER PRC RESP,138,Bronchiolitis & RSV pneumonia,04,Diseases and Disorders of the Respiratory System,1,Minor,Minor,Medical,Medicaid,,,,N,Y,6507.40,4195.63
New York City,Manhattan,7002001,001438,Bellevue Hospital Center,0 to 17,100,M,Black/African American,Not Span/Hispanic,4,Emergency,Home or Self Care,2017,125,Acute bronchitis,041,OT NON-OR THER PRC RESP,138,Bronchiolitis & RSV pneumonia,04,Diseases and Disorders of the Respiratory System,2,Moderate,Minor,Medical,Medicaid,Medicaid,,,N,Y,25382.64,16365.41
New York City,Manhattan,7002001,001438,Bellevue Hospital Center,0 to 17,114,M,Other Race,Not Span/Hispanic,2,Emergency,Home or Self Care,2017,125,Acute bronchitis,183,ROUTINE CHEST X-RAY,138,Bronchiolitis & RSV pneumonia,04,Diseases and Disorders of the Respiratory System,2,Moderate,Minor,Medical,Medicaid,Medicaid,,,N,Y,12975.19,8365.73
New York City,Manhattan,7002001,001438,Bellevue Hospital Center,0 to 17,100,M,Black/African American,Not Span/Hispanic,7,Emergency,Home or Self Care,2017,125,Acute bronchitis,041,OT NON-OR THER PRC RESP,138,Bronchiolitis & RSV pneumonia,04,Diseases and Disorders of the Respiratory System,3,Major,Moderate,Medical,Medicaid,Medicaid,,,N,Y,45343.27,29234.98
New York City,Manhattan,7002001,001438,Bellevue Hospital Center,0 to 17,113,M,Other Race,Spanish/Hispanic,1,Emergency,Home or Self Care,2017,125,Acute bronchitis,041,OT NON-OR THER PRC RESP,138,Bronchiolitis & RSV pneumonia,04,Diseases and Disorders of the Respiratory System,1,Minor,Minor,Medical,Medicaid,Medicaid,,,N,Y,6776.76,4369.30
New York City,Manhattan,7002001,001438,Bellevue Hospital Center,0 to 17,100,M,Black/African American,Not Span/Hispanic,1,Emergency,Home or Self Care,2017,125,Acute bronchitis,041,OT NON-OR THER PRC RESP,138,Bronchiolitis & RSV pneumonia,04,Diseases and Disorders of the Respiratory System,1,Minor,Minor,Medical,Medicaid,Medicaid,,,N,Y,7058.15,4550.73
New York City,Manhattan,7002001,001438,Bellevue Hospital Center,0 to 17,112,M,Other Race,Not Span/Hispanic,1,Emergency,Home or Self Care,2017,125,Acute bronchitis,041,OT NON-OR THER PRC RESP,138,Bronchiolitis & RSV pneumonia,04,Diseases and Disorders of the Respiratory System,1,Minor,Minor,Medical,Medicaid,Medicaid,,,N,Y,6412.70,4134.58
New York City,Manhattan,7002001,001438,Bellevue Hospital Center,0 to 17,112,M,Other Race,Spanish/Hispanic,2,Emergency,Home or Self Care,2017,125,Acute bronchitis,000,NO PROC,138,Bronchiolitis & RSV pneumonia,04,Diseases and Disorders of the Respiratory System,1,Minor,Minor,Medical,Medicaid,Medicaid,,,N,N,12503.89,8061.86
New York City,Manhattan,7002001,001438,Bellevue Hospital Center,0 to 17,112,M,Other Race,Spanish/Hispanic,3,Emergency,Home or Self Care,2017,125,Acute bronchitis,000,NO PROC,138,Bronchiolitis & RSV pneumonia,04,Diseases and Disorders of the Respiratory System,1,Minor,Minor,Medical,Medicaid,Medicaid,,,N,Y,19355.25,12479.26
New York City,Manhattan,7002001,001438,Bellevue Hospital Center,0 to 17,100,F,Other Race,Not Span/Hispanic,3,Emergency,Home or Self Care,2017,125,Acute bronchitis,000,NO PROC,138,Bronchiolitis & RSV pneumonia,04,Diseases and Disorders of the Respiratory System,2,Moderate,Minor,Medical,Medicaid,,,,N,Y,19710.24,12708.14
New York City,Manhattan,7002001,001438,Bellevue Hospital Center,0 to 17,104,F,Black/African American,Not Span/Hispanic,3,Emergency,Home or Self Care,2017,125,Acute bronchitis,000,NO PROC,138,Bronchiolitis & RSV pneumonia,04,Diseases and Disorders of the Respiratory System,1,Minor,Minor,Medical,Medicaid,Medicaid,,,N,Y,18014.58,11614.86
New York City,Manhattan,7002001,001438,Bellevue Hospital Center,0 to 17,112,M,Other Race,Spanish/Hispanic,3,Emergency,Home or Self Care,2017,125,Acute bronchitis,000,NO PROC,138,Bronchiolitis & RSV pneumonia,04,Diseases and Disorders of the Respiratory System,2,Moderate,Moderate,Medical,Medicaid,Medicaid,,,N,Y,21077.84,13589.90
New York City,Manhattan,7002001,001438,Bellevue Hospital Center,0 to 17,111,M,Other Race,Spanish/Hispanic,4,Emergency,Home or Self Care,2017,125,Acute bronchitis,000,NO PROC,138,Bronchiolitis & RSV pneumonia,04,Diseases and Disorders of the Respiratory System,1,Minor,Minor,Medical,Medicaid,Medicaid,,,N,Y,25312.85,16320.41
New York City,Manhattan,7002001,001438,Bellevue Hospital Center,70 or Older,100,M,White,Not Span/Hispanic,4,Emergency,Home or Self Care,2017,122,Pneumonia (except that caused by tuberculosis or sexually transmitted disease),000,NO PROC,138,Bronchiolitis & RSV pneumonia,04,Diseases and Disorders of the Respiratory System,2,Moderate,Moderate,Medical,Medicare,Medicaid,,,N,Y,28832.37,18589.61
New York City,Manhattan,7002001,001438,Bellevue Hospital Center,0 to 17,100,F,Black/African American,Not Span/Hispanic,6,Emergency,Home or Self Care,2017,125,Acute bronchitis,041,OT NON-OR THER PRC RESP,138,Bronchiolitis & RSV pneumonia,04,Diseases and Disorders of the Respiratory System,2,Moderate,Minor,Medical,Medicaid,,,,N,Y,31467.40,20288.54
New York City,Manhattan,7002001,001438,Bellevue Hospital Center,0 to 17,100,M,Other Race,Spanish/Hispanic,10,Emergency,Home or Self Care,2017,125,Acute bronchitis,041,OT NON-OR THER PRC RESP,138,Bronchiolitis & RSV pneumonia,04,Diseases and Disorders of the Respiratory System,2,Moderate,Minor,Medical,Medicaid,Medicaid,,,N,Y,57448.80,37040.00
New York City,Manhattan,7002001,001438,Bellevue Hospital Center,0 to 17,100,M,Other Race,Spanish/Hispanic,1,Emergency,Home or Self Care,2017,125,Acute bronchitis,041,OT NON-OR THER PRC RESP,138,Bronchiolitis & RSV pneumonia,04,Diseases and Disorders of the Respiratory System,2,Moderate,Minor,Medical,Medicaid,Medicaid,,,N,Y,6959.07,4486.85
New York City,Manhattan,7002001,001438,Bellevue Hospital Center,0 to 17,112,F,Other Race,Not Span/Hispanic,5,Emergency,Home or Self Care,2017,125,Acute bronchitis,004,DIAGNOSTIC SPINAL TAP,138,Bronchiolitis & RSV pneumonia,04,Diseases and Disorders of the Respiratory System,2,Moderate,Minor,Medical,Medicaid,Medicaid,,,N,Y,31857.50,20540.06
New York City,Manhattan,7002001,001438,Bellevue Hospital Center,0 to 17,112,M,White,Not Span/Hispanic,4,Emergency,Home or Self Care,2017,125,Acute bronchitis,041,OT NON-OR THER PRC RESP,138,Bronchiolitis & RSV pneumonia,04,Diseases and Disorders of the Respiratory System,3,Major,Moderate,Medical,Blue Cross/Blue Shield,,,,N,Y,24472.53,15778.61
New York City,Manhattan,7002001,001438,Bellevue Hospital Center,0 to 17,100,F,Black/African American,Not Span/Hispanic,4,Emergency,Home or Self Care,2017,125,Acute bronchitis,000,NO PROC,138,Bronchiolitis & RSV pneumonia,04,Diseases and Disorders of the Respiratory System,2,Moderate,Minor,Medical,Medicaid,Medicaid,,,N,Y,26222.02,16906.59
New York City,Manhattan,7002001,001438,Bellevue Hospital Center,0 to 17,100,F,Black/African American,Not Span/Hispanic,2,Emergency,Home or Self Care,2017,125,Acute bronchitis,000,NO PROC,138,Bronchiolitis & RSV pneumonia,04,Diseases and Disorders of the Respiratory System,1,Minor,Minor,Medical,Medicaid,,,,N,Y,12815.59,8262.83
New York City,Manhattan,7002001,001438,Bellevue Hospital Center,0 to 17,112,M,Other Race,Spanish/Hispanic,1,Emergency,Home or Self Care,2017,125,Acute bronchitis,041,OT NON-OR THER PRC RESP,138,Bronchiolitis & RSV pneumonia,04,Diseases and Disorders of the Respiratory System,2,Moderate,Minor,Medical,Medicaid,Medicaid,,,N,Y,6947.40,4479.32
New York City,Manhattan,7002001,001438,Bellevue Hospital Center,0 to 17,100,F,Black/African American,Not Span/Hispanic,3,Emergency,Home or Self Care,2017,125,Acute bronchitis,000,NO PROC,138,Bronchiolitis & RSV pneumonia,04,Diseases and Disorders of the Respiratory System,3,Major,Minor,Medical,Medicaid,,,,N,N,18991.27,12244.58
New York City,Manhattan,7002001,001438,Bellevue Hospital Center,0 to 17,112,M,Other Race,Spanish/Hispanic,1,Emergency,Home or Self Care,2017,125,Acute bronchitis,032,OT NON-OR THER PRC NOSE,138,Bronchiolitis & RSV pneumonia,04,Diseases and Disorders of the Respiratory System,1,Minor,Minor,Medical,Medicaid,Medicaid,,,N,Y,6712.85,4328.10
New York City,Manhattan,7002001,001438,Bellevue Hospital Center,0 to 17,100,M,Black/African American,Not Span/Hispanic,7,Emergency,Home or Self Care,2017,125,Acute bronchitis,218,PSYCHO/PSYCHI EVAL/THER,138,Bronchiolitis & RSV pneumonia,04,Diseases and Disorders of the Respiratory System,1,Minor,Minor,Medical,Medicaid,Medicaid,,,N,Y,36795.57,23723.87
