Hospital Service Area,Hospital County,Operating Certificate Number,Permanent Facility Id,Facility Name,Age Group,Zip Code - 3 digits,Gender,Race,Ethnicity,Length of Stay,Type of Admission,Patient Disposition,Discharge Year,CCS Diagnosis Code,CCS Diagnosis Description,CCS Procedure Code,CCS Procedure Description,APR DRG Code,APR DRG Description,APR MDC Code,APR MDC Description,APR Severity of Illness Code,APR Severity of Illness Description,APR Risk of Mortality,APR Medical Surgical Description,Payment Typology 1,Payment Typology 2,Payment Typology 3,Birth Weight,Abortion Edit Indicator,Emergency Department Indicator,Total Charges,Total Costs
New York City,Manhattan,7002053,001463,NYU Langone Hospitals,0 to 17,112,M,Other Race,Not Span/Hispanic,1,Emergency,Home or Self Care,2020,RSP005,ACUTE BRONCHITIS,,,138,BRONCHIOLITIS & RSV PNEUMONIA,04,DISEASES AND DISORDERS OF THE RESPIRATORY SYSTEM,3,Major,Moderate,Medical,Medicaid,,,,,Y,22835.18,5816.64
New York City,Manhattan,7002053,001463,NYU Langone Hospitals,0 to 17,112,F,White,Not Span/Hispanic,7,Emergency,Home or Self Care,2020,RSP005,ACUTE BRONCHITIS,ADM021,"ADMINISTRATION OF THERAPEUTIC SUBSTANCES, NEC",138,BRONCHIOLITIS & RSV PNEUMONIA,04,DISEASES AND DISORDERS OF THE RESPIRATORY SYSTEM,3,Major,Moderate,Medical,Private Health Insurance,,,,,Y,93419.09,25607.45
New York City,Manhattan,7002053,001463,NYU Langone Hospitals,0 to 17,112,M,Other Race,Spanish/Hispanic,4,Emergency,Home or Self Care,2020,RSP005,ACUTE BRONCHITIS,OTR004,ISOLATION PROCEDURES,138,BRONCHIOLITIS & RSV PNEUMONIA,04,DISEASES AND DISORDERS OF THE RESPIRATORY SYSTEM,4,Extreme,Major,Medical,Medicaid,,,,,N,33927.9,9649.13
New York City,Manhattan,7002053,001463,NYU Langone Hospitals,0 to 17,112,F,Other Race,Spanish/Hispanic,5,Emergency,Home or Self Care,2020,RSP005,ACUTE BRONCHITIS,ESA004,NON-INVASIVE VENTILATION,138,BRONCHIOLITIS & RSV PNEUMONIA,04,DISEASES AND DISORDERS OF THE RESPIRATORY SYSTEM,3,Major,Moderate,Medical,Medicaid,,,,,Y,64048.36,19268.76
New York City,Manhattan,7002053,001463,NYU Langone Hospitals,0 to 17,112,M,White,Not Span/Hispanic,3,Emergency,Home or Self Care,2020,RSP005,ACUTE BRONCHITIS,,,138,BRONCHIOLITIS & RSV PNEUMONIA,04,DISEASES AND DISORDERS OF THE RESPIRATORY SYSTEM,1,Minor,Minor,Medical,Private Health Insurance,,,,,Y,25599.26,7336.83
New York City,Manhattan,7002053,001463,NYU Langone Hospitals,0 to 17,112,F,White,Not Span/Hispanic,9,Emergency,Home or Self Care,2020,RSP005,ACUTE BRONCHITIS,ESA004,NON-INVASIVE VENTILATION,138,BRONCHIOLITIS & RSV PNEUMONIA,04,DISEASES AND DISORDERS OF THE RESPIRATORY SYSTEM,4,Extreme,Moderate,Medical,Medicaid,,,,,Y,117141.56,36650.98
New York City,Manhattan,7002053,001463,NYU Langone Hospitals,70 or Older,104,M,Other Race,Not Span/Hispanic,14,Emergency,Home or Self Care,2020,RSP002,PNEUMONIA (EXCEPT THAT CAUSED BY TUBERCULOSIS),OTR004,ISOLATION PROCEDURES,138,BRONCHIOLITIS & RSV PNEUMONIA,04,DISEASES AND DISORDERS OF THE RESPIRATORY SYSTEM,2,Moderate,Moderate,Medical,Medicare,Medicaid,,,,Y,258405.29,54365.2
New York City,Manhattan,7002053,001463,NYU Langone Hospitals,0 to 17,,M,White,Not Span/Hispanic,2,Emergency,Home or Self Care,2020,RSP005,ACUTE BRONCHITIS,,,138,BRONCHIOLITIS & RSV PNEUMONIA,04,DISEASES AND DISORDERS OF THE RESPIRATORY SYSTEM,1,Minor,Minor,Medical,Private Health Insurance,,,,,Y,20861.56,5444.11
New York City,Manhattan,7002053,001463,NYU Langone Hospitals,50 to 69,104,M,Multi-racial,Spanish/Hispanic,1,Emergency,Left Against Medical Advice,2020,RSP005,ACUTE BRONCHITIS,,,138,BRONCHIOLITIS & RSV PNEUMONIA,04,DISEASES AND DISORDERS OF THE RESPIRATORY SYSTEM,1,Minor,Minor,Medical,Medicaid,,,,,Y,56805.25,11243.36
New York City,Manhattan,7002053,001463,NYU Langone Hospitals,50 to 69,100,M,Other Race,Spanish/Hispanic,9,Emergency,Home w/ Home Health Services,2020,RSP005,ACUTE BRONCHITIS,MST004,INCISION AND DRAINAGE OF MUSCULOSKELETAL TISSUE AND JOINTS,138,BRONCHIOLITIS & RSV PNEUMONIA,04,DISEASES AND DISORDERS OF THE RESPIRATORY SYSTEM,2,Moderate,Moderate,Medical,Medicaid,,,,,Y,96310.96,32475.65
New York City,Manhattan,7002053,001463,NYU Langone Hospitals,0 to 17,OOS,F,White,Unknown,9,Emergency,Home or Self Care,2020,RSP005,ACUTE BRONCHITIS,ESA004,NON-INVASIVE VENTILATION,138,BRONCHIOLITIS & RSV PNEUMONIA,04,DISEASES AND DISORDERS OF THE RESPIRATORY SYSTEM,3,Major,Moderate,Medical,Blue Cross/Blue Shield,,,,,N,116513.34,39226.64
New York City,Manhattan,7002053,001463,NYU Langone Hospitals,0 to 17,100,F,Other Race,Unknown,3,Emergency,Home or Self Care,2020,RSP005,ACUTE BRONCHITIS,,,138,BRONCHIOLITIS & RSV PNEUMONIA,04,DISEASES AND DISORDERS OF THE RESPIRATORY SYSTEM,2,Moderate,Minor,Medical,Private Health Insurance,,,,,Y,26168.85,7511.36
New York City,Manhattan,7002053,001463,NYU Langone Hospitals,0 to 17,100,M,White,Unknown,1,Emergency,Home or Self Care,2020,RSP005,ACUTE BRONCHITIS,OTR004,ISOLATION PROCEDURES,138,BRONCHIOLITIS & RSV PNEUMONIA,04,DISEASES AND DISORDERS OF THE RESPIRATORY SYSTEM,3,Major,Moderate,Medical,Private Health Insurance,,,,,Y,21353.91,5469.37
New York City,Manhattan,7002053,001463,NYU Langone Hospitals,0 to 17,112,M,White,Not Span/Hispanic,2,Emergency,Home or Self Care,2020,RSP005,ACUTE BRONCHITIS,,,138,BRONCHIOLITIS & RSV PNEUMONIA,04,DISEASES AND DISORDERS OF THE RESPIRATORY SYSTEM,1,Minor,Minor,Medical,Private Health Insurance,,,,,Y,21256.41,5493.44
New York City,Manhattan,7002053,001463,NYU Langone Hospitals,0 to 17,112,M,White,Not Span/Hispanic,3,Emergency,Home or Self Care,2020,RSP005,ACUTE BRONCHITIS,ADM021,"ADMINISTRATION OF THERAPEUTIC SUBSTANCES, NEC",138,BRONCHIOLITIS & RSV PNEUMONIA,04,DISEASES AND DISORDERS OF THE RESPIRATORY SYSTEM,3,Major,Moderate,Medical,Medicaid,,,,,Y,58387.85,15691.17
New York City,Manhattan,7002053,001463,NYU Langone Hospitals,0 to 17,OOS,M,Other Race,Not Span/Hispanic,3,Emergency,Home or Self Care,2020,RSP005,ACUTE BRONCHITIS,ADM021,"ADMINISTRATION OF THERAPEUTIC SUBSTANCES, NEC",138,BRONCHIOLITIS & RSV PNEUMONIA,04,DISEASES AND DISORDERS OF THE RESPIRATORY SYSTEM,3,Major,Moderate,Medical,Private Health Insurance,,,,,Y,46723.88,14080.49
New York City,Manhattan,7002053,001463,NYU Langone Hospitals,0 to 17,OOS,M,White,Not Span/Hispanic,2,Emergency,Home or Self Care,2020,RSP005,ACUTE BRONCHITIS,,,138,BRONCHIOLITIS & RSV PNEUMONIA,04,DISEASES AND DISORDERS OF THE RESPIRATORY SYSTEM,1,Minor,Minor,Medical,Private Health Insurance,,,,,Y,32225.91,9539.07
New York City,Manhattan,7002053,001463,NYU Langone Hospitals,0 to 17,112,M,White,Not Span/Hispanic,1,Emergency,Home or Self Care,2020,RSP005,ACUTE BRONCHITIS,ESA004,NON-INVASIVE VENTILATION,138,BRONCHIOLITIS & RSV PNEUMONIA,04,DISEASES AND DISORDERS OF THE RESPIRATORY SYSTEM,1,Minor,Minor,Medical,Medicaid,,,,,Y,15953.17,3483.24
New York City,Manhattan,7002053,001463,NYU Langone Hospitals,0 to 17,112,F,White,Not Span/Hispanic,5,Emergency,Home or Self Care,2020,RSP005,ACUTE BRONCHITIS,,,138,BRONCHIOLITIS & RSV PNEUMONIA,04,DISEASES AND DISORDERS OF THE RESPIRATORY SYSTEM,3,Major,Moderate,Medical,Blue Cross/Blue Shield,,,,,Y,65153.3,20441.16
New York City,Manhattan,7002053,001463,NYU Langone Hospitals,70 or Older,100,F,White,Not Span/Hispanic,2,Emergency,Home w/ Home Health Services,2020,RSP005,ACUTE BRONCHITIS,CAR024,VENOUS AND ARTERIAL CATHETER PLACEMENT,138,BRONCHIOLITIS & RSV PNEUMONIA,04,DISEASES AND DISORDERS OF THE RESPIRATORY SYSTEM,2,Moderate,Moderate,Medical,Medicare,Private Health Insurance,,,,Y,30712.01,7911.39
New York City,Manhattan,7002053,001463,NYU Langone Hospitals,0 to 17,112,M,Other Race,Not Span/Hispanic,6,Emergency,Home or Self Care,2020,RSP005,ACUTE BRONCHITIS,ESA004,NON-INVASIVE VENTILATION,138,BRONCHIOLITIS & RSV PNEUMONIA,04,DISEASES AND DISORDERS OF THE RESPIRATORY SYSTEM,3,Major,Moderate,Medical,Medicaid,,,,,Y,88290.83,26359.54
New York City,Manhattan,7002053,001463,NYU Langone Hospitals,0 to 17,100,F,Other Race,Unknown,4,Emergency,Home or Self Care,2020,RSP005,ACUTE BRONCHITIS,GIS007,GI SYSTEM DRAINAGE (EXCLUDING PARACENTESIS),138,BRONCHIOLITIS & RSV PNEUMONIA,04,DISEASES AND DISORDERS OF THE RESPIRATORY SYSTEM,3,Major,Moderate,Medical,Private Health Insurance,Blue Cross/Blue Shield,,02800,,Y,45020.63,12615.25
New York City,Manhattan,7002053,001463,NYU Langone Hospitals,0 to 17,100,M,White,Not Span/Hispanic,1,Emergency,Home or Self Care,2020,RSP005,ACUTE BRONCHITIS,,,138,BRONCHIOLITIS & RSV PNEUMONIA,04,DISEASES AND DISORDERS OF THE RESPIRATORY SYSTEM,2,Moderate,Minor,Medical,Blue Cross/Blue Shield,,,,,Y,18618.36,3679.56
New York City,Manhattan,7002053,001463,NYU Langone Hospitals,0 to 17,112,M,Black/African American,Not Span/Hispanic,2,Emergency,Home or Self Care,2020,RSP005,ACUTE BRONCHITIS,,,138,BRONCHIOLITIS & RSV PNEUMONIA,04,DISEASES AND DISORDERS OF THE RESPIRATORY SYSTEM,2,Moderate,Minor,Medical,Medicaid,,,,,Y,22605.83,5635.78
New York City,Manhattan,7002053,001463,NYU Langone Hospitals,0 to 17,112,F,White,Not Span/Hispanic,3,Emergency,Home or Self Care,2020,RSP005,ACUTE BRONCHITIS,,,138,BRONCHIOLITIS & RSV PNEUMONIA,04,DISEASES AND DISORDERS OF THE RESPIRATORY SYSTEM,2,Moderate,Minor,Medical,Private Health Insurance,,,,,Y,27498.06,7703.71
New York City,Manhattan,7002053,001463,NYU Langone Hospitals,70 or Older,100,F,White,Not Span/Hispanic,8,Emergency,Inpatient Rehabilitation Facility,2020,RSP002,PNEUMONIA (EXCEPT THAT CAUSED BY TUBERCULOSIS),,,138,BRONCHIOLITIS & RSV PNEUMONIA,04,DISEASES AND DISORDERS OF THE RESPIRATORY SYSTEM,3,Major,Major,Medical,Medicare,Blue Cross/Blue Shield,,,,Y,138307.96,49389.4
New York City,Manhattan,7002053,001463,NYU Langone Hospitals,0 to 17,112,M,Other Race,Not Span/Hispanic,4,Emergency,Home or Self Care,2020,RSP005,ACUTE BRONCHITIS,,,138,BRONCHIOLITIS & RSV PNEUMONIA,04,DISEASES AND DISORDERS OF THE RESPIRATORY SYSTEM,3,Major,Moderate,Medical,Medicaid,,,,,Y,54965.16,17712.02
New York City,Manhattan,7002053,001463,NYU Langone Hospitals,0 to 17,112,F,White,Not Span/Hispanic,3,Emergency,Home or Self Care,2020,RSP005,ACUTE BRONCHITIS,ADM021,"ADMINISTRATION OF THERAPEUTIC SUBSTANCES, NEC",138,BRONCHIOLITIS & RSV PNEUMONIA,04,DISEASES AND DISORDERS OF THE RESPIRATORY SYSTEM,3,Major,Moderate,Medical,Private Health Insurance,,,,,Y,52314.83,15050.24
New York City,Manhattan,7002053,001463,NYU Langone Hospitals,0 to 17,100,M,Other Race,Unknown,3,Emergency,Home or Self Care,2020,RSP005,ACUTE BRONCHITIS,ADM021,"ADMINISTRATION OF THERAPEUTIC SUBSTANCES, NEC",138,BRONCHIOLITIS & RSV PNEUMONIA,04,DISEASES AND DISORDERS OF THE RESPIRATORY SYSTEM,3,Major,Moderate,Medical,Private Health Insurance,,,,,Y,46392.05,14105.27
New York City,Manhattan,7002053,001463,NYU Langone Hospitals,0 to 17,113,M,Black/African American,Not Span/Hispanic,4,Emergency,Home or Self Care,2020,RSP005,ACUTE BRONCHITIS,OTR004,ISOLATION PROCEDURES,138,BRONCHIOLITIS & RSV PNEUMONIA,04,DISEASES AND DISORDERS OF THE RESPIRATORY SYSTEM,4,Extreme,Major,Medical,Medicaid,,,,,Y,60581.15,17406.21
New York City,Manhattan,7002053,001463,NYU Langone Hospitals,0 to 17,112,M,White,Spanish/Hispanic,2,Emergency,Home or Self Care,2020,RSP005,ACUTE BRONCHITIS,,,138,BRONCHIOLITIS & RSV PNEUMONIA,04,DISEASES AND DISORDERS OF THE RESPIRATORY SYSTEM,3,Major,Moderate,Medical,Medicaid,,,,,Y,36356.31,10257.91
New York City,Manhattan,7002053,001463,NYU Langone Hospitals,0 to 17,100,F,Other Race,Unknown,1,Emergency,Home or Self Care,2020,RSP005,ACUTE BRONCHITIS,OTR004,ISOLATION PROCEDURES,138,BRONCHIOLITIS & RSV PNEUMONIA,04,DISEASES AND DISORDERS OF THE RESPIRATORY SYSTEM,1,Minor,Minor,Medical,Medicaid,,,,,Y,14164.71,3211.98
New York City,Manhattan,7002053,001463,NYU Langone Hospitals,0 to 17,112,F,White,Not Span/Hispanic,2,Emergency,Home or Self Care,2020,RSP005,ACUTE BRONCHITIS,,,138,BRONCHIOLITIS & RSV PNEUMONIA,04,DISEASES AND DISORDERS OF THE RESPIRATORY SYSTEM,1,Minor,Minor,Medical,Private Health Insurance,,,,,Y,22360.4,5665.66
New York City,Manhattan,7002053,001463,NYU Langone Hospitals,0 to 17,112,M,White,Not Span/Hispanic,1,Emergency,Home or Self Care,2020,RSP005,ACUTE BRONCHITIS,OTR004,ISOLATION PROCEDURES,138,BRONCHIOLITIS & RSV PNEUMONIA,04,DISEASES AND DISORDERS OF THE RESPIRATORY SYSTEM,3,Major,Moderate,Medical,Medicaid,,,,,Y,25030.37,6107.63
New York City,Manhattan,7002053,001463,NYU Langone Hospitals,0 to 17,100,M,White,Not Span/Hispanic,10,Emergency,Home or Self Care,2020,RSP005,ACUTE BRONCHITIS,ESA004,NON-INVASIVE VENTILATION,138,BRONCHIOLITIS & RSV PNEUMONIA,04,DISEASES AND DISORDERS OF THE RESPIRATORY SYSTEM,3,Major,Moderate,Medical,Blue Cross/Blue Shield,,,,,Y,146059.62,46009.78
New York City,Manhattan,7002053,001463,NYU Langone Hospitals,18 to 29,100,M,Other Race,Spanish/Hispanic,3,Emergency,Home or Self Care,2020,RSP002,PNEUMONIA (EXCEPT THAT CAUSED BY TUBERCULOSIS),OTR004,ISOLATION PROCEDURES,138,BRONCHIOLITIS & RSV PNEUMONIA,04,DISEASES AND DISORDERS OF THE RESPIRATORY SYSTEM,2,Moderate,Minor,Medical,Medicaid,,,,,Y,33783.51,10973.77
New York City,Manhattan,7002053,001463,NYU Langone Hospitals,0 to 17,112,F,White,Unknown,2,Emergency,Home w/ Home Health Services,2020,RSP005,ACUTE BRONCHITIS,,,138,BRONCHIOLITIS & RSV PNEUMONIA,04,DISEASES AND DISORDERS OF THE RESPIRATORY SYSTEM,3,Major,Moderate,Medical,Medicaid,,,,,Y,34616.7,9798.67
New York City,Manhattan,7002053,001463,NYU Langone Hospitals,0 to 17,112,M,White,Not Span/Hispanic,12,Emergency,Home or Self Care,2020,RSP005,ACUTE BRONCHITIS,OTR004,ISOLATION PROCEDURES,138,BRONCHIOLITIS & RSV PNEUMONIA,04,DISEASES AND DISORDERS OF THE RESPIRATORY SYSTEM,3,Major,Moderate,Medical,Medicaid,,,,,Y,201421.13,60844.34
New York City,Manhattan,7002053,001463,NYU Langone Hospitals,0 to 17,112,M,Other Race,Spanish/Hispanic,3,Emergency,Home or Self Care,2020,RSP005,ACUTE BRONCHITIS,ESA004,NON-INVASIVE VENTILATION,138,BRONCHIOLITIS & RSV PNEUMONIA,04,DISEASES AND DISORDERS OF THE RESPIRATORY SYSTEM,3,Major,Moderate,Medical,Medicaid,,,,,Y,54277.08,15086.14
New York City,Manhattan,7002053,001463,NYU Langone Hospitals,0 to 17,112,M,Other Race,Not Span/Hispanic,3,Emergency,Home or Self Care,2020,RSP005,ACUTE BRONCHITIS,ESA004,NON-INVASIVE VENTILATION,138,BRONCHIOLITIS & RSV PNEUMONIA,04,DISEASES AND DISORDERS OF THE RESPIRATORY SYSTEM,3,Major,Moderate,Medical,Private Health Insurance,,,,,Y,47573.21,14163.99
New York City,Manhattan,7002053,001463,NYU Langone Hospitals,0 to 17,100,M,Black/African American,Spanish/Hispanic,3,Emergency,Home or Self Care,2020,RSP005,ACUTE BRONCHITIS,,,138,BRONCHIOLITIS & RSV PNEUMONIA,04,DISEASES AND DISORDERS OF THE RESPIRATORY SYSTEM,2,Moderate,Minor,Medical,Medicaid,,,,,Y,25866.25,7498.63
New York City,Manhattan,7002053,001463,NYU Langone Hospitals,0 to 17,112,M,Other Race,Spanish/Hispanic,1,Emergency,Home or Self Care,2020,RSP005,ACUTE BRONCHITIS,,,138,BRONCHIOLITIS & RSV PNEUMONIA,04,DISEASES AND DISORDERS OF THE RESPIRATORY SYSTEM,3,Major,Moderate,Medical,Medicaid,,,,,Y,24682.37,5928.28
New York City,Manhattan,7002053,001463,NYU Langone Hospitals,0 to 17,100,M,White,Not Span/Hispanic,8,Emergency,Home or Self Care,2020,RSP005,ACUTE BRONCHITIS,,,138,BRONCHIOLITIS & RSV PNEUMONIA,04,DISEASES AND DISORDERS OF THE RESPIRATORY SYSTEM,2,Moderate,Moderate,Medical,Private Health Insurance,,,,,Y,70792.95,19757.01
New York City,Manhattan,7002053,001463,NYU Langone Hospitals,0 to 17,,F,Other Race,Spanish/Hispanic,4,Emergency,Home or Self Care,2020,RSP005,ACUTE BRONCHITIS,ESA004,NON-INVASIVE VENTILATION,138,BRONCHIOLITIS & RSV PNEUMONIA,04,DISEASES AND DISORDERS OF THE RESPIRATORY SYSTEM,3,Major,Moderate,Medical,Medicaid,,,,,Y,61688.5,18725.03
New York City,Manhattan,7002053,001463,NYU Langone Hospitals,0 to 17,112,F,Other Race,Spanish/Hispanic,7,Emergency,Home or Self Care,2020,RSP005,ACUTE BRONCHITIS,ESA004,NON-INVASIVE VENTILATION,138,BRONCHIOLITIS & RSV PNEUMONIA,04,DISEASES AND DISORDERS OF THE RESPIRATORY SYSTEM,3,Major,Major,Medical,Medicaid,,,,,Y,113741.26,34858.04
New York City,Manhattan,7002053,001463,NYU Langone Hospitals,0 to 17,112,M,White,Not Span/Hispanic,4,Emergency,Home or Self Care,2020,RSP005,ACUTE BRONCHITIS,ADM021,"ADMINISTRATION OF THERAPEUTIC SUBSTANCES, NEC",138,BRONCHIOLITIS & RSV PNEUMONIA,04,DISEASES AND DISORDERS OF THE RESPIRATORY SYSTEM,3,Major,Moderate,Medical,Medicaid,,,,,Y,53157.37,15080.34
New York City,Manhattan,7002053,001463,NYU Langone Hospitals,0 to 17,100,M,Other Race,Not Span/Hispanic,2,Emergency,Home or Self Care,2020,RSP005,ACUTE BRONCHITIS,OTR004,ISOLATION PROCEDURES,138,BRONCHIOLITIS & RSV PNEUMONIA,04,DISEASES AND DISORDERS OF THE RESPIRATORY SYSTEM,3,Major,Moderate,Medical,Private Health Insurance,,,,,Y,36615.65,10163.63
New York City,Manhattan,7002053,001463,NYU Langone Hospitals,0 to 17,112,F,White,Not Span/Hispanic,1,Emergency,Home or Self Care,2020,RSP005,ACUTE BRONCHITIS,,,138,BRONCHIOLITIS & RSV PNEUMONIA,04,DISEASES AND DISORDERS OF THE RESPIRATORY SYSTEM,3,Major,Moderate,Medical,Medicaid,,,,,Y,14653.75,3273.07
New York City,Manhattan,7002053,001463,NYU Langone Hospitals,0 to 17,112,M,White,Not Span/Hispanic,7,Emergency,Home or Self Care,2020,RSP005,ACUTE BRONCHITIS,,,138,BRONCHIOLITIS & RSV PNEUMONIA,04,DISEASES AND DISORDERS OF THE RESPIRATORY SYSTEM,3,Major,Moderate,Medical,Medicaid,,,,,Y,80681.54,25224.71
New York City,Manhattan,7002053,001463,NYU Langone Hospitals,0 to 17,112,M,Other Race,Not Span/Hispanic,4,Emergency,Home or Self Care,2020,RSP005,ACUTE BRONCHITIS,,,138,BRONCHIOLITIS & RSV PNEUMONIA,04,DISEASES AND DISORDERS OF THE RESPIRATORY SYSTEM,3,Major,Moderate,Medical,Medicaid,,,,,Y,51184.24,16037.58
New York City,Manhattan,7002053,001463,NYU Langone Hospitals,30 to 49,104,M,Other Race,Spanish/Hispanic,1,Emergency,Home or Self Care,2020,RSP005,ACUTE BRONCHITIS,ADM001,TRANSFUSION OF BLOOD AND BLOOD PRODUCTS,138,BRONCHIOLITIS & RSV PNEUMONIA,04,DISEASES AND DISORDERS OF THE RESPIRATORY SYSTEM,2,Moderate,Major,Medical,Medicaid,,,,,Y,47948.56,12117.82
New York City,Manhattan,7002053,001463,NYU Langone Hospitals,0 to 17,100,F,Other Race,Not Span/Hispanic,3,Emergency,Home or Self Care,2020,RSP005,ACUTE BRONCHITIS,,,138,BRONCHIOLITIS & RSV PNEUMONIA,04,DISEASES AND DISORDERS OF THE RESPIRATORY SYSTEM,3,Major,Moderate,Medical,Medicaid,,,,,Y,41566.14,12172.56
New York City,Manhattan,7002053,001463,NYU Langone Hospitals,0 to 17,112,F,White,Not Span/Hispanic,1,Emergency,Home or Self Care,2020,RSP005,ACUTE BRONCHITIS,,,138,BRONCHIOLITIS & RSV PNEUMONIA,04,DISEASES AND DISORDERS OF THE RESPIRATORY SYSTEM,1,Minor,Minor,Medical,Medicaid,,,,,Y,14398.5,3242.26
New York City,Manhattan,7002053,001463,NYU Langone Hospitals,0 to 17,112,M,White,Spanish/Hispanic,5,Emergency,Home or Self Care,2020,RSP005,ACUTE BRONCHITIS,OTR004,ISOLATION PROCEDURES,138,BRONCHIOLITIS & RSV PNEUMONIA,04,DISEASES AND DISORDERS OF THE RESPIRATORY SYSTEM,3,Major,Moderate,Medical,Medicaid,,,,,Y,48854.48,13587.12
New York City,Manhattan,7002053,001463,NYU Langone Hospitals,70 or Older,100,M,White,Not Span/Hispanic,11,Emergency,Home w/ Home Health Services,2020,RSP005,ACUTE BRONCHITIS,,,138,BRONCHIOLITIS & RSV PNEUMONIA,04,DISEASES AND DISORDERS OF THE RESPIRATORY SYSTEM,3,Major,Major,Medical,Medicare,Medicare,Medicaid,,,Y,106392.12,43334.74
New York City,Manhattan,7002053,001463,NYU Langone Hospitals,0 to 17,112,F,White,Not Span/Hispanic,3,Emergency,Home or Self Care,2020,RSP005,ACUTE BRONCHITIS,,,138,BRONCHIOLITIS & RSV PNEUMONIA,04,DISEASES AND DISORDERS OF THE RESPIRATORY SYSTEM,3,Major,Moderate,Medical,Medicaid,,,,,Y,44708.45,12866.29
New York City,Manhattan,7002053,001463,NYU Langone Hospitals,70 or Older,112,M,White,Not Span/Hispanic,2,Emergency,Home w/ Home Health Services,2020,RSP002,PNEUMONIA (EXCEPT THAT CAUSED BY TUBERCULOSIS),,,138,BRONCHIOLITIS & RSV PNEUMONIA,04,DISEASES AND DISORDERS OF THE RESPIRATORY SYSTEM,2,Moderate,Moderate,Medical,Medicare,Private Health Insurance,Medicaid,,,Y,37877.75,9188.34
New York City,Manhattan,7002053,001463,NYU Langone Hospitals,0 to 17,112,M,White,Unknown,2,Emergency,Home or Self Care,2020,RSP005,ACUTE BRONCHITIS,,,138,BRONCHIOLITIS & RSV PNEUMONIA,04,DISEASES AND DISORDERS OF THE RESPIRATORY SYSTEM,1,Minor,Minor,Medical,Medicaid,,,,,Y,22981.97,5712.32
New York City,Manhattan,7002053,001463,NYU Langone Hospitals,0 to 17,OOS,F,Other Race,Unknown,2,Emergency,Home or Self Care,2020,RSP005,ACUTE BRONCHITIS,OTR004,ISOLATION PROCEDURES,138,BRONCHIOLITIS & RSV PNEUMONIA,04,DISEASES AND DISORDERS OF THE RESPIRATORY SYSTEM,3,Major,Moderate,Medical,Private Health Insurance,,,,,Y,29705.06,8902.99
New York City,Manhattan,7002053,001463,NYU Langone Hospitals,50 to 69,104,M,Black/African American,Not Span/Hispanic,4,Emergency,Home w/ Home Health Services,2020,RSP005,ACUTE BRONCHITIS,,,138,BRONCHIOLITIS & RSV PNEUMONIA,04,DISEASES AND DISORDERS OF THE RESPIRATORY SYSTEM,3,Major,Major,Medical,Medicaid,,,,,Y,59768.59,15223.78
New York City,Manhattan,7002053,001463,NYU Langone Hospitals,70 or Older,100,M,Black/African American,Not Span/Hispanic,1,Emergency,Home or Self Care,2020,RSP005,ACUTE BRONCHITIS,,,138,BRONCHIOLITIS & RSV PNEUMONIA,04,DISEASES AND DISORDERS OF THE RESPIRATORY SYSTEM,3,Major,Extreme,Medical,Medicare,Blue Cross/Blue Shield,,,,Y,19805.62,4922.52
New York City,Manhattan,7002053,001463,NYU Langone Hospitals,0 to 17,112,M,Other Race,Not Span/Hispanic,9,Emergency,Home or Self Care,2020,RSP005,ACUTE BRONCHITIS,RES001,BRONCHOSCOPY (DIAGNOSTIC),138,BRONCHIOLITIS & RSV PNEUMONIA,04,DISEASES AND DISORDERS OF THE RESPIRATORY SYSTEM,3,Major,Minor,Medical,Medicaid,,,,,Y,119134.69,34796.9
New York City,Manhattan,7002053,001463,NYU Langone Hospitals,0 to 17,112,F,White,Unknown,4,Emergency,Home or Self Care,2020,RSP005,ACUTE BRONCHITIS,ESA004,NON-INVASIVE VENTILATION,138,BRONCHIOLITIS & RSV PNEUMONIA,04,DISEASES AND DISORDERS OF THE RESPIRATORY SYSTEM,3,Major,Moderate,Medical,Medicaid,,,,,Y,54125.92,16347.01
New York City,Manhattan,7002053,001463,NYU Langone Hospitals,0 to 17,112,F,White,Not Span/Hispanic,3,Emergency,Home or Self Care,2020,RSP005,ACUTE BRONCHITIS,ADM021,"ADMINISTRATION OF THERAPEUTIC SUBSTANCES, NEC",138,BRONCHIOLITIS & RSV PNEUMONIA,04,DISEASES AND DISORDERS OF THE RESPIRATORY SYSTEM,2,Moderate,Minor,Medical,Medicaid,,,,,Y,28527.66,7613.33
New York City,Manhattan,7002053,001463,NYU Langone Hospitals,50 to 69,100,M,White,Not Span/Hispanic,8,Emergency,Home w/ Home Health Services,2020,RSP005,ACUTE BRONCHITIS,RES001,BRONCHOSCOPY (DIAGNOSTIC),138,BRONCHIOLITIS & RSV PNEUMONIA,04,DISEASES AND DISORDERS OF THE RESPIRATORY SYSTEM,4,Extreme,Major,Medical,Private Health Insurance,Medicare,,,,Y,201407.98,48918.31
New York City,Manhattan,7002053,001463,NYU Langone Hospitals,0 to 17,112,M,White,Not Span/Hispanic,3,Emergency,Home or Self Care,2020,RSP005,ACUTE BRONCHITIS,,,138,BRONCHIOLITIS & RSV PNEUMONIA,04,DISEASES AND DISORDERS OF THE RESPIRATORY SYSTEM,1,Minor,Minor,Medical,Medicaid,,,,,Y,35460.81,11751.45
New York City,Manhattan,7002053,001463,NYU Langone Hospitals,0 to 17,112,M,White,Unknown,5,Emergency,Home or Self Care,2020,RSP005,ACUTE BRONCHITIS,,,138,BRONCHIOLITIS & RSV PNEUMONIA,04,DISEASES AND DISORDERS OF THE RESPIRATORY SYSTEM,2,Moderate,Moderate,Medical,Medicaid,,,,,Y,55484.84,16656.65
New York City,Manhattan,7002053,001463,NYU Langone Hospitals,0 to 17,112,F,White,Not Span/Hispanic,1,Emergency,Home or Self Care,2020,RSP005,ACUTE BRONCHITIS,,,138,BRONCHIOLITIS & RSV PNEUMONIA,04,DISEASES AND DISORDERS OF THE RESPIRATORY SYSTEM,1,Minor,Minor,Medical,Medicaid,,,,,Y,18845,4413.45
New York City,Manhattan,7002053,001463,NYU Langone Hospitals,0 to 17,112,F,White,Not Span/Hispanic,5,Emergency,Home or Self Care,2020,RSP005,ACUTE BRONCHITIS,OTR004,ISOLATION PROCEDURES,138,BRONCHIOLITIS & RSV PNEUMONIA,04,DISEASES AND DISORDERS OF THE RESPIRATORY SYSTEM,3,Major,Moderate,Medical,Private Health Insurance,,,,,Y,88991.12,24746.55