Hospital Service Area,Hospital County,Operating Certificate Number,Permanent Facility Id,Facility Name,Age Group,Zip Code - 3 digits,Gender,Race,Ethnicity,Length of Stay,Type of Admission,Patient Disposition,Discharge Year,CCS Diagnosis Code,CCS Diagnosis Description,CCS Procedure Code,CCS Procedure Description,APR DRG Code,APR DRG Description,APR MDC Code,APR MDC Description,APR Severity of Illness Code,APR Severity of Illness Description,APR Risk of Mortality,APR Medical Surgical Description,Payment Typology 1,Payment Typology 2,Payment Typology 3,Birth Weight,Abortion Edit Indicator,Emergency Department Indicator,Total Charges,Total Costs
New York City,Manhattan,7002001,001438,Bellevue Hospital Center,18 to 29,OOS,M,White,Not Span/Hispanic,51,Emergency,Left Against Medical Advice,2017,122,Pneumonia (except that caused by tuberculosis or sexually transmitted disease),231,OTHER THERAPEUTIC PRCS,139,Other pneumonia,04,Diseases and Disorders of the Respiratory System,1,Minor,Minor,Medical,Medicaid,,,,N,Y,7720.33,4977.67
New York City,Manhattan,7002001,001438,Bellevue Hospital Center,50 to 69,112,F,Other Race,Spanish/Hispanic,10,Emergency,Home w/ Home Health Services,2017,122,Pneumonia (except that caused by tuberculosis or sexually transmitted disease),231,OTHER THERAPEUTIC PRCS,139,Other pneumonia,04,Diseases and Disorders of the Respiratory System,4,Extreme,Major,Medical,Medicaid,Medicaid,,,N,Y,61277.77,39508.72
New York City,Manhattan,7002001,001438,Bellevue Hospital Center,50 to 69,113,F,Other Race,Not Span/Hispanic,3,Emergency,Expired,2017,122,Pneumonia (except that caused by tuberculosis or sexually transmitted disease),041,OT NON-OR THER PRC RESP,139,Other pneumonia,04,Diseases and Disorders of the Respiratory System,2,Moderate,Moderate,Medical,Self-Pay,,,,N,Y,28311.26,18253.63
New York City,Manhattan,7002001,001438,Bellevue Hospital Center,0 to 17,104,M,Other Race,Spanish/Hispanic,3,Emergency,Home or Self Care,2017,122,Pneumonia (except that caused by tuberculosis or sexually transmitted disease),231,OTHER THERAPEUTIC PRCS,139,Other pneumonia,04,Diseases and Disorders of the Respiratory System,1,Minor,Minor,Medical,Medicaid,Medicaid,,,N,Y,17877.11,11526.23
New York City,Manhattan,7002001,001438,Bellevue Hospital Center,50 to 69,100,M,Other Race,Spanish/Hispanic,4,Emergency,Home or Self Care,2017,122,Pneumonia (except that caused by tuberculosis or sexually transmitted disease),000,NO PROC,139,Other pneumonia,04,Diseases and Disorders of the Respiratory System,3,Major,Major,Medical,Medicaid,Medicaid,,,N,Y,23853.10,15379.24
New York City,Manhattan,7002001,001438,Bellevue Hospital Center,18 to 29,100,F,Black/African American,Not Span/Hispanic,2,Emergency,Home or Self Care,2017,122,Pneumonia (except that caused by tuberculosis or sexually transmitted disease),231,OTHER THERAPEUTIC PRCS,139,Other pneumonia,04,Diseases and Disorders of the Respiratory System,1,Minor,Minor,Medical,Medicaid,Medicaid,,,N,Y,18387.22,11855.12
New York City,Manhattan,7002001,001438,Bellevue Hospital Center,30 to 49,100,M,Other Race,Not Span/Hispanic,2,Emergency,Home or Self Care,2017,122,Pneumonia (except that caused by tuberculosis or sexually transmitted disease),180,OTHER CT SCAN,139,Other pneumonia,04,Diseases and Disorders of the Respiratory System,1,Minor,Minor,Medical,Medicaid,,,,N,Y,15358.27,9902.21
New York City,Manhattan,7002001,001438,Bellevue Hospital Center,30 to 49,100,M,Other Race,Not Span/Hispanic,5,Emergency,Home or Self Care,2017,122,Pneumonia (except that caused by tuberculosis or sexually transmitted disease),231,OTHER THERAPEUTIC PRCS,139,Other pneumonia,04,Diseases and Disorders of the Respiratory System,2,Moderate,Minor,Medical,Self-Pay,,,,N,Y,29499.95,19020.03
New York City,Manhattan,7002001,001438,Bellevue Hospital Center,70 or Older,100,M,Other Race,Spanish/Hispanic,13,Emergency,Skilled Nursing Home,2017,123,Influenza,231,OTHER THERAPEUTIC PRCS,139,Other pneumonia,04,Diseases and Disorders of the Respiratory System,1,Minor,Minor,Medical,Medicare,Blue Cross/Blue Shield,,,N,Y,69504.99,44813.20
New York City,Manhattan,7002001,001438,Bellevue Hospital Center,50 to 69,100,M,White,Not Span/Hispanic,5,Emergency,Home or Self Care,2017,122,Pneumonia (except that caused by tuberculosis or sexually transmitted disease),231,OTHER THERAPEUTIC PRCS,139,Other pneumonia,04,Diseases and Disorders of the Respiratory System,1,Minor,Minor,Medical,Medicaid,,,,N,Y,29245.52,18855.99
New York City,Manhattan,7002001,001438,Bellevue Hospital Center,50 to 69,100,F,Black/African American,Not Span/Hispanic,20,Emergency,Psychiatric Hospital or Unit of Hosp,2017,122,Pneumonia (except that caused by tuberculosis or sexually transmitted disease),000,NO PROC,139,Other pneumonia,04,Diseases and Disorders of the Respiratory System,2,Moderate,Minor,Medical,Medicaid,,,,N,Y,101564.85,65483.73
New York City,Manhattan,7002001,001438,Bellevue Hospital Center,50 to 69,114,M,Black/African American,Not Span/Hispanic,4,Emergency,Home or Self Care,2017,123,Influenza,231,OTHER THERAPEUTIC PRCS,139,Other pneumonia,04,Diseases and Disorders of the Respiratory System,3,Major,Moderate,Medical,Self-Pay,,,,N,Y,23306.18,15026.61
New York City,Manhattan,7002001,001438,Bellevue Hospital Center,50 to 69,113,M,Other Race,Not Span/Hispanic,4,Emergency,Home or Self Care,2017,122,Pneumonia (except that caused by tuberculosis or sexually transmitted disease),231,OTHER THERAPEUTIC PRCS,139,Other pneumonia,04,Diseases and Disorders of the Respiratory System,2,Moderate,Moderate,Medical,Medicaid,,,,N,Y,23209.33,14964.17
New York City,Manhattan,7002001,001438,Bellevue Hospital Center,50 to 69,100,M,White,Not Span/Hispanic,6,Emergency,Home or Self Care,2017,122,Pneumonia (except that caused by tuberculosis or sexually transmitted disease),231,OTHER THERAPEUTIC PRCS,139,Other pneumonia,04,Diseases and Disorders of the Respiratory System,2,Moderate,Minor,Medical,"Managed Care, Unspecified",Medicaid,,,N,Y,34593.82,22304.30
New York City,Manhattan,7002001,001438,Bellevue Hospital Center,50 to 69,100,F,White,Not Span/Hispanic,1,Emergency,Home or Self Care,2017,122,Pneumonia (except that caused by tuberculosis or sexually transmitted disease),231,OTHER THERAPEUTIC PRCS,139,Other pneumonia,04,Diseases and Disorders of the Respiratory System,2,Moderate,Minor,Medical,Medicare,,,,N,Y,7139.55,4603.21
New York City,Manhattan,7002001,001438,Bellevue Hospital Center,50 to 69,113,F,Other Race,Not Span/Hispanic,4,Emergency,Home or Self Care,2017,122,Pneumonia (except that caused by tuberculosis or sexually transmitted disease),000,NO PROC,139,Other pneumonia,04,Diseases and Disorders of the Respiratory System,2,Moderate,Moderate,Medical,Medicaid,Medicaid,,,N,Y,22497.04,14504.92
New York City,Manhattan,7002001,001438,Bellevue Hospital Center,30 to 49,113,M,Other Race,Not Span/Hispanic,5,Emergency,Home or Self Care,2017,123,Influenza,000,NO PROC,139,Other pneumonia,04,Diseases and Disorders of the Respiratory System,2,Moderate,Minor,Medical,Medicaid,,,,N,Y,28565.11,18417.30
New York City,Manhattan,7002001,001438,Bellevue Hospital Center,50 to 69,100,M,Black/African American,Not Span/Hispanic,9,Emergency,Home or Self Care,2017,122,Pneumonia (except that caused by tuberculosis or sexually transmitted disease),076,COLONOSCOPY AND BIOPSY,139,Other pneumonia,04,Diseases and Disorders of the Respiratory System,2,Moderate,Moderate,Medical,Medicaid,Medicaid,,,N,Y,51863.65,33438.98
New York City,Manhattan,7002001,001438,Bellevue Hospital Center,50 to 69,100,F,White,Not Span/Hispanic,3,Emergency,Home or Self Care,2017,122,Pneumonia (except that caused by tuberculosis or sexually transmitted disease),231,OTHER THERAPEUTIC PRCS,139,Other pneumonia,04,Diseases and Disorders of the Respiratory System,2,Moderate,Minor,Medical,Blue Cross/Blue Shield,Medicare,,,N,Y,22494.04,14502.99
New York City,Manhattan,7002001,001438,Bellevue Hospital Center,50 to 69,100,F,Black/African American,Not Span/Hispanic,1,Emergency,Home or Self Care,2017,122,Pneumonia (except that caused by tuberculosis or sexually transmitted disease),000,NO PROC,139,Other pneumonia,04,Diseases and Disorders of the Respiratory System,1,Minor,Minor,Medical,Private Health Insurance,Medicare,Medicaid,,N,Y,7680.82,4952.19
New York City,Manhattan,7002001,001438,Bellevue Hospital Center,50 to 69,100,M,Other Race,Spanish/Hispanic,10,Emergency,Home or Self Care,2017,122,Pneumonia (except that caused by tuberculosis or sexually transmitted disease),231,OTHER THERAPEUTIC PRCS,139,Other pneumonia,04,Diseases and Disorders of the Respiratory System,3,Major,Minor,Medical,"Managed Care, Unspecified",Medicaid,,,N,Y,69336.06,44704.29
New York City,Manhattan,7002001,001438,Bellevue Hospital Center,50 to 69,112,M,Other Race,Spanish/Hispanic,2,Emergency,Home or Self Care,2017,122,Pneumonia (except that caused by tuberculosis or sexually transmitted disease),231,OTHER THERAPEUTIC PRCS,139,Other pneumonia,04,Diseases and Disorders of the Respiratory System,3,Major,Major,Medical,Medicaid,,,,N,N,15813.14,10195.49
New York City,Manhattan,7002001,001438,Bellevue Hospital Center,70 or Older,100,F,Other Race,Not Span/Hispanic,2,Emergency,Home or Self Care,2017,122,Pneumonia (except that caused by tuberculosis or sexually transmitted disease),000,NO PROC,139,Other pneumonia,04,Diseases and Disorders of the Respiratory System,2,Moderate,Minor,Medical,Medicare,Medicare,,,N,Y,16107.97,10385.58
New York City,Manhattan,7002001,001438,Bellevue Hospital Center,70 or Older,100,M,Other Race,Not Span/Hispanic,6,Emergency,Home or Self Care,2017,122,Pneumonia (except that caused by tuberculosis or sexually transmitted disease),231,OTHER THERAPEUTIC PRCS,139,Other pneumonia,04,Diseases and Disorders of the Respiratory System,2,Moderate,Moderate,Medical,Medicare,Medicare,Medicaid,,N,Y,54464.47,35115.86
New York City,Manhattan,7002001,001438,Bellevue Hospital Center,70 or Older,100,F,Other Race,Spanish/Hispanic,5,Emergency,Home or Self Care,2017,122,Pneumonia (except that caused by tuberculosis or sexually transmitted disease),000,NO PROC,139,Other pneumonia,04,Diseases and Disorders of the Respiratory System,1,Minor,Minor,Medical,Self-Pay,,,,N,Y,33089.08,21334.12
New York City,Manhattan,7002001,001438,Bellevue Hospital Center,50 to 69,100,M,Black/African American,Not Span/Hispanic,8,Emergency,Psychiatric Hospital or Unit of Hosp,2017,122,Pneumonia (except that caused by tuberculosis or sexually transmitted disease),231,OTHER THERAPEUTIC PRCS,139,Other pneumonia,04,Diseases and Disorders of the Respiratory System,2,Moderate,Minor,Medical,Medicare,Medicaid,,,N,N,45391.72,29266.22
New York City,Manhattan,7002001,001438,Bellevue Hospital Center,50 to 69,113,M,Other Race,Not Span/Hispanic,6,Emergency,Home or Self Care,2017,122,Pneumonia (except that caused by tuberculosis or sexually transmitted disease),000,NO PROC,139,Other pneumonia,04,Diseases and Disorders of the Respiratory System,4,Extreme,Major,Medical,Medicaid,Medicaid,,,N,Y,34560.59,22282.87
New York City,Manhattan,7002001,001438,Bellevue Hospital Center,70 or Older,104,F,Other Race,Spanish/Hispanic,6,Emergency,Home or Self Care,2017,122,Pneumonia (except that caused by tuberculosis or sexually transmitted disease),231,OTHER THERAPEUTIC PRCS,139,Other pneumonia,04,Diseases and Disorders of the Respiratory System,2,Moderate,Moderate,Medical,Self-Pay,,,,N,Y,32396.23,20887.40
New York City,Manhattan,7002001,001438,Bellevue Hospital Center,70 or Older,100,M,White,Not Span/Hispanic,2,Emergency,Home or Self Care,2017,122,Pneumonia (except that caused by tuberculosis or sexually transmitted disease),000,NO PROC,139,Other pneumonia,04,Diseases and Disorders of the Respiratory System,3,Major,Major,Medical,Medicare,Medicare,Medicaid,,N,Y,13818.30,8909.32
New York City,Manhattan,7002001,001438,Bellevue Hospital Center,30 to 49,114,F,Other Race,Spanish/Hispanic,2,Emergency,Home or Self Care,2017,122,Pneumonia (except that caused by tuberculosis or sexually transmitted disease),000,NO PROC,139,Other pneumonia,04,Diseases and Disorders of the Respiratory System,2,Moderate,Minor,Medical,Medicaid,,,,N,Y,13300.70,8575.60
New York City,Manhattan,7002001,001438,Bellevue Hospital Center,50 to 69,104,F,Other Race,Spanish/Hispanic,48,Emergency,Skilled Nursing Home,2017,122,Pneumonia (except that caused by tuberculosis or sexually transmitted disease),231,OTHER THERAPEUTIC PRCS,139,Other pneumonia,04,Diseases and Disorders of the Respiratory System,3,Major,Moderate,Medical,Medicare,Medicaid,,,N,Y,239422.61,154367.25
New York City,Manhattan,7002001,001438,Bellevue Hospital Center,70 or Older,100,F,Black/African American,Not Span/Hispanic,9,Emergency,Home w/ Home Health Services,2017,122,Pneumonia (except that caused by tuberculosis or sexually transmitted disease),216,RESP INTUB/MECH VENTIL,139,Other pneumonia,04,Diseases and Disorders of the Respiratory System,4,Extreme,Major,Medical,Medicare,Medicare,Medicaid,,N,N,46519.82,29993.56
New York City,Manhattan,7002001,001438,Bellevue Hospital Center,50 to 69,100,F,Other Race,Not Span/Hispanic,4,Emergency,Home or Self Care,2017,122,Pneumonia (except that caused by tuberculosis or sexually transmitted disease),216,RESP INTUB/MECH VENTIL,139,Other pneumonia,04,Diseases and Disorders of the Respiratory System,2,Moderate,Moderate,Medical,Medicare,Medicare,,,N,Y,32331.92,20845.94
New York City,Manhattan,7002001,001438,Bellevue Hospital Center,50 to 69,103,F,Black/African American,Not Span/Hispanic,1,Emergency,Home or Self Care,2017,122,Pneumonia (except that caused by tuberculosis or sexually transmitted disease),000,NO PROC,139,Other pneumonia,04,Diseases and Disorders of the Respiratory System,1,Minor,Minor,Medical,Private Health Insurance,,,,N,Y,9492.23,6120.10
New York City,Manhattan,7002001,001438,Bellevue Hospital Center,50 to 69,104,M,White,Not Span/Hispanic,1,Emergency,Home or Self Care,2017,122,Pneumonia (except that caused by tuberculosis or sexually transmitted disease),000,NO PROC,139,Other pneumonia,04,Diseases and Disorders of the Respiratory System,2,Moderate,Moderate,Medical,Medicaid,Medicaid,,,N,Y,7398.02,4769.86
New York City,Manhattan,7002001,001438,Bellevue Hospital Center,0 to 17,113,M,Other Race,Not Span/Hispanic,3,Emergency,Home or Self Care,2017,122,Pneumonia (except that caused by tuberculosis or sexually transmitted disease),228,PROPHYLACTIC VAC/INOCUL,139,Other pneumonia,04,Diseases and Disorders of the Respiratory System,3,Major,Minor,Medical,Medicaid,Medicaid,,,N,Y,19759.86,12740.13
New York City,Manhattan,7002001,001438,Bellevue Hospital Center,50 to 69,100,F,Black/African American,Not Span/Hispanic,4,Emergency,Home or Self Care,2017,122,Pneumonia (except that caused by tuberculosis or sexually transmitted disease),193,DX ULTRASOUND HEART,139,Other pneumonia,04,Diseases and Disorders of the Respiratory System,2,Moderate,Minor,Medical,Medicare,Medicare,Medicaid,,N,Y,26595.67,17147.51
New York City,Manhattan,7002001,001438,Bellevue Hospital Center,70 or Older,112,F,Other Race,Not Span/Hispanic,5,Emergency,Home or Self Care,2017,122,Pneumonia (except that caused by tuberculosis or sexually transmitted disease),231,OTHER THERAPEUTIC PRCS,139,Other pneumonia,04,Diseases and Disorders of the Respiratory System,1,Minor,Minor,Medical,Medicaid,,,,N,Y,28042.32,18080.23
New York City,Manhattan,7002001,001438,Bellevue Hospital Center,30 to 49,113,M,Other Race,Spanish/Hispanic,3,Emergency,Home or Self Care,2017,122,Pneumonia (except that caused by tuberculosis or sexually transmitted disease),231,OTHER THERAPEUTIC PRCS,139,Other pneumonia,04,Diseases and Disorders of the Respiratory System,2,Moderate,Minor,Medical,Medicaid,,,,N,Y,20262.87,13064.44
New York City,Manhattan,7002001,001438,Bellevue Hospital Center,0 to 17,113,F,Other Race,Spanish/Hispanic,1,Emergency,Home or Self Care,2017,122,Pneumonia (except that caused by tuberculosis or sexually transmitted disease),231,OTHER THERAPEUTIC PRCS,139,Other pneumonia,04,Diseases and Disorders of the Respiratory System,1,Minor,Minor,Medical,Medicaid,Medicaid,,,N,Y,6821.98,4398.46
New York City,Manhattan,7002001,001438,Bellevue Hospital Center,18 to 29,111,F,Other Race,Not Span/Hispanic,1,Emergency,Home or Self Care,2017,122,Pneumonia (except that caused by tuberculosis or sexually transmitted disease),231,OTHER THERAPEUTIC PRCS,139,Other pneumonia,04,Diseases and Disorders of the Respiratory System,1,Minor,Minor,Medical,Medicaid,Medicaid,,,N,Y,9287.07,5987.82
New York City,Manhattan,7002001,001438,Bellevue Hospital Center,70 or Older,100,F,Other Race,Not Span/Hispanic,35,Emergency,Skilled Nursing Home,2017,122,Pneumonia (except that caused by tuberculosis or sexually transmitted disease),062,OT DX CARDIOVASC PRCS,139,Other pneumonia,04,Diseases and Disorders of the Respiratory System,3,Major,Major,Medical,Medicare,Medicare,Medicaid,,N,Y,195551.98,126081.75
New York City,Manhattan,7002001,001438,Bellevue Hospital Center,18 to 29,100,M,Other Race,Not Span/Hispanic,3,Emergency,Home or Self Care,2017,122,Pneumonia (except that caused by tuberculosis or sexually transmitted disease),231,OTHER THERAPEUTIC PRCS,139,Other pneumonia,04,Diseases and Disorders of the Respiratory System,3,Major,Moderate,Medical,Medicaid,,,,N,Y,18463.79,11904.49
New York City,Manhattan,7002001,001438,Bellevue Hospital Center,30 to 49,111,M,Other Race,Not Span/Hispanic,5,Emergency,Home or Self Care,2017,122,Pneumonia (except that caused by tuberculosis or sexually transmitted disease),231,OTHER THERAPEUTIC PRCS,139,Other pneumonia,04,Diseases and Disorders of the Respiratory System,2,Moderate,Minor,Medical,Medicaid,,,,N,Y,29460.19,18994.40
New York City,Manhattan,7002001,001438,Bellevue Hospital Center,50 to 69,100,M,Black/African American,Not Span/Hispanic,1,Emergency,Left Against Medical Advice,2017,122,Pneumonia (except that caused by tuberculosis or sexually transmitted disease),231,OTHER THERAPEUTIC PRCS,139,Other pneumonia,04,Diseases and Disorders of the Respiratory System,2,Moderate,Minor,Medical,Medicare,Medicaid,,,N,Y,7224.00,4657.66
New York City,Manhattan,7002001,001438,Bellevue Hospital Center,0 to 17,100,M,Other Race,Not Span/Hispanic,1,Emergency,Home or Self Care,2017,122,Pneumonia (except that caused by tuberculosis or sexually transmitted disease),231,OTHER THERAPEUTIC PRCS,139,Other pneumonia,04,Diseases and Disorders of the Respiratory System,1,Minor,Minor,Medical,Medicaid,Medicaid,,,N,Y,6852.30,4418.01
New York City,Manhattan,7002001,001438,Bellevue Hospital Center,50 to 69,100,M,White,Not Span/Hispanic,3,Emergency,Home or Self Care,2017,122,Pneumonia (except that caused by tuberculosis or sexually transmitted disease),000,NO PROC,139,Other pneumonia,04,Diseases and Disorders of the Respiratory System,2,Moderate,Moderate,Medical,Medicaid,Medicaid,,,N,Y,21423.95,13813.05
New York City,Manhattan,7002001,001438,Bellevue Hospital Center,18 to 29,OOS,M,Black/African American,Not Span/Hispanic,4,Emergency,Home or Self Care,2017,122,Pneumonia (except that caused by tuberculosis or sexually transmitted disease),231,OTHER THERAPEUTIC PRCS,139,Other pneumonia,04,Diseases and Disorders of the Respiratory System,1,Minor,Minor,Medical,Private Health Insurance,,,,N,Y,25843.74,16662.70
New York City,Manhattan,7002001,001438,Bellevue Hospital Center,50 to 69,112,M,White,Not Span/Hispanic,1,Emergency,Home or Self Care,2017,122,Pneumonia (except that caused by tuberculosis or sexually transmitted disease),000,NO PROC,139,Other pneumonia,04,Diseases and Disorders of the Respiratory System,1,Minor,Minor,Medical,Self-Pay,,,,N,Y,7282.17,4695.16
New York City,Manhattan,7002001,001438,Bellevue Hospital Center,0 to 17,100,F,Other Race,Not Span/Hispanic,12,Emergency,Home or Self Care,2017,122,Pneumonia (except that caused by tuberculosis or sexually transmitted disease),039,INCISION OF PLEURA,139,Other pneumonia,04,Diseases and Disorders of the Respiratory System,2,Moderate,Minor,Medical,Blue Cross/Blue Shield,,,,N,Y,81651.27,52644.49
New York City,Manhattan,7002001,001438,Bellevue Hospital Center,0 to 17,113,M,Other Race,Not Span/Hispanic,4,Emergency,Home or Self Care,2017,122,Pneumonia (except that caused by tuberculosis or sexually transmitted disease),231,OTHER THERAPEUTIC PRCS,139,Other pneumonia,04,Diseases and Disorders of the Respiratory System,1,Minor,Minor,Medical,Medicaid,Medicaid,,,N,Y,26894.00,17339.85
New York City,Manhattan,7002001,001438,Bellevue Hospital Center,50 to 69,113,M,Black/African American,Not Span/Hispanic,6,Emergency,Home or Self Care,2017,122,Pneumonia (except that caused by tuberculosis or sexually transmitted disease),000,NO PROC,139,Other pneumonia,04,Diseases and Disorders of the Respiratory System,2,Moderate,Minor,Medical,Self-Pay,,,,N,Y,34351.17,22147.85
New York City,Manhattan,7002001,001438,Bellevue Hospital Center,50 to 69,104,M,Black/African American,Not Span/Hispanic,17,Emergency,Home or Self Care,2017,122,Pneumonia (except that caused by tuberculosis or sexually transmitted disease),000,NO PROC,139,Other pneumonia,04,Diseases and Disorders of the Respiratory System,3,Major,Major,Medical,Medicaid,,,,N,N,88902.20,57319.52
New York City,Manhattan,7002001,001438,Bellevue Hospital Center,0 to 17,104,F,Other Race,Spanish/Hispanic,2,Emergency,Home or Self Care,2017,122,Pneumonia (except that caused by tuberculosis or sexually transmitted disease),000,NO PROC,139,Other pneumonia,04,Diseases and Disorders of the Respiratory System,1,Minor,Minor,Medical,Medicaid,Medicaid,,,N,Y,12402.92,7996.76
New York City,Manhattan,7002001,001438,Bellevue Hospital Center,30 to 49,113,M,Other Race,Not Span/Hispanic,2,Emergency,Home or Self Care,2017,122,Pneumonia (except that caused by tuberculosis or sexually transmitted disease),000,NO PROC,139,Other pneumonia,04,Diseases and Disorders of the Respiratory System,2,Moderate,Moderate,Medical,Medicaid,Medicaid,,,N,Y,13832.87,8918.72
New York City,Manhattan,7002001,001438,Bellevue Hospital Center,70 or Older,100,F,Other Race,Not Span/Hispanic,2,Emergency,Another Type Not Listed,2017,122,Pneumonia (except that caused by tuberculosis or sexually transmitted disease),180,OTHER CT SCAN,139,Other pneumonia,04,Diseases and Disorders of the Respiratory System,2,Moderate,Minor,Medical,Medicaid,Medicaid,,,N,Y,18120.64,11683.25
New York City,Manhattan,7002001,001438,Bellevue Hospital Center,30 to 49,100,M,Black/African American,Not Span/Hispanic,4,Emergency,Home or Self Care,2017,122,Pneumonia (except that caused by tuberculosis or sexually transmitted disease),000,NO PROC,139,Other pneumonia,04,Diseases and Disorders of the Respiratory System,3,Major,Moderate,Medical,Medicaid,Medicaid,,,N,Y,23884.74,15399.64
New York City,Manhattan,7002001,001438,Bellevue Hospital Center,50 to 69,107,F,Other Race,Spanish/Hispanic,4,Emergency,Home or Self Care,2017,122,Pneumonia (except that caused by tuberculosis or sexually transmitted disease),000,NO PROC,139,Other pneumonia,04,Diseases and Disorders of the Respiratory System,2,Moderate,Moderate,Medical,Medicaid,Medicaid,,,N,Y,28662.80,18480.28
New York City,Manhattan,7002001,001438,Bellevue Hospital Center,70 or Older,112,F,Other Race,Not Span/Hispanic,4,Emergency,Home w/ Home Health Services,2017,122,Pneumonia (except that caused by tuberculosis or sexually transmitted disease),216,RESP INTUB/MECH VENTIL,139,Other pneumonia,04,Diseases and Disorders of the Respiratory System,3,Major,Major,Medical,Medicare,Medicare,Medicaid,,N,Y,24748.46,15956.52
New York City,Manhattan,7002001,001438,Bellevue Hospital Center,30 to 49,100,M,Other Race,Not Span/Hispanic,1,Emergency,Home or Self Care,2017,122,Pneumonia (except that caused by tuberculosis or sexually transmitted disease),231,OTHER THERAPEUTIC PRCS,139,Other pneumonia,04,Diseases and Disorders of the Respiratory System,1,Minor,Minor,Medical,Private Health Insurance,,,,N,Y,7317.75,4718.10