Hospital Service Area,Hospital County,Operating Certificate Number,Permanent Facility Id,Facility Name,Age Group,Zip Code - 3 digits,Gender,Race,Ethnicity,Length of Stay,Type of Admission,Patient Disposition,Discharge Year,CCS Diagnosis Code,CCS Diagnosis Description,CCS Procedure Code,CCS Procedure Description,APR DRG Code,APR DRG Description,APR MDC Code,APR MDC Description,APR Severity of Illness Code,APR Severity of Illness Description,APR Risk of Mortality,APR Medical Surgical Description,Payment Typology 1,Payment Typology 2,Payment Typology 3,Birth Weight,Abortion Edit Indicator,Emergency Department Indicator,Total Charges,Total Costs
New York City,Kings,7002053,001304,NYU Langone Hospital-Brooklyn,70 or Older,112,M,White,Not Span/Hispanic,1,Emergency,Home or Self Care,2019,RSP002,PNEUMONIA (EXCEPT THAT CAUSED BY TUBERCULOSIS),,,139,OTHER PNEUMONIA,04,DISEASES AND DISORDERS OF THE RESPIRATORY SYSTEM,2,Moderate,Moderate,Medical,Medicare,Medicare,,,,true,24464.87,5861.77
New York City,Kings,7002053,001304,NYU Langone Hospital-Brooklyn,50 to 69,112,M,White,Spanish/Hispanic,1,Emergency,Home or Self Care,2019,RSP002,PNEUMONIA (EXCEPT THAT CAUSED BY TUBERCULOSIS),,,139,OTHER PNEUMONIA,04,DISEASES AND DISORDERS OF THE RESPIRATORY SYSTEM,1,Minor,Minor,Medical,Medicaid,,,,,true,29634.74,8906.79
New York City,Kings,7002053,001304,NYU Langone Hospital-Brooklyn,70 or Older,112,F,Black/African American,Not Span/Hispanic,4,Emergency,Home w/ Home Health Services,2019,RSP002,PNEUMONIA (EXCEPT THAT CAUSED BY TUBERCULOSIS),ESA001,HEMODIALYSIS,139,OTHER PNEUMONIA,04,DISEASES AND DISORDERS OF THE RESPIRATORY SYSTEM,3,Major,Major,Medical,Medicare,Medicaid,,,,true,85464.93,28212.16
New York City,Kings,7002053,001304,NYU Langone Hospital-Brooklyn,70 or Older,112,M,White,Not Span/Hispanic,4,Emergency,Skilled Nursing Home,2019,RSP003,INFLUENZA,,,139,OTHER PNEUMONIA,04,DISEASES AND DISORDERS OF THE RESPIRATORY SYSTEM,3,Major,Major,Medical,Medicare,Private Health Insurance,,,,true,58368.89,17114.51
New York City,Kings,7002053,001304,NYU Langone Hospital-Brooklyn,70 or Older,112,F,Other Race,Spanish/Hispanic,1,Emergency,Home or Self Care,2019,RSP002,PNEUMONIA (EXCEPT THAT CAUSED BY TUBERCULOSIS),,,139,OTHER PNEUMONIA,04,DISEASES AND DISORDERS OF THE RESPIRATORY SYSTEM,2,Moderate,Minor,Medical,Medicare,,,,,true,19698.56,4914.59
New York City,Kings,7002053,001304,NYU Langone Hospital-Brooklyn,70 or Older,112,M,White,Not Span/Hispanic,2,Emergency,Home or Self Care,2019,RSP002,PNEUMONIA (EXCEPT THAT CAUSED BY TUBERCULOSIS),,,139,OTHER PNEUMONIA,04,DISEASES AND DISORDERS OF THE RESPIRATORY SYSTEM,1,Minor,Moderate,Medical,Medicare,Blue Cross/Blue Shield,,,,true,42694.02,14674.99
New York City,Kings,7002053,001304,NYU Langone Hospital-Brooklyn,70 or Older,112,F,Other Race,Not Span/Hispanic,5,Emergency,Skilled Nursing Home,2019,RSP002,PNEUMONIA (EXCEPT THAT CAUSED BY TUBERCULOSIS),,,139,OTHER PNEUMONIA,04,DISEASES AND DISORDERS OF THE RESPIRATORY SYSTEM,3,Major,Major,Medical,Medicare,Medicaid,,,,true,63069.73,25517.24
New York City,Kings,7002053,001304,NYU Langone Hospital-Brooklyn,70 or Older,112,M,White,Not Span/Hispanic,3,Emergency,Home w/ Home Health Services,2019,RSP002,PNEUMONIA (EXCEPT THAT CAUSED BY TUBERCULOSIS),,,139,OTHER PNEUMONIA,04,DISEASES AND DISORDERS OF THE RESPIRATORY SYSTEM,2,Moderate,Moderate,Medical,Medicare,,,,,true,51976.53,13142.65
New York City,Kings,7002053,001304,NYU Langone Hospital-Brooklyn,70 or Older,112,F,White,Not Span/Hispanic,4,Emergency,Skilled Nursing Home,2019,RSP002,PNEUMONIA (EXCEPT THAT CAUSED BY TUBERCULOSIS),,,139,OTHER PNEUMONIA,04,DISEASES AND DISORDERS OF THE RESPIRATORY SYSTEM,4,Extreme,Major,Medical,Medicare,Blue Cross/Blue Shield,,,,true,40532.22,15004.39
New York City,Kings,7002053,001304,NYU Langone Hospital-Brooklyn,70 or Older,112,M,White,Not Span/Hispanic,3,Emergency,Home w/ Home Health Services,2019,RSP002,PNEUMONIA (EXCEPT THAT CAUSED BY TUBERCULOSIS),,,139,OTHER PNEUMONIA,04,DISEASES AND DISORDERS OF THE RESPIRATORY SYSTEM,3,Major,Major,Medical,Medicare,Medicaid,,,,true,49802.53,12873.31
New York City,Kings,7002053,001304,NYU Langone Hospital-Brooklyn,50 to 69,112,M,Black/African American,Not Span/Hispanic,4,Emergency,Skilled Nursing Home,2019,RSP003,INFLUENZA,,,139,OTHER PNEUMONIA,04,DISEASES AND DISORDERS OF THE RESPIRATORY SYSTEM,3,Major,Moderate,Medical,Medicaid,,,,,true,41988.05,14607.74
New York City,Kings,7002053,001304,NYU Langone Hospital-Brooklyn,70 or Older,112,F,White,Not Span/Hispanic,23,Emergency,Skilled Nursing Home,2019,RSP002,PNEUMONIA (EXCEPT THAT CAUSED BY TUBERCULOSIS),RES004,BRONCHOSCOPY (THERAPEUTIC),139,OTHER PNEUMONIA,04,DISEASES AND DISORDERS OF THE RESPIRATORY SYSTEM,4,Extreme,Extreme,Medical,Medicare,Medicare,,,,true,268526.55,105706.57
New York City,Kings,7002053,001304,NYU Langone Hospital-Brooklyn,0 to 17,112,F,Other Race,Spanish/Hispanic,6,Emergency,Home or Self Care,2019,RSP002,PNEUMONIA (EXCEPT THAT CAUSED BY TUBERCULOSIS),,,139,OTHER PNEUMONIA,04,DISEASES AND DISORDERS OF THE RESPIRATORY SYSTEM,2,Moderate,Minor,Medical,Medicaid,,,,,true,44869.98,16832.9
New York City,Kings,7002053,001304,NYU Langone Hospital-Brooklyn,70 or Older,112,F,White,Not Span/Hispanic,1,Emergency,Home or Self Care,2019,RSP002,PNEUMONIA (EXCEPT THAT CAUSED BY TUBERCULOSIS),,,139,OTHER PNEUMONIA,04,DISEASES AND DISORDERS OF THE RESPIRATORY SYSTEM,2,Moderate,Minor,Medical,Medicare,Medicare,Medicaid,,,true,16964.55,4690.16
New York City,Kings,7002053,001304,NYU Langone Hospital-Brooklyn,70 or Older,112,M,White,Not Span/Hispanic,5,Emergency,Expired,2019,RSP002,PNEUMONIA (EXCEPT THAT CAUSED BY TUBERCULOSIS),ESA004,NON-INVASIVE VENTILATION,139,OTHER PNEUMONIA,04,DISEASES AND DISORDERS OF THE RESPIRATORY SYSTEM,4,Extreme,Extreme,Medical,Medicare,,,,,true,135081.98,37282.51
New York City,Kings,7002053,001304,NYU Langone Hospital-Brooklyn,70 or Older,112,F,Other Race,Not Span/Hispanic,1,Emergency,Home w/ Home Health Services,2019,RSP002,PNEUMONIA (EXCEPT THAT CAUSED BY TUBERCULOSIS),ADM015,ADMINISTRATION OF ANTIBIOTICS,139,OTHER PNEUMONIA,04,DISEASES AND DISORDERS OF THE RESPIRATORY SYSTEM,3,Major,Moderate,Medical,Medicare,,,,,true,19547.04,4935.99
New York City,Kings,7002053,001304,NYU Langone Hospital-Brooklyn,70 or Older,112,F,White,Not Span/Hispanic,7,Emergency,Home w/ Home Health Services,2019,RSP002,PNEUMONIA (EXCEPT THAT CAUSED BY TUBERCULOSIS),,,139,OTHER PNEUMONIA,04,DISEASES AND DISORDERS OF THE RESPIRATORY SYSTEM,3,Major,Major,Medical,Medicare,Medicare,,,,true,80751.31,25870.6
New York City,Kings,7002053,001304,NYU Langone Hospital-Brooklyn,70 or Older,112,F,Other Race,Spanish/Hispanic,6,Emergency,Home w/ Home Health Services,2019,RSP002,PNEUMONIA (EXCEPT THAT CAUSED BY TUBERCULOSIS),ADM010,VACCINATIONS,139,OTHER PNEUMONIA,04,DISEASES AND DISORDERS OF THE RESPIRATORY SYSTEM,3,Major,Major,Medical,Medicare,Medicaid,,,,true,90965.31,24841.13
New York City,Kings,7002053,001304,NYU Langone Hospital-Brooklyn,50 to 69,112,F,White,Not Span/Hispanic,5,Emergency,Home or Self Care,2019,RSP002,PNEUMONIA (EXCEPT THAT CAUSED BY TUBERCULOSIS),,,139,OTHER PNEUMONIA,04,DISEASES AND DISORDERS OF THE RESPIRATORY SYSTEM,3,Major,Major,Medical,Blue Cross/Blue Shield,Medicaid,,,,true,62649.76,19118.19
New York City,Kings,7002053,001304,NYU Langone Hospital-Brooklyn,70 or Older,112,F,White,Unknown,23,Emergency,Home or Self Care,2019,RSP002,PNEUMONIA (EXCEPT THAT CAUSED BY TUBERCULOSIS),ADM015,ADMINISTRATION OF ANTIBIOTICS,139,OTHER PNEUMONIA,04,DISEASES AND DISORDERS OF THE RESPIRATORY SYSTEM,4,Extreme,Major,Medical,Medicaid,,,,,true,189253,74328.72
New York City,Kings,7002053,001304,NYU Langone Hospital-Brooklyn,70 or Older,112,F,White,Not Span/Hispanic,3,Emergency,Home or Self Care,2019,RSP002,PNEUMONIA (EXCEPT THAT CAUSED BY TUBERCULOSIS),,,139,OTHER PNEUMONIA,04,DISEASES AND DISORDERS OF THE RESPIRATORY SYSTEM,1,Minor,Moderate,Medical,Medicare,,,,,true,33372.05,11565.62
New York City,Kings,7002053,001304,NYU Langone Hospital-Brooklyn,50 to 69,112,F,Black/African American,Unknown,2,Emergency,Home w/ Home Health Services,2019,RSP002,PNEUMONIA (EXCEPT THAT CAUSED BY TUBERCULOSIS),,,139,OTHER PNEUMONIA,04,DISEASES AND DISORDERS OF THE RESPIRATORY SYSTEM,3,Major,Moderate,Medical,Medicaid,,,,,true,44643.8,10743.95
New York City,Kings,7002053,001304,NYU Langone Hospital-Brooklyn,50 to 69,112,F,White,Not Span/Hispanic,2,Emergency,Home or Self Care,2019,RSP002,PNEUMONIA (EXCEPT THAT CAUSED BY TUBERCULOSIS),ADM015,ADMINISTRATION OF ANTIBIOTICS,139,OTHER PNEUMONIA,04,DISEASES AND DISORDERS OF THE RESPIRATORY SYSTEM,3,Major,Moderate,Medical,Medicaid,,,,,true,44611.98,9686.96
New York City,Kings,7002053,001304,NYU Langone Hospital-Brooklyn,70 or Older,112,F,White,Not Span/Hispanic,1,Emergency,Home or Self Care,2019,RSP002,PNEUMONIA (EXCEPT THAT CAUSED BY TUBERCULOSIS),ESA001,HEMODIALYSIS,139,OTHER PNEUMONIA,04,DISEASES AND DISORDERS OF THE RESPIRATORY SYSTEM,2,Moderate,Moderate,Medical,Medicare,Medicare,,,,true,59120.52,18827.1
New York City,Kings,7002053,001304,NYU Langone Hospital-Brooklyn,30 to 49,112,F,White,Not Span/Hispanic,5,Emergency,Home or Self Care,2019,RSP003,INFLUENZA,ESA004,NON-INVASIVE VENTILATION,139,OTHER PNEUMONIA,04,DISEASES AND DISORDERS OF THE RESPIRATORY SYSTEM,3,Major,Major,Medical,Medicare,,,,,true,79330.74,27089.61
New York City,Kings,7002053,001304,NYU Langone Hospital-Brooklyn,70 or Older,112,M,White,Not Span/Hispanic,4,Emergency,Skilled Nursing Home,2019,RSP002,PNEUMONIA (EXCEPT THAT CAUSED BY TUBERCULOSIS),,,139,OTHER PNEUMONIA,04,DISEASES AND DISORDERS OF THE RESPIRATORY SYSTEM,1,Minor,Moderate,Medical,Medicare,,,,,true,42058.61,14680.97
New York City,Kings,7002053,001304,NYU Langone Hospital-Brooklyn,50 to 69,112,M,Other Race,Not Span/Hispanic,3,Emergency,Home or Self Care,2019,RSP002,PNEUMONIA (EXCEPT THAT CAUSED BY TUBERCULOSIS),OTR004,ISOLATION PROCEDURES,139,OTHER PNEUMONIA,04,DISEASES AND DISORDERS OF THE RESPIRATORY SYSTEM,2,Moderate,Minor,Medical,Medicaid,,,,,true,49002.74,12632.63
New York City,Kings,7002053,001304,NYU Langone Hospital-Brooklyn,70 or Older,112,M,Other Race,Unknown,4,Emergency,Home or Self Care,2019,RSP002,PNEUMONIA (EXCEPT THAT CAUSED BY TUBERCULOSIS),ADM015,ADMINISTRATION OF ANTIBIOTICS,139,OTHER PNEUMONIA,04,DISEASES AND DISORDERS OF THE RESPIRATORY SYSTEM,3,Major,Major,Medical,Medicaid,,,,,true,42771.18,14478.28
New York City,Kings,7002053,001304,NYU Langone Hospital-Brooklyn,50 to 69,112,F,Other Race,Not Span/Hispanic,3,Emergency,Home w/ Home Health Services,2019,RSP002,PNEUMONIA (EXCEPT THAT CAUSED BY TUBERCULOSIS),,,139,OTHER PNEUMONIA,04,DISEASES AND DISORDERS OF THE RESPIRATORY SYSTEM,3,Major,Moderate,Medical,Medicare,Medicaid,,,,true,36717.63,11241.76
New York City,Kings,7002053,001304,NYU Langone Hospital-Brooklyn,70 or Older,112,F,White,Not Span/Hispanic,5,Emergency,Home or Self Care,2019,RSP002,PNEUMONIA (EXCEPT THAT CAUSED BY TUBERCULOSIS),,,139,OTHER PNEUMONIA,04,DISEASES AND DISORDERS OF THE RESPIRATORY SYSTEM,2,Moderate,Moderate,Medical,Medicare,,,,,true,74766.68,24092.31
New York City,Kings,7002053,001304,NYU Langone Hospital-Brooklyn,70 or Older,112,M,Other Race,Not Span/Hispanic,4,Emergency,Skilled Nursing Home,2019,RSP002,PNEUMONIA (EXCEPT THAT CAUSED BY TUBERCULOSIS),,,139,OTHER PNEUMONIA,04,DISEASES AND DISORDERS OF THE RESPIRATORY SYSTEM,3,Major,Moderate,Medical,Medicare,,,,,true,51473.27,16145.5
New York City,Kings,7002053,001304,NYU Langone Hospital-Brooklyn,70 or Older,112,M,White,Not Span/Hispanic,4,Emergency,Home or Self Care,2019,RSP003,INFLUENZA,IMG006,COMPUTERIZED TOMOGRAPHY (CT) WITH CONTRAST,139,OTHER PNEUMONIA,04,DISEASES AND DISORDERS OF THE RESPIRATORY SYSTEM,3,Major,Extreme,Medical,Medicare,,,,,true,58844.81,17763.98
New York City,Kings,7002053,001304,NYU Langone Hospital-Brooklyn,70 or Older,112,M,Other Race,Not Span/Hispanic,1,Emergency,Home or Self Care,2019,RSP002,PNEUMONIA (EXCEPT THAT CAUSED BY TUBERCULOSIS),,,139,OTHER PNEUMONIA,04,DISEASES AND DISORDERS OF THE RESPIRATORY SYSTEM,3,Major,Major,Medical,Medicare,,,,,true,23807.64,5646.19
New York City,Kings,7002053,001304,NYU Langone Hospital-Brooklyn,70 or Older,,F,Other Race,Unknown,5,Emergency,Home or Self Care,2019,RSP002,PNEUMONIA (EXCEPT THAT CAUSED BY TUBERCULOSIS),,,139,OTHER PNEUMONIA,04,DISEASES AND DISORDERS OF THE RESPIRATORY SYSTEM,3,Major,Major,Medical,Medicare,Medicaid,,,,true,70162.01,21001.81
New York City,Kings,7002053,001304,NYU Langone Hospital-Brooklyn,50 to 69,112,F,White,Not Span/Hispanic,1,Emergency,Home or Self Care,2019,RSP002,PNEUMONIA (EXCEPT THAT CAUSED BY TUBERCULOSIS),,,139,OTHER PNEUMONIA,04,DISEASES AND DISORDERS OF THE RESPIRATORY SYSTEM,2,Moderate,Moderate,Medical,Medicare,Medicaid,,,,true,37358.16,12691.22
New York City,Kings,7002053,001304,NYU Langone Hospital-Brooklyn,50 to 69,112,M,White,Not Span/Hispanic,4,Emergency,Home or Self Care,2019,RSP002,PNEUMONIA (EXCEPT THAT CAUSED BY TUBERCULOSIS),ADM015,ADMINISTRATION OF ANTIBIOTICS,139,OTHER PNEUMONIA,04,DISEASES AND DISORDERS OF THE RESPIRATORY SYSTEM,3,Major,Major,Medical,Medicare,Medicaid,,,,true,40601.08,14297.13
New York City,Kings,7002053,001304,NYU Langone Hospital-Brooklyn,50 to 69,112,M,White,Not Span/Hispanic,1,Emergency,Home or Self Care,2019,RSP002,PNEUMONIA (EXCEPT THAT CAUSED BY TUBERCULOSIS),,,139,OTHER PNEUMONIA,04,DISEASES AND DISORDERS OF THE RESPIRATORY SYSTEM,1,Minor,Minor,Medical,Private Health Insurance,,,,,true,22198.75,5580.79
New York City,Kings,7002053,001304,NYU Langone Hospital-Brooklyn,70 or Older,112,F,White,Not Span/Hispanic,1,Emergency,Home w/ Home Health Services,2019,RSP002,PNEUMONIA (EXCEPT THAT CAUSED BY TUBERCULOSIS),,,139,OTHER PNEUMONIA,04,DISEASES AND DISORDERS OF THE RESPIRATORY SYSTEM,2,Moderate,Major,Medical,Medicare,Medicaid,,,,true,25215.7,6036.71
New York City,Kings,7002053,001304,NYU Langone Hospital-Brooklyn,70 or Older,112,M,Other Race,Not Span/Hispanic,6,Emergency,Skilled Nursing Home,2019,RSP002,PNEUMONIA (EXCEPT THAT CAUSED BY TUBERCULOSIS),,,139,OTHER PNEUMONIA,04,DISEASES AND DISORDERS OF THE RESPIRATORY SYSTEM,3,Major,Major,Medical,Medicaid,,,,,true,71264.38,22229.93
New York City,Kings,7002053,001304,NYU Langone Hospital-Brooklyn,18 to 29,112,F,Other Race,Spanish/Hispanic,1,Emergency,Home or Self Care,2019,RSP002,PNEUMONIA (EXCEPT THAT CAUSED BY TUBERCULOSIS),,,139,OTHER PNEUMONIA,04,DISEASES AND DISORDERS OF THE RESPIRATORY SYSTEM,2,Moderate,Minor,Medical,Medicaid,,,,,true,21892.25,5464.45
New York City,Kings,7002053,001304,NYU Langone Hospital-Brooklyn,70 or Older,112,F,White,Not Span/Hispanic,2,Emergency,Home or Self Care,2019,RSP002,PNEUMONIA (EXCEPT THAT CAUSED BY TUBERCULOSIS),,,139,OTHER PNEUMONIA,04,DISEASES AND DISORDERS OF THE RESPIRATORY SYSTEM,2,Moderate,Minor,Medical,Medicare,Medicaid,,,,true,46829.23,16273.95
New York City,Kings,7002053,001304,NYU Langone Hospital-Brooklyn,50 to 69,112,M,White,Not Span/Hispanic,1,Emergency,Home or Self Care,2019,RSP002,PNEUMONIA (EXCEPT THAT CAUSED BY TUBERCULOSIS),,,139,OTHER PNEUMONIA,04,DISEASES AND DISORDERS OF THE RESPIRATORY SYSTEM,2,Moderate,Minor,Medical,Medicaid,,,,,true,27474.67,8936.61
New York City,Kings,7002053,001304,NYU Langone Hospital-Brooklyn,50 to 69,112,M,White,Not Span/Hispanic,2,Emergency,Left Against Medical Advice,2019,RSP002,PNEUMONIA (EXCEPT THAT CAUSED BY TUBERCULOSIS),,,139,OTHER PNEUMONIA,04,DISEASES AND DISORDERS OF THE RESPIRATORY SYSTEM,2,Moderate,Moderate,Medical,Blue Cross/Blue Shield,,,,,true,34450.28,9524.51
New York City,Kings,7002053,001304,NYU Langone Hospital-Brooklyn,70 or Older,112,F,Other Race,Spanish/Hispanic,4,Emergency,Home or Self Care,2019,RSP002,PNEUMONIA (EXCEPT THAT CAUSED BY TUBERCULOSIS),,,139,OTHER PNEUMONIA,04,DISEASES AND DISORDERS OF THE RESPIRATORY SYSTEM,2,Moderate,Moderate,Medical,Blue Cross/Blue Shield,,,,,true,57146.64,16165.91
New York City,Kings,7002053,001304,NYU Langone Hospital-Brooklyn,50 to 69,112,M,White,Not Span/Hispanic,8,Emergency,Home or Self Care,2019,RSP002,PNEUMONIA (EXCEPT THAT CAUSED BY TUBERCULOSIS),ADM010,VACCINATIONS,139,OTHER PNEUMONIA,04,DISEASES AND DISORDERS OF THE RESPIRATORY SYSTEM,2,Moderate,Minor,Medical,Medicare,Blue Cross/Blue Shield,,,,true,83668.09,29513.44
New York City,Kings,7002053,001304,NYU Langone Hospital-Brooklyn,70 or Older,112,M,White,Not Span/Hispanic,3,Emergency,Home w/ Home Health Services,2019,RSP002,PNEUMONIA (EXCEPT THAT CAUSED BY TUBERCULOSIS),,,139,OTHER PNEUMONIA,04,DISEASES AND DISORDERS OF THE RESPIRATORY SYSTEM,3,Major,Major,Medical,Medicare,Medicaid,,,,true,47303.28,12932.59
New York City,Kings,7002053,001304,NYU Langone Hospital-Brooklyn,30 to 49,112,M,White,Not Span/Hispanic,2,Emergency,Home or Self Care,2019,RSP003,INFLUENZA,OTR004,ISOLATION PROCEDURES,139,OTHER PNEUMONIA,04,DISEASES AND DISORDERS OF THE RESPIRATORY SYSTEM,3,Major,Major,Medical,Private Health Insurance,,,,,true,42415.95,13175.77
New York City,Kings,7002053,001304,NYU Langone Hospital-Brooklyn,50 to 69,112,M,White,Not Span/Hispanic,4,Emergency,Home or Self Care,2019,RSP002,PNEUMONIA (EXCEPT THAT CAUSED BY TUBERCULOSIS),,,139,OTHER PNEUMONIA,04,DISEASES AND DISORDERS OF THE RESPIRATORY SYSTEM,4,Extreme,Major,Medical,Private Health Insurance,,,,,true,79860.1,15716.37
New York City,Kings,7002053,001304,NYU Langone Hospital-Brooklyn,70 or Older,112,F,White,Not Span/Hispanic,7,Emergency,Hospice - Home,2019,RSP002,PNEUMONIA (EXCEPT THAT CAUSED BY TUBERCULOSIS),ESA004,NON-INVASIVE VENTILATION,139,OTHER PNEUMONIA,04,DISEASES AND DISORDERS OF THE RESPIRATORY SYSTEM,4,Extreme,Extreme,Medical,Medicare,,,,,true,107980.08,41561.53
New York City,Kings,7002053,001304,NYU Langone Hospital-Brooklyn,70 or Older,112,M,White,Not Span/Hispanic,8,Emergency,Skilled Nursing Home,2019,RSP002,PNEUMONIA (EXCEPT THAT CAUSED BY TUBERCULOSIS),ESA004,NON-INVASIVE VENTILATION,139,OTHER PNEUMONIA,04,DISEASES AND DISORDERS OF THE RESPIRATORY SYSTEM,4,Extreme,Extreme,Medical,Medicare,Federal/State/Local/VA,,,,true,142975.35,50744.47
New York City,Kings,7002053,001304,NYU Langone Hospital-Brooklyn,70 or Older,112,M,White,Not Span/Hispanic,3,Emergency,Skilled Nursing Home,2019,RSP002,PNEUMONIA (EXCEPT THAT CAUSED BY TUBERCULOSIS),,,139,OTHER PNEUMONIA,04,DISEASES AND DISORDERS OF THE RESPIRATORY SYSTEM,4,Extreme,Extreme,Medical,Medicare,Blue Cross/Blue Shield,,,,true,69825.62,23465.29
New York City,Kings,7002053,001304,NYU Langone Hospital-Brooklyn,50 to 69,112,F,White,Not Span/Hispanic,5,Emergency,Home or Self Care,2019,RSP002,PNEUMONIA (EXCEPT THAT CAUSED BY TUBERCULOSIS),,,139,OTHER PNEUMONIA,04,DISEASES AND DISORDERS OF THE RESPIRATORY SYSTEM,3,Major,Major,Medical,Medicare,Private Health Insurance,,,,true,56389.85,19580.93
New York City,Kings,7002053,001304,NYU Langone Hospital-Brooklyn,70 or Older,112,F,Other Race,Spanish/Hispanic,2,Emergency,Home or Self Care,2019,RSP002,PNEUMONIA (EXCEPT THAT CAUSED BY TUBERCULOSIS),ADM015,ADMINISTRATION OF ANTIBIOTICS,139,OTHER PNEUMONIA,04,DISEASES AND DISORDERS OF THE RESPIRATORY SYSTEM,1,Minor,Minor,Medical,Medicare,Medicaid,,,,true,38783.45,11606.18
New York City,Kings,7002053,001304,NYU Langone Hospital-Brooklyn,70 or Older,112,F,Other Race,Not Span/Hispanic,1,Emergency,Home or Self Care,2019,RSP002,PNEUMONIA (EXCEPT THAT CAUSED BY TUBERCULOSIS),ADM015,ADMINISTRATION OF ANTIBIOTICS,139,OTHER PNEUMONIA,04,DISEASES AND DISORDERS OF THE RESPIRATORY SYSTEM,1,Minor,Minor,Medical,Medicare,Medicare,,,,true,29491.5,5994.2
New York City,Kings,7002053,001304,NYU Langone Hospital-Brooklyn,70 or Older,112,F,White,Not Span/Hispanic,1,Emergency,Home w/ Home Health Services,2019,RSP002,PNEUMONIA (EXCEPT THAT CAUSED BY TUBERCULOSIS),URN006,BLADDER CATHETERIZATION AND DRAINAGE,139,OTHER PNEUMONIA,04,DISEASES AND DISORDERS OF THE RESPIRATORY SYSTEM,3,Major,Moderate,Medical,Medicare,Medicare,,,,true,52118.22,16952.57
New York City,Kings,7002053,001304,NYU Langone Hospital-Brooklyn,30 to 49,112,M,White,Not Span/Hispanic,1,Emergency,Home or Self Care,2019,RSP002,PNEUMONIA (EXCEPT THAT CAUSED BY TUBERCULOSIS),,,139,OTHER PNEUMONIA,04,DISEASES AND DISORDERS OF THE RESPIRATORY SYSTEM,3,Major,Minor,Medical,Private Health Insurance,,,,,true,23668.01,5420.7
New York City,Kings,7002053,001304,NYU Langone Hospital-Brooklyn,50 to 69,112,M,Black/African American,Not Span/Hispanic,5,Emergency,Home or Self Care,2019,RSP002,PNEUMONIA (EXCEPT THAT CAUSED BY TUBERCULOSIS),,,139,OTHER PNEUMONIA,04,DISEASES AND DISORDERS OF THE RESPIRATORY SYSTEM,3,Major,Moderate,Medical,Medicaid,,,,,true,105128.65,22008.8
New York City,Kings,7002053,001304,NYU Langone Hospital-Brooklyn,50 to 69,100,F,Other Race,Not Span/Hispanic,2,Emergency,Home or Self Care,2019,RSP002,PNEUMONIA (EXCEPT THAT CAUSED BY TUBERCULOSIS),OTR004,ISOLATION PROCEDURES,139,OTHER PNEUMONIA,04,DISEASES AND DISORDERS OF THE RESPIRATORY SYSTEM,3,Major,Major,Medical,Medicare,,,,,true,31257.2,8914.07
New York City,Kings,7002053,001304,NYU Langone Hospital-Brooklyn,70 or Older,112,M,White,Not Span/Hispanic,4,Emergency,Left Against Medical Advice,2019,RSP002,PNEUMONIA (EXCEPT THAT CAUSED BY TUBERCULOSIS),,,139,OTHER PNEUMONIA,04,DISEASES AND DISORDERS OF THE RESPIRATORY SYSTEM,4,Extreme,Extreme,Medical,Medicare,,,,,true,60586.51,18106.79
New York City,Kings,7002053,001304,NYU Langone Hospital-Brooklyn,70 or Older,112,M,White,Not Span/Hispanic,2,Emergency,Home w/ Home Health Services,2019,RSP002,PNEUMONIA (EXCEPT THAT CAUSED BY TUBERCULOSIS),,,139,OTHER PNEUMONIA,04,DISEASES AND DISORDERS OF THE RESPIRATORY SYSTEM,3,Major,Major,Medical,Medicare,Medicaid,,,,true,28066.78,8516.99
New York City,Kings,7002053,001304,NYU Langone Hospital-Brooklyn,18 to 29,112,M,White,Unknown,7,Emergency,Skilled Nursing Home,2019,RSP002,PNEUMONIA (EXCEPT THAT CAUSED BY TUBERCULOSIS),URN006,BLADDER CATHETERIZATION AND DRAINAGE,139,OTHER PNEUMONIA,04,DISEASES AND DISORDERS OF THE RESPIRATORY SYSTEM,4,Extreme,Major,Medical,Medicaid,,,,,true,92919.03,28223.55
New York City,Kings,7002053,001304,NYU Langone Hospital-Brooklyn,30 to 49,112,M,Other Race,Spanish/Hispanic,9,Emergency,Home or Self Care,2019,RSP002,PNEUMONIA (EXCEPT THAT CAUSED BY TUBERCULOSIS),RES001,BRONCHOSCOPY (DIAGNOSTIC),139,OTHER PNEUMONIA,04,DISEASES AND DISORDERS OF THE RESPIRATORY SYSTEM,3,Major,Major,Medical,Private Health Insurance,,,,,true,139489.08,38436.75
New York City,Kings,7002053,001304,NYU Langone Hospital-Brooklyn,0 to 17,112,F,White,Not Span/Hispanic,1,Emergency,Home or Self Care,2019,RSP002,PNEUMONIA (EXCEPT THAT CAUSED BY TUBERCULOSIS),ADM015,ADMINISTRATION OF ANTIBIOTICS,139,OTHER PNEUMONIA,04,DISEASES AND DISORDERS OF THE RESPIRATORY SYSTEM,2,Moderate,Moderate,Medical,Medicaid,,,,,true,15436.29,4009.11
New York City,Kings,7002053,001304,NYU Langone Hospital-Brooklyn,0 to 17,112,M,Other Race,Spanish/Hispanic,2,Emergency,Home or Self Care,2019,RSP002,PNEUMONIA (EXCEPT THAT CAUSED BY TUBERCULOSIS),MAM011,ELECTROENCEPHALOGRAM (EEG),139,OTHER PNEUMONIA,04,DISEASES AND DISORDERS OF THE RESPIRATORY SYSTEM,2,Moderate,Minor,Medical,Medicaid,,,,,true,21808.08,6911.81
New York City,Kings,7002053,001304,NYU Langone Hospital-Brooklyn,70 or Older,112,F,Other Race,Not Span/Hispanic,5,Emergency,Home or Self Care,2019,RSP002,PNEUMONIA (EXCEPT THAT CAUSED BY TUBERCULOSIS),,,139,OTHER PNEUMONIA,04,DISEASES AND DISORDERS OF THE RESPIRATORY SYSTEM,2,Moderate,Moderate,Medical,Medicare,Medicaid,,,,true,71721.95,19688.47
New York City,Kings,7002053,001304,NYU Langone Hospital-Brooklyn,50 to 69,112,F,White,Unknown,1,Emergency,Home or Self Care,2019,RSP002,PNEUMONIA (EXCEPT THAT CAUSED BY TUBERCULOSIS),ADM015,ADMINISTRATION OF ANTIBIOTICS,139,OTHER PNEUMONIA,04,DISEASES AND DISORDERS OF THE RESPIRATORY SYSTEM,1,Minor,Minor,Medical,Medicaid,,,,,true,24846.08,9010.24