Hospital Service Area,Hospital County,Operating Certificate Number,Permanent Facility Id,Facility Name,Age Group,Zip Code - 3 digits,Gender,Race,Ethnicity,Length of Stay,Type of Admission,Patient Disposition,Discharge Year,CCS Diagnosis Code,CCS Diagnosis Description,CCS Procedure Code,CCS Procedure Description,APR DRG Code,APR DRG Description,APR MDC Code,APR MDC Description,APR Severity of Illness Code,APR Severity of Illness Description,APR Risk of Mortality,APR Medical Surgical Description,Payment Typology 1,Payment Typology 2,Payment Typology 3,Birth Weight,Abortion Edit Indicator,Emergency Department Indicator,Total Charges,Total Costs
New York City,Manhattan,7002001,001438,Bellevue Hospital Center,0 to 17,104,M,Other Race,Spanish/Hispanic,4,Elective,Home or Self Care,2020,RSP002,PNEUMONIA (EXCEPT THAT CAUSED BY TUBERCULOSIS),IMG009,PLAIN RADIOGRAPHY,139,OTHER PNEUMONIA,04,DISEASES AND DISORDERS OF THE RESPIRATORY SYSTEM,1,Minor,Minor,Medical,Medicaid,,,,,Y,23968.31,13783.79
New York City,Manhattan,7002001,001438,Bellevue Hospital Center,18 to 29,100,F,Black/African American,Not Span/Hispanic,3,Emergency,Home or Self Care,2020,RSP003,INFLUENZA,IMG009,PLAIN RADIOGRAPHY,139,OTHER PNEUMONIA,04,DISEASES AND DISORDERS OF THE RESPIRATORY SYSTEM,2,Moderate,Moderate,Medical,Medicaid,,,,,Y,24200.55,13917.35
New York City,Manhattan,7002001,001438,Bellevue Hospital Center,50 to 69,100,F,Other Race,Unknown,3,Emergency,Home or Self Care,2020,RSP003,INFLUENZA,ADM015,ADMINISTRATION OF ANTIBIOTICS,139,OTHER PNEUMONIA,04,DISEASES AND DISORDERS OF THE RESPIRATORY SYSTEM,3,Major,Major,Medical,Self-Pay,,,,,Y,23443.89,13482.21
New York City,Manhattan,7002001,001438,Bellevue Hospital Center,50 to 69,100,F,Black/African American,Not Span/Hispanic,14,Emergency,Home or Self Care,2020,RSP002,PNEUMONIA (EXCEPT THAT CAUSED BY TUBERCULOSIS),,,139,OTHER PNEUMONIA,04,DISEASES AND DISORDERS OF THE RESPIRATORY SYSTEM,2,Moderate,Moderate,Medical,Medicare,Medicaid,,,,Y,89490.58,51464.6
New York City,Manhattan,7002001,001438,Bellevue Hospital Center,70 or Older,100,M,Other Race,Spanish/Hispanic,1,Emergency,Home or Self Care,2020,RSP003,INFLUENZA,ADM015,ADMINISTRATION OF ANTIBIOTICS,139,OTHER PNEUMONIA,04,DISEASES AND DISORDERS OF THE RESPIRATORY SYSTEM,2,Moderate,Moderate,Medical,Medicare,Medicaid,,,,Y,10447.35,6008.1
New York City,Manhattan,7002001,001438,Bellevue Hospital Center,50 to 69,112,M,Black/African American,Not Span/Hispanic,9,Emergency,Home or Self Care,2020,RSP002,PNEUMONIA (EXCEPT THAT CAUSED BY TUBERCULOSIS),IMG008,ULTRASONOGRAPHY,139,OTHER PNEUMONIA,04,DISEASES AND DISORDERS OF THE RESPIRATORY SYSTEM,3,Major,Extreme,Medical,Private Health Insurance,,,,,Y,73986.73,42548.58
New York City,Manhattan,7002001,001438,Bellevue Hospital Center,70 or Older,111,F,Other Race,Not Span/Hispanic,1,Emergency,Home or Self Care,2020,RSP002,PNEUMONIA (EXCEPT THAT CAUSED BY TUBERCULOSIS),ADM015,ADMINISTRATION OF ANTIBIOTICS,139,OTHER PNEUMONIA,04,DISEASES AND DISORDERS OF THE RESPIRATORY SYSTEM,3,Major,Moderate,Medical,Medicare,Medicaid,,,,Y,8692.15,4998.72
New York City,Manhattan,7002001,001438,Bellevue Hospital Center,30 to 49,112,M,Black/African American,Not Span/Hispanic,1,Emergency,Home or Self Care,2020,RSP003,INFLUENZA,ADM021,"ADMINISTRATION OF THERAPEUTIC SUBSTANCES, NEC",139,OTHER PNEUMONIA,04,DISEASES AND DISORDERS OF THE RESPIRATORY SYSTEM,3,Major,Moderate,Medical,Medicaid,,,,,Y,10110.86,5814.59
New York City,Manhattan,7002001,001438,Bellevue Hospital Center,50 to 69,112,M,Black/African American,Unknown,13,Emergency,Home or Self Care,2020,RSP002,PNEUMONIA (EXCEPT THAT CAUSED BY TUBERCULOSIS),ADM015,ADMINISTRATION OF ANTIBIOTICS,139,OTHER PNEUMONIA,04,DISEASES AND DISORDERS OF THE RESPIRATORY SYSTEM,2,Moderate,Moderate,Medical,Medicaid,,,,,Y,97346.86,55982.62
New York City,Manhattan,7002001,001438,Bellevue Hospital Center,50 to 69,113,F,Other Race,Spanish/Hispanic,3,Emergency,Home or Self Care,2020,RSP002,PNEUMONIA (EXCEPT THAT CAUSED BY TUBERCULOSIS),IMG006,COMPUTERIZED TOMOGRAPHY (CT) WITH CONTRAST,139,OTHER PNEUMONIA,04,DISEASES AND DISORDERS OF THE RESPIRATORY SYSTEM,3,Major,Minor,Medical,Medicaid,,,,,Y,25780.53,14825.97
New York City,Manhattan,7002001,001438,Bellevue Hospital Center,50 to 69,100,M,Black/African American,Spanish/Hispanic,2,Emergency,Home or Self Care,2020,RSP002,PNEUMONIA (EXCEPT THAT CAUSED BY TUBERCULOSIS),ADM015,ADMINISTRATION OF ANTIBIOTICS,139,OTHER PNEUMONIA,04,DISEASES AND DISORDERS OF THE RESPIRATORY SYSTEM,3,Major,Moderate,Medical,Medicaid,,,,,Y,16561.28,9524.13
New York City,Manhattan,7002001,001438,Bellevue Hospital Center,70 or Older,113,F,Other Race,Spanish/Hispanic,1,Emergency,Home or Self Care,2020,RSP003,INFLUENZA,IMG009,PLAIN RADIOGRAPHY,139,OTHER PNEUMONIA,04,DISEASES AND DISORDERS OF THE RESPIRATORY SYSTEM,1,Minor,Minor,Medical,Self-Pay,,,,,Y,8226.22,4730.77
New York City,Manhattan,7002001,001438,Bellevue Hospital Center,50 to 69,112,M,Black/African American,Not Span/Hispanic,11,Emergency,Home or Self Care,2020,RSP002,PNEUMONIA (EXCEPT THAT CAUSED BY TUBERCULOSIS),ADM015,ADMINISTRATION OF ANTIBIOTICS,139,OTHER PNEUMONIA,04,DISEASES AND DISORDERS OF THE RESPIRATORY SYSTEM,3,Major,Moderate,Medical,Medicaid,,,,,Y,75544.27,43444.3
New York City,Manhattan,7002001,001438,Bellevue Hospital Center,30 to 49,100,M,Black/African American,Not Span/Hispanic,1,Emergency,Left Against Medical Advice,2020,RSP002,PNEUMONIA (EXCEPT THAT CAUSED BY TUBERCULOSIS),IMG006,COMPUTERIZED TOMOGRAPHY (CT) WITH CONTRAST,139,OTHER PNEUMONIA,04,DISEASES AND DISORDERS OF THE RESPIRATORY SYSTEM,1,Minor,Minor,Medical,Medicaid,,,,,Y,12764.27,7340.53
New York City,Manhattan,7002001,001438,Bellevue Hospital Center,30 to 49,100,M,Black/African American,Not Span/Hispanic,1,Emergency,Left Against Medical Advice,2020,RSP002,PNEUMONIA (EXCEPT THAT CAUSED BY TUBERCULOSIS),ADM015,ADMINISTRATION OF ANTIBIOTICS,139,OTHER PNEUMONIA,04,DISEASES AND DISORDERS OF THE RESPIRATORY SYSTEM,1,Minor,Minor,Medical,Medicaid,,,,,Y,8255.55,4747.63
New York City,Manhattan,7002001,001438,Bellevue Hospital Center,70 or Older,112,F,Other Race,Spanish/Hispanic,2,Emergency,Home or Self Care,2020,RSP002,PNEUMONIA (EXCEPT THAT CAUSED BY TUBERCULOSIS),ADM015,ADMINISTRATION OF ANTIBIOTICS,139,OTHER PNEUMONIA,04,DISEASES AND DISORDERS OF THE RESPIRATORY SYSTEM,3,Major,Major,Medical,Medicare,Medicaid,,,,Y,16376.96,9418.13
New York City,Manhattan,7002001,001438,Bellevue Hospital Center,30 to 49,112,M,White,Not Span/Hispanic,2,Emergency,Home or Self Care,2020,RSP002,PNEUMONIA (EXCEPT THAT CAUSED BY TUBERCULOSIS),IMG009,PLAIN RADIOGRAPHY,139,OTHER PNEUMONIA,04,DISEASES AND DISORDERS OF THE RESPIRATORY SYSTEM,2,Moderate,Minor,Medical,Medicaid,,,,,Y,15172.97,8725.73
New York City,Manhattan,7002001,001438,Bellevue Hospital Center,18 to 29,112,F,Other Race,Spanish/Hispanic,4,Emergency,Home or Self Care,2020,RSP002,PNEUMONIA (EXCEPT THAT CAUSED BY TUBERCULOSIS),ADM015,ADMINISTRATION OF ANTIBIOTICS,139,OTHER PNEUMONIA,04,DISEASES AND DISORDERS OF THE RESPIRATORY SYSTEM,1,Minor,Minor,Medical,Medicaid,,,,,Y,31193.24,17938.73
New York City,Manhattan,7002001,001438,Bellevue Hospital Center,50 to 69,100,M,White,Not Span/Hispanic,7,Emergency,Home or Self Care,2020,RSP003,INFLUENZA,ADM021,"ADMINISTRATION OF THERAPEUTIC SUBSTANCES, NEC",139,OTHER PNEUMONIA,04,DISEASES AND DISORDERS OF THE RESPIRATORY SYSTEM,2,Moderate,Moderate,Medical,Medicaid,,,,,Y,50373.84,28969.19
New York City,Manhattan,7002001,001438,Bellevue Hospital Center,50 to 69,104,M,Other Race,Spanish/Hispanic,39,Emergency,Home or Self Care,2020,RSP003,INFLUENZA,URN002,KIDNEY AND OTHER URINARY TRACT BIOPSY (NON-ENDOSCOPIC),139,OTHER PNEUMONIA,04,DISEASES AND DISORDERS OF THE RESPIRATORY SYSTEM,4,Extreme,Extreme,Medical,Medicaid,,,,,Y,316389.48,181950.53
New York City,Manhattan,7002001,001438,Bellevue Hospital Center,30 to 49,104,M,Other Race,Spanish/Hispanic,1,Emergency,Left Against Medical Advice,2020,RSP002,PNEUMONIA (EXCEPT THAT CAUSED BY TUBERCULOSIS),ADM015,ADMINISTRATION OF ANTIBIOTICS,139,OTHER PNEUMONIA,04,DISEASES AND DISORDERS OF THE RESPIRATORY SYSTEM,2,Moderate,Moderate,Medical,Medicaid,,,,,Y,11172.04,6424.86
New York City,Manhattan,7002001,001438,Bellevue Hospital Center,70 or Older,100,M,Other Race,Unknown,1,Emergency,Home or Self Care,2020,RSP002,PNEUMONIA (EXCEPT THAT CAUSED BY TUBERCULOSIS),ADM015,ADMINISTRATION OF ANTIBIOTICS,139,OTHER PNEUMONIA,04,DISEASES AND DISORDERS OF THE RESPIRATORY SYSTEM,3,Major,Moderate,Medical,Medicare,Medicaid,,,,Y,9907.12,5697.43
New York City,Manhattan,7002001,001438,Bellevue Hospital Center,50 to 69,100,M,White,Not Span/Hispanic,4,Emergency,Home or Self Care,2020,RSP003,INFLUENZA,ADM015,ADMINISTRATION OF ANTIBIOTICS,139,OTHER PNEUMONIA,04,DISEASES AND DISORDERS OF THE RESPIRATORY SYSTEM,2,Moderate,Moderate,Medical,Medicaid,,,,,Y,32227.54,18533.54
New York City,Manhattan,7002001,001438,Bellevue Hospital Center,30 to 49,100,F,Black/African American,Unknown,3,Emergency,Home or Self Care,2020,RSP002,PNEUMONIA (EXCEPT THAT CAUSED BY TUBERCULOSIS),ADM015,ADMINISTRATION OF ANTIBIOTICS,139,OTHER PNEUMONIA,04,DISEASES AND DISORDERS OF THE RESPIRATORY SYSTEM,1,Minor,Minor,Medical,Medicaid,,,,,Y,23301.75,13400.46
New York City,Manhattan,7002001,001438,Bellevue Hospital Center,0 to 17,113,M,Other Race,Spanish/Hispanic,3,Emergency,Home or Self Care,2020,RSP002,PNEUMONIA (EXCEPT THAT CAUSED BY TUBERCULOSIS),ADM021,"ADMINISTRATION OF THERAPEUTIC SUBSTANCES, NEC",139,OTHER PNEUMONIA,04,DISEASES AND DISORDERS OF THE RESPIRATORY SYSTEM,3,Major,Minor,Medical,Medicaid,,,,,Y,23406.3,13460.59
New York City,Manhattan,7002001,001438,Bellevue Hospital Center,50 to 69,112,M,Black/African American,Unknown,10,Emergency,Home or Self Care,2020,RSP002,PNEUMONIA (EXCEPT THAT CAUSED BY TUBERCULOSIS),RES001,BRONCHOSCOPY (DIAGNOSTIC),139,OTHER PNEUMONIA,04,DISEASES AND DISORDERS OF THE RESPIRATORY SYSTEM,2,Moderate,Moderate,Medical,Medicaid,,,,,Y,91898.19,52849.18
New York City,Manhattan,7002001,001438,Bellevue Hospital Center,50 to 69,100,M,White,Spanish/Hispanic,3,Emergency,Home or Self Care,2020,RSP002,PNEUMONIA (EXCEPT THAT CAUSED BY TUBERCULOSIS),IMG009,PLAIN RADIOGRAPHY,139,OTHER PNEUMONIA,04,DISEASES AND DISORDERS OF THE RESPIRATORY SYSTEM,2,Moderate,Moderate,Medical,Medicaid,,,,,Y,21758.68,12513.07
New York City,Manhattan,7002001,001438,Bellevue Hospital Center,50 to 69,113,M,Black/African American,Not Span/Hispanic,5,Emergency,Home or Self Care,2020,RSP003,INFLUENZA,ADM021,"ADMINISTRATION OF THERAPEUTIC SUBSTANCES, NEC",139,OTHER PNEUMONIA,04,DISEASES AND DISORDERS OF THE RESPIRATORY SYSTEM,2,Moderate,Moderate,Medical,Medicaid,,,,,Y,37825.48,21752.83
New York City,Manhattan,7002001,001438,Bellevue Hospital Center,70 or Older,100,F,Other Race,Spanish/Hispanic,3,Emergency,Home w/ Home Health Services,2020,RSP002,PNEUMONIA (EXCEPT THAT CAUSED BY TUBERCULOSIS),IMG006,COMPUTERIZED TOMOGRAPHY (CT) WITH CONTRAST,139,OTHER PNEUMONIA,04,DISEASES AND DISORDERS OF THE RESPIRATORY SYSTEM,2,Moderate,Major,Medical,Medicare,Medicaid,,,,Y,26419.98,15193.71
New York City,Manhattan,7002001,001438,Bellevue Hospital Center,18 to 29,112,F,Other Race,Spanish/Hispanic,4,Emergency,Home or Self Care,2020,RSP002,PNEUMONIA (EXCEPT THAT CAUSED BY TUBERCULOSIS),RES001,BRONCHOSCOPY (DIAGNOSTIC),139,OTHER PNEUMONIA,04,DISEASES AND DISORDERS OF THE RESPIRATORY SYSTEM,1,Minor,Minor,Medical,Medicaid,,,,,Y,36559.34,21024.69
New York City,Manhattan,7002001,001438,Bellevue Hospital Center,50 to 69,112,M,Other Race,Spanish/Hispanic,4,Emergency,Home or Self Care,2020,RSP002,PNEUMONIA (EXCEPT THAT CAUSED BY TUBERCULOSIS),ADM015,ADMINISTRATION OF ANTIBIOTICS,139,OTHER PNEUMONIA,04,DISEASES AND DISORDERS OF THE RESPIRATORY SYSTEM,2,Moderate,Major,Medical,Medicaid,,,,,Y,27344.07,15725.14
New York City,Manhattan,7002001,001438,Bellevue Hospital Center,70 or Older,113,M,Other Race,Unknown,8,Emergency,Expired,2020,RSP002,PNEUMONIA (EXCEPT THAT CAUSED BY TUBERCULOSIS),ADM021,"ADMINISTRATION OF THERAPEUTIC SUBSTANCES, NEC",139,OTHER PNEUMONIA,04,DISEASES AND DISORDERS OF THE RESPIRATORY SYSTEM,3,Major,Major,Medical,Medicare,Medicaid,,,,Y,58016.06,33364.11
New York City,Manhattan,7002001,001438,Bellevue Hospital Center,70 or Older,100,M,Black/African American,Not Span/Hispanic,14,Emergency,Skilled Nursing Home,2020,RSP002,PNEUMONIA (EXCEPT THAT CAUSED BY TUBERCULOSIS),URN006,BLADDER CATHETERIZATION AND DRAINAGE,139,OTHER PNEUMONIA,04,DISEASES AND DISORDERS OF THE RESPIRATORY SYSTEM,3,Major,Major,Medical,Medicare,,,,,Y,99073.36,56975.5
New York City,Manhattan,7002001,001438,Bellevue Hospital Center,30 to 49,100,M,Other Race,Unknown,1,Emergency,Home or Self Care,2020,RSP002,PNEUMONIA (EXCEPT THAT CAUSED BY TUBERCULOSIS),,,139,OTHER PNEUMONIA,04,DISEASES AND DISORDERS OF THE RESPIRATORY SYSTEM,1,Minor,Minor,Medical,Medicaid,,,,,Y,8849.92,5089.45
New York City,Manhattan,7002001,001438,Bellevue Hospital Center,30 to 49,100,M,Other Race,Not Span/Hispanic,5,Emergency,Home or Self Care,2020,RSP002,PNEUMONIA (EXCEPT THAT CAUSED BY TUBERCULOSIS),,,139,OTHER PNEUMONIA,04,DISEASES AND DISORDERS OF THE RESPIRATORY SYSTEM,1,Minor,Minor,Medical,Medicaid,,,,,Y,35409.02,20363.16
New York City,Manhattan,7002001,001438,Bellevue Hospital Center,30 to 49,113,F,Other Race,Spanish/Hispanic,6,Emergency,Home or Self Care,2020,RSP002,PNEUMONIA (EXCEPT THAT CAUSED BY TUBERCULOSIS),ADM015,ADMINISTRATION OF ANTIBIOTICS,139,OTHER PNEUMONIA,04,DISEASES AND DISORDERS OF THE RESPIRATORY SYSTEM,2,Moderate,Minor,Medical,Medicaid,,,,,Y,41913.79,24103.95
New York City,Manhattan,7002001,001438,Bellevue Hospital Center,50 to 69,100,M,Other Race,Spanish/Hispanic,2,Emergency,Home or Self Care,2020,RSP002,PNEUMONIA (EXCEPT THAT CAUSED BY TUBERCULOSIS),ADM021,"ADMINISTRATION OF THERAPEUTIC SUBSTANCES, NEC",139,OTHER PNEUMONIA,04,DISEASES AND DISORDERS OF THE RESPIRATORY SYSTEM,1,Minor,Minor,Medical,Medicaid,,,,,Y,14970.63,8609.37
New York City,Manhattan,7002001,001438,Bellevue Hospital Center,50 to 69,114,M,Black/African American,Not Span/Hispanic,2,Emergency,Home or Self Care,2020,RSP002,PNEUMONIA (EXCEPT THAT CAUSED BY TUBERCULOSIS),IMG009,PLAIN RADIOGRAPHY,139,OTHER PNEUMONIA,04,DISEASES AND DISORDERS OF THE RESPIRATORY SYSTEM,1,Minor,Minor,Medical,Medicare,,,,,Y,16042.5,9225.79
New York City,Manhattan,7002001,001438,Bellevue Hospital Center,50 to 69,100,M,Black/African American,Not Span/Hispanic,5,Emergency,Left Against Medical Advice,2020,RSP002,PNEUMONIA (EXCEPT THAT CAUSED BY TUBERCULOSIS),ADM021,"ADMINISTRATION OF THERAPEUTIC SUBSTANCES, NEC",139,OTHER PNEUMONIA,04,DISEASES AND DISORDERS OF THE RESPIRATORY SYSTEM,1,Minor,Minor,Medical,Medicaid,,,,,Y,38184.76,21959.44
New York City,Manhattan,7002001,001438,Bellevue Hospital Center,18 to 29,113,F,Other Race,Spanish/Hispanic,1,Emergency,Home or Self Care,2020,RSP002,PNEUMONIA (EXCEPT THAT CAUSED BY TUBERCULOSIS),ADM015,ADMINISTRATION OF ANTIBIOTICS,139,OTHER PNEUMONIA,04,DISEASES AND DISORDERS OF THE RESPIRATORY SYSTEM,1,Minor,Minor,Medical,Medicaid,,,,,Y,10179.22,5853.91
New York City,Manhattan,7002001,001438,Bellevue Hospital Center,50 to 69,100,M,Black/African American,Not Span/Hispanic,4,Emergency,Home or Self Care,2020,RSP002,PNEUMONIA (EXCEPT THAT CAUSED BY TUBERCULOSIS),ADM015,ADMINISTRATION OF ANTIBIOTICS,139,OTHER PNEUMONIA,04,DISEASES AND DISORDERS OF THE RESPIRATORY SYSTEM,1,Minor,Minor,Medical,Medicaid,,,,,Y,26648.27,15324.99
New York City,Manhattan,7002001,001438,Bellevue Hospital Center,30 to 49,104,M,Black/African American,Not Span/Hispanic,5,Emergency,Home or Self Care,2020,RSP002,PNEUMONIA (EXCEPT THAT CAUSED BY TUBERCULOSIS),ADM021,"ADMINISTRATION OF THERAPEUTIC SUBSTANCES, NEC",139,OTHER PNEUMONIA,04,DISEASES AND DISORDERS OF THE RESPIRATORY SYSTEM,1,Minor,Minor,Medical,Medicaid,,,,,Y,34731.26,19973.39
New York City,Manhattan,7002001,001438,Bellevue Hospital Center,30 to 49,104,M,Other Race,Spanish/Hispanic,5,Emergency,Court/Law Enforcement,2020,RSP002,PNEUMONIA (EXCEPT THAT CAUSED BY TUBERCULOSIS),,,139,OTHER PNEUMONIA,04,DISEASES AND DISORDERS OF THE RESPIRATORY SYSTEM,2,Moderate,Minor,Medical,Medicaid,,,,,Y,33330.77,19167.99
New York City,Manhattan,7002001,001438,Bellevue Hospital Center,30 to 49,114,F,Other Race,Spanish/Hispanic,3,Emergency,Home or Self Care,2020,RSP002,PNEUMONIA (EXCEPT THAT CAUSED BY TUBERCULOSIS),,,139,OTHER PNEUMONIA,04,DISEASES AND DISORDERS OF THE RESPIRATORY SYSTEM,1,Minor,Minor,Medical,Medicaid,,,,,Y,21007.61,12081.14
New York City,Manhattan,7002001,001438,Bellevue Hospital Center,70 or Older,100,F,Other Race,Not Span/Hispanic,11,Emergency,Expired,2020,RSP002,PNEUMONIA (EXCEPT THAT CAUSED BY TUBERCULOSIS),IMG007,COMPUTERIZED TOMOGRAPHY (CT) WITHOUT CONTRAST,139,OTHER PNEUMONIA,04,DISEASES AND DISORDERS OF THE RESPIRATORY SYSTEM,2,Moderate,Major,Medical,Medicare,Medicaid,,,,Y,92840.87,53391.3
New York City,Manhattan,7002001,001438,Bellevue Hospital Center,30 to 49,113,F,Other Race,Spanish/Hispanic,2,Urgent,Home or Self Care,2020,RSP002,PNEUMONIA (EXCEPT THAT CAUSED BY TUBERCULOSIS),ADM021,"ADMINISTRATION OF THERAPEUTIC SUBSTANCES, NEC",139,OTHER PNEUMONIA,04,DISEASES AND DISORDERS OF THE RESPIRATORY SYSTEM,1,Minor,Minor,Medical,Medicaid,,,,,N,12961.63,7454.03
New York City,Manhattan,7002001,001438,Bellevue Hospital Center,30 to 49,104,M,Other Race,Spanish/Hispanic,3,Emergency,Home or Self Care,2020,RSP002,PNEUMONIA (EXCEPT THAT CAUSED BY TUBERCULOSIS),,,139,OTHER PNEUMONIA,04,DISEASES AND DISORDERS OF THE RESPIRATORY SYSTEM,1,Minor,Minor,Medical,Medicaid,,,,,Y,20846.24,11988.34
New York City,Manhattan,7002001,001438,Bellevue Hospital Center,30 to 49,100,M,White,Not Span/Hispanic,4,Emergency,Home or Self Care,2020,RSP002,PNEUMONIA (EXCEPT THAT CAUSED BY TUBERCULOSIS),CNS002,LUMBAR PUNCTURE,139,OTHER PNEUMONIA,04,DISEASES AND DISORDERS OF THE RESPIRATORY SYSTEM,4,Extreme,Major,Medical,Medicare,Medicaid,,,,Y,33024.58,18991.91
New York City,Manhattan,7002001,001438,Bellevue Hospital Center,30 to 49,100,U,Other Race,Spanish/Hispanic,4,Emergency,Home or Self Care,2020,RSP002,PNEUMONIA (EXCEPT THAT CAUSED BY TUBERCULOSIS),ADM021,"ADMINISTRATION OF THERAPEUTIC SUBSTANCES, NEC",139,OTHER PNEUMONIA,04,DISEASES AND DISORDERS OF THE RESPIRATORY SYSTEM,1,Minor,Minor,Medical,Medicaid,,,,,Y,28313.9,16282.87
New York City,Manhattan,7002001,001438,Bellevue Hospital Center,30 to 49,112,M,Other Race,Spanish/Hispanic,2,Emergency,Home or Self Care,2020,RSP002,PNEUMONIA (EXCEPT THAT CAUSED BY TUBERCULOSIS),ADM007,INTRAVENOUS INDUCTION OF LABOR,139,OTHER PNEUMONIA,04,DISEASES AND DISORDERS OF THE RESPIRATORY SYSTEM,1,Minor,Minor,Medical,Medicaid,,,,,Y,14533.48,8357.97
New York City,Manhattan,7002001,001438,Bellevue Hospital Center,30 to 49,113,F,Other Race,Spanish/Hispanic,1,Emergency,Home or Self Care,2020,RSP002,PNEUMONIA (EXCEPT THAT CAUSED BY TUBERCULOSIS),ADM015,ADMINISTRATION OF ANTIBIOTICS,139,OTHER PNEUMONIA,04,DISEASES AND DISORDERS OF THE RESPIRATORY SYSTEM,1,Minor,Minor,Medical,Medicaid,,,,,Y,8306.48,4776.92
New York City,Manhattan,7002001,001438,Bellevue Hospital Center,70 or Older,112,M,Black/African American,Unknown,1,Urgent,Left Against Medical Advice,2020,RSP002,PNEUMONIA (EXCEPT THAT CAUSED BY TUBERCULOSIS),IMG009,PLAIN RADIOGRAPHY,139,OTHER PNEUMONIA,04,DISEASES AND DISORDERS OF THE RESPIRATORY SYSTEM,1,Minor,Minor,Medical,Medicare,Medicaid,,,,Y,9451.61,5435.47
New York City,Manhattan,7002001,001438,Bellevue Hospital Center,70 or Older,112,M,Other Race,Spanish/Hispanic,5,Urgent,Home or Self Care,2020,RSP002,PNEUMONIA (EXCEPT THAT CAUSED BY TUBERCULOSIS),ADM015,ADMINISTRATION OF ANTIBIOTICS,139,OTHER PNEUMONIA,04,DISEASES AND DISORDERS OF THE RESPIRATORY SYSTEM,2,Moderate,Moderate,Medical,Medicare,Medicare,,,,N,31703.1,18231.95
New York City,Manhattan,7002001,001438,Bellevue Hospital Center,50 to 69,112,F,White,Not Span/Hispanic,3,Emergency,Home or Self Care,2020,RSP002,PNEUMONIA (EXCEPT THAT CAUSED BY TUBERCULOSIS),ADM021,"ADMINISTRATION OF THERAPEUTIC SUBSTANCES, NEC",139,OTHER PNEUMONIA,04,DISEASES AND DISORDERS OF THE RESPIRATORY SYSTEM,1,Minor,Minor,Medical,Medicaid,,,,,Y,24651.28,14176.56
New York City,Manhattan,7002001,001438,Bellevue Hospital Center,50 to 69,100,M,Other Race,Spanish/Hispanic,1,Emergency,Home or Self Care,2020,RSP002,PNEUMONIA (EXCEPT THAT CAUSED BY TUBERCULOSIS),,,139,OTHER PNEUMONIA,04,DISEASES AND DISORDERS OF THE RESPIRATORY SYSTEM,1,Minor,Minor,Medical,Medicaid,,,,,Y,8393.9,4827.2
New York City,Manhattan,7002001,001438,Bellevue Hospital Center,30 to 49,112,M,Other Race,Unknown,2,Emergency,Home or Self Care,2020,RSP002,PNEUMONIA (EXCEPT THAT CAUSED BY TUBERCULOSIS),ADM015,ADMINISTRATION OF ANTIBIOTICS,139,OTHER PNEUMONIA,04,DISEASES AND DISORDERS OF THE RESPIRATORY SYSTEM,1,Minor,Minor,Medical,Self-Pay,,,,,Y,15017.15,8636.12
New York City,Manhattan,7002001,001438,Bellevue Hospital Center,50 to 69,112,M,Other Race,Spanish/Hispanic,3,Emergency,Home or Self Care,2020,RSP002,PNEUMONIA (EXCEPT THAT CAUSED BY TUBERCULOSIS),ADM021,"ADMINISTRATION OF THERAPEUTIC SUBSTANCES, NEC",139,OTHER PNEUMONIA,04,DISEASES AND DISORDERS OF THE RESPIRATORY SYSTEM,2,Moderate,Moderate,Medical,Medicaid,,,,,Y,22020.18,12663.45
New York City,Manhattan,7002001,001438,Bellevue Hospital Center,50 to 69,113,F,Other Race,Spanish/Hispanic,1,Emergency,Home or Self Care,2020,RSP002,PNEUMONIA (EXCEPT THAT CAUSED BY TUBERCULOSIS),IMG009,PLAIN RADIOGRAPHY,139,OTHER PNEUMONIA,04,DISEASES AND DISORDERS OF THE RESPIRATORY SYSTEM,1,Minor,Minor,Medical,Medicaid,,,,,Y,8375.47,4816.6
New York City,Manhattan,7002001,001438,Bellevue Hospital Center,50 to 69,100,M,Black/African American,Not Span/Hispanic,7,Emergency,Home or Self Care,2020,RSP003,INFLUENZA,IMG009,PLAIN RADIOGRAPHY,139,OTHER PNEUMONIA,04,DISEASES AND DISORDERS OF THE RESPIRATORY SYSTEM,1,Minor,Moderate,Medical,Medicare,Medicaid,,,,Y,48633.4,27968.29
New York City,Manhattan,7002001,001438,Bellevue Hospital Center,30 to 49,104,F,Other Race,Spanish/Hispanic,3,Emergency,Home or Self Care,2020,RSP002,PNEUMONIA (EXCEPT THAT CAUSED BY TUBERCULOSIS),,,139,OTHER PNEUMONIA,04,DISEASES AND DISORDERS OF THE RESPIRATORY SYSTEM,2,Moderate,Minor,Medical,Medicaid,,,,,Y,22774.02,13096.97
New York City,Manhattan,7002001,001438,Bellevue Hospital Center,30 to 49,113,M,Other Race,Spanish/Hispanic,2,Emergency,Home or Self Care,2020,RSP002,PNEUMONIA (EXCEPT THAT CAUSED BY TUBERCULOSIS),,,139,OTHER PNEUMONIA,04,DISEASES AND DISORDERS OF THE RESPIRATORY SYSTEM,1,Minor,Minor,Medical,Medicaid,,,,,Y,16868.55,9700.83
New York City,Manhattan,7002001,001438,Bellevue Hospital Center,30 to 49,113,M,Other Race,Spanish/Hispanic,3,Emergency,Home or Self Care,2020,RSP002,PNEUMONIA (EXCEPT THAT CAUSED BY TUBERCULOSIS),ADM015,ADMINISTRATION OF ANTIBIOTICS,139,OTHER PNEUMONIA,04,DISEASES AND DISORDERS OF THE RESPIRATORY SYSTEM,1,Minor,Minor,Medical,Medicaid,,,,,Y,24223.07,13930.3
New York City,Manhattan,7002001,001438,Bellevue Hospital Center,50 to 69,112,M,Other Race,Spanish/Hispanic,13,Emergency,Home or Self Care,2020,RSP002,PNEUMONIA (EXCEPT THAT CAUSED BY TUBERCULOSIS),ADM021,"ADMINISTRATION OF THERAPEUTIC SUBSTANCES, NEC",139,OTHER PNEUMONIA,04,DISEASES AND DISORDERS OF THE RESPIRATORY SYSTEM,3,Major,Major,Medical,Medicaid,,,,,Y,91929.74,52867.32
New York City,Manhattan,7002001,001438,Bellevue Hospital Center,50 to 69,100,M,Other Race,Unknown,2,Emergency,Home or Self Care,2020,RSP002,PNEUMONIA (EXCEPT THAT CAUSED BY TUBERCULOSIS),IMG009,PLAIN RADIOGRAPHY,139,OTHER PNEUMONIA,04,DISEASES AND DISORDERS OF THE RESPIRATORY SYSTEM,1,Minor,Minor,Medical,Medicare,Medicaid,,,,Y,14300.53,8224.01
New York City,Manhattan,7002001,001438,Bellevue Hospital Center,30 to 49,111,M,Other Race,Spanish/Hispanic,4,Emergency,Home or Self Care,2020,RSP002,PNEUMONIA (EXCEPT THAT CAUSED BY TUBERCULOSIS),,,139,OTHER PNEUMONIA,04,DISEASES AND DISORDERS OF THE RESPIRATORY SYSTEM,2,Moderate,Moderate,Medical,Medicaid,,,,,Y,29718.91,17090.87